%YAML 1.1
%TAG !u! tag:unity3d.com,2011:
--- !u!162 &1
EditorUserSettings:
  m_ObjectHideFlags: 0
  serializedVersion: 4
  m_ConfigSettings:
    RecentlyUsedScenePath-0:
      value: 22424703114646730c1e003b5f0b5e001a0e58220d180f7f1e281023eee52777d2e638fde83d2d3d290aa06a44734112f3100c4bc6031318180dee413cfe0a1621cd01d613cb0c52de1715dad4
      flags: 0
    RecentlyUsedScenePath-1:
      value: 22424703114646730c1e003b5f0b5e001a0e58220d180f7f1e281023eee52777d2e638fde83d2d3d290aa0694473410cfa0b190ee54b3a03081df40d02b0231b10d51dd62ac0060fc21a0f80d813d8f7cc
      flags: 0
    RecentlyUsedScenePath-2:
      value: 22424703114646730c1e003b5f0b5e001a0e58220d180f7f1e281023eee52777d2e638fde83d2d3d290aa06844734108f306054bc6031318180dee4126fe1c1f21cd01d613cb0c52de1715dad4
      flags: 0
    RecentlyUsedScenePath-3:
      value: 22424703114646730c1e003b5f0b5e001a0e58220d180f7f1e281023eee52777d2e638fde83d2d3d290aa06e44734117f7060504b63c0b071d41d50b1df31f2410c9148b0fc61608d2
      flags: 0
    RecentlyUsedScenePath-4:
      value: 22424703114646730c1e003b5f0b5e001a0e58220d180f7f1e281023eee52777d2e638fde83d2d3d290aa06f44734117f7060504b6290b071d41d50b1df31f3110c9148b0fc61608d2
      flags: 0
    RecentlyUsedScenePath-5:
      value: 22424703114646730c1e003b5f0b5e001a0e58220d180f7f1e281023eee52777d2e638fde83d2d3d290aa06d4473411bf71c0008f34b390e051bed4135fa061a12c02bc00edd0f52de1715dad4
      flags: 0
    RecentlyUsedScenePath-6:
      value: 22424703114646730c1e003b502b7e203f582b2b21382a353e662d32ecf43b3ff0e626e1a86e7f717935ee30087e3137eb190008e5443d0a1d02cd0608ec1910028b0dcb13dc06
      flags: 0
    RecentlyUsedScenePath-7:
      value: 22424703114646730c1e003b502b7e203f582b2b21382a353e662d32ecf43b3ff0e626e1a8687f71792aea3008314108f3060544de0e06071e39fc021db1051d18d101
      flags: 0
    RecentlyUsedScenePath-8:
      value: 22424703114646730c1e003b502b7e203f582b2b21382a353e662d32ecf43b3ff0e626e1a86b7f717926ea2a0d3d047fc10f1d1ee6442e0e0707fe0b22fa0406018b0dcb13dc06
      flags: 0
    vcSharedLogLevel:
      value: 0d5e400f0650
      flags: 0
  m_VCAutomaticAdd: 1
  m_VCDebugCom: 0
  m_VCDebugCmd: 0
  m_VCDebugOut: 0
  m_SemanticMergeMode: 2
  m_VCShowFailedCheckout: 1
  m_VCOverwriteFailedCheckoutAssets: 1
  m_VCProjectOverlayIcons: 1
  m_VCHierarchyOverlayIcons: 1
  m_VCOtherOverlayIcons: 1
  m_VCAllowAsyncUpdate: 1
