430491389.7510028
5.012070000000000000e+07 6.783599999999999852e+00 5.958999999999999631e+00
6.042000000000000000e+06 6.656100000000000350e+00 5.506700000000000372e+00
1.207522460000000000e+10 8.497099999999999653e+00 7.906399999999999650e+00
8.674315400000000000e+09 8.222500000000000142e+00 7.599099999999999966e+00
2.013737000000000000e+08 9.617599999999999483e+00 6.891899999999999693e+00
2.922340000000000000e+07 6.468600000000000350e+00 8.662300000000000111e+00
6.065115200000000000e+09 7.972599999999999909e+00 7.785700000000000287e+00
2.059435500000000000e+09 6.368500000000000050e+00 7.531299999999999883e+00
1.193832000000000000e+08 6.467100000000000293e+00 8.626699999999999591e+00
6.406000000000000000e+06 6.573000000000000398e+00 5.712200000000000166e+00
5.655400000000000000e+06 6.544299999999999784e+00 5.817199999999999704e+00
5.917500000000000000e+06 7.019199999999999662e+00 5.722900000000000098e+00
3.236090100000000000e+09 7.583199999999999719e+00 7.503700000000000259e+00
6.352100000000000000e+06 6.655700000000000394e+00 5.700300000000000367e+00
6.135420000000000000e+07 6.930200000000000138e+00 6.087399999999999700e+00
1.189836230000000000e+10 5.853100000000000414e+00 7.691300000000000026e+00
9.573620000000000000e+07 6.445500000000000007e+00 5.707600000000000229e+00
2.351458300000000000e+09 8.246199999999999974e+00 7.514300000000000423e+00
1.898160000000000000e+07 6.448500000000000121e+00 7.807599999999999874e+00
2.383540000000000000e+07 8.906499999999999417e+00 6.745400000000000063e+00
7.070953000000000000e+08 8.096600000000000463e+00 7.704799999999999649e+00
9.297765600000000000e+09 8.450799999999999201e+00 7.739099999999999646e+00
6.857900000000000000e+06 6.466300000000000381e+00 5.869200000000000195e+00
2.502040000000000000e+08 8.691100000000000492e+00 7.622600000000000264e+00
7.833049300000000000e+09 1.793499999999999872e+01 6.621599999999999930e+00
1.111798100000000000e+09 8.273099999999999454e+00 7.518299999999999983e+00
4.589957500000000000e+09 7.986500000000000377e+00 7.412200000000000344e+00
2.956192000000000000e+08 8.889200000000000657e+00 6.820400000000000240e+00
5.189400900000000000e+09 6.174100000000000144e+00 8.202999999999999403e+00
8.821560000000000000e+07 1.045270000000000010e+01 7.269499999999999851e+00
4.207610000000000000e+07 6.466599999999999682e+00 8.186299999999999244e+00
2.656420000000000000e+07 6.696500000000000341e+00 8.253500000000000725e+00
2.080030000000000000e+07 6.839100000000000179e+00 8.551899999999999835e+00
2.127520000000000000e+07 6.647400000000000198e+00 8.569399999999999906e+00
2.629106200000000000e+09 9.444900000000000517e+00 5.781799999999999606e+00
6.320010000000000000e+07 6.601899999999999658e+00 5.731200000000000294e+00
1.238601860000000000e+10 1.482269999999999932e+01 6.553899999999999615e+00
1.045004880000000000e+10 8.354900000000000659e+00 8.225799999999999557e+00
