2.600000000000000000e+01 0.000000000000000000e+00
2.573737373737373701e+01 9.406913212710083128e-07
2.547474747474747403e+01 1.203967221606645028e-06
2.521212121212121104e+01 1.453187396284643657e-06
2.494949494949494806e+01 1.754821497746821608e-06
2.468686868686868507e+01 2.021840953608041828e-06
2.442424242424242564e+01 2.015711805340123087e-06
2.416161616161616266e+01 1.982382214472654898e-06
2.389898989898989967e+01 1.956895095553760020e-06
2.363636363636363669e+01 2.222820884306834375e-06
2.337373737373737370e+01 2.788589377567977282e-06
2.311111111111111072e+01 3.507170125415241817e-06
2.284848484848484773e+01 4.240774477189788502e-06
2.258585858585858475e+01 4.858535210214478671e-06
2.232323232323232176e+01 5.553294204930887080e-06
2.206060606060605878e+01 6.875682984545979844e-06
2.179797979797979934e+01 9.302631382085089758e-06
2.153535353535353636e+01 1.263794903276296550e-05
2.127272727272727337e+01 1.598726386448965324e-05
2.101010101010101039e+01 1.935336023798265196e-05
2.074747474747474740e+01 2.319773627709554450e-05
2.048484848484848442e+01 2.689406430665268509e-05
2.022222222222222143e+01 3.167704150757639662e-05
1.995959595959595845e+01 4.108549097547285349e-05
1.969696969696969546e+01 5.483317207276019675e-05
1.943434343434343248e+01 6.496043115725275130e-05
1.917171717171716949e+01 7.174869434680736398e-05
1.890909090909090651e+01 6.387885361254420251e-05
1.864646464646464352e+01 5.146361244838470962e-05
1.838383838383838409e+01 6.534499453996216092e-05
1.812121212121212110e+01 9.048804955183625852e-05
1.785858585858585812e+01 6.614288204570877505e-05
1.759595959595959513e+01 5.051639826686391428e-05
1.733333333333333215e+01 6.191730206275172072e-05
1.707070707070706916e+01 7.305762561325114741e-05
1.680808080808080973e+01 8.248701706067517706e-05
1.654545454545454675e+01 1.026331619035091589e-04
1.628282828282828376e+01 1.330895816037612716e-04
1.602020202020202078e+01 1.639033195262518041e-04
1.575757575757575601e+01 1.727252416824442505e-04
1.549494949494949481e+01 1.674456482394435760e-04
1.523232323232323182e+01 1.763785415179397128e-04
1.496969696969696884e+01 2.028369690064621411e-04
1.470707070707070585e+01 2.447085681476021549e-04
1.444444444444444287e+01 2.608356560494474118e-04
1.418181818181817988e+01 2.651088135162060701e-04
1.391919191919191867e+01 3.305625961902553781e-04
1.365656565656565569e+01 4.063582034242997588e-04
1.339393939393939270e+01 4.447080898783003708e-04
1.313131313131312972e+01 4.435636126554057452e-04
1.286868686868686673e+01 4.607798508102603800e-04
1.260606060606060552e+01 4.781143506803869881e-04
1.234343434343434254e+01 4.620564481717180216e-04
1.208080808080807955e+01 4.686886901286941372e-04
1.181818181818181657e+01 4.855541641120102430e-04
1.155555555555555358e+01 5.550339892826291468e-04
1.129292929292929060e+01 5.978577639701915030e-04
1.103030303030302939e+01 5.493774574854028408e-04
1.076767676767676640e+01 5.868465330322596325e-04
1.050505050505050342e+01 5.797634559470123084e-04
1.024242424242424043e+01 5.644012167930281560e-04
9.979797979797979224e+00 5.421434187976762560e-04
9.717171717171716239e+00 5.792330671293176910e-04
9.454545454545453254e+00 6.842475855256285487e-04
9.191919191919190268e+00 6.955940111206835924e-04
8.929292929292927283e+00 7.134635684784645070e-04
8.666666666666664298e+00 7.293970169515699318e-04
8.404040404040401313e+00 7.472987582623031796e-04
8.141414141414138328e+00 7.684415662857346915e-04
7.878787878787875343e+00 7.660881036462000764e-04
7.616161616161615910e+00 7.401798819499065410e-04
7.353535353535352925e+00 0.000000000000000000e+00
7.090909090909089940e+00 0.000000000000000000e+00
6.828282828282826955e+00 0.000000000000000000e+00
6.565656565656563970e+00 0.000000000000000000e+00
6.303030303030300985e+00 0.000000000000000000e+00
6.040404040404038000e+00 0.000000000000000000e+00
5.777777777777775015e+00 0.000000000000000000e+00
5.515151515151512029e+00 0.000000000000000000e+00
5.252525252525249044e+00 0.000000000000000000e+00
4.989898989898989612e+00 0.000000000000000000e+00
4.727272727272726627e+00 0.000000000000000000e+00
4.464646464646463642e+00 0.000000000000000000e+00
4.202020202020200657e+00 0.000000000000000000e+00
3.939393939393937671e+00 0.000000000000000000e+00
3.676767676767674686e+00 0.000000000000000000e+00
3.414141414141411701e+00 0.000000000000000000e+00
3.151515151515148716e+00 0.000000000000000000e+00
2.888888888888885731e+00 0.000000000000000000e+00
2.626262626262622746e+00 0.000000000000000000e+00
2.363636363636359761e+00 0.000000000000000000e+00
2.101010101010100328e+00 0.000000000000000000e+00
1.838383838383837343e+00 0.000000000000000000e+00
1.575757575757574358e+00 0.000000000000000000e+00
1.313131313131311373e+00 0.000000000000000000e+00
1.050505050505048388e+00 0.000000000000000000e+00
7.878787878787854027e-01 0.000000000000000000e+00
5.252525252525224175e-01 0.000000000000000000e+00
2.626262626262594324e-01 0.000000000000000000e+00
0.000000000000000000e+00 0.000000000000000000e+00
