4.000000000000000000e+01 0.000000000000000000e+00
3.959595959595959869e+01 0.000000000000000000e+00
3.919191919191919027e+01 0.000000000000000000e+00
3.878787878787878896e+01 0.000000000000000000e+00
3.838383838383838054e+01 0.000000000000000000e+00
3.797979797979797922e+01 0.000000000000000000e+00
3.757575757575757791e+01 0.000000000000000000e+00
3.717171717171716949e+01 0.000000000000000000e+00
3.676767676767676818e+01 0.000000000000000000e+00
3.636363636363636687e+01 0.000000000000000000e+00
3.595959595959595845e+01 0.000000000000000000e+00
3.555555555555555713e+01 0.000000000000000000e+00
3.515151515151514872e+01 0.000000000000000000e+00
3.474747474747474740e+01 0.000000000000000000e+00
3.434343434343434609e+01 0.000000000000000000e+00
3.393939393939393767e+01 0.000000000000000000e+00
3.353535353535353636e+01 0.000000000000000000e+00
3.313131313131313505e+01 0.000000000000000000e+00
3.272727272727272663e+01 0.000000000000000000e+00
3.232323232323232531e+01 0.000000000000000000e+00
3.191919191919191690e+01 0.000000000000000000e+00
3.151515151515151558e+01 0.000000000000000000e+00
3.111111111111111072e+01 0.000000000000000000e+00
3.070707070707070585e+01 9.953117405943370214e-07
3.030303030303030454e+01 1.320772573561691067e-05
2.989898989898989967e+01 1.772189692701654347e-05
2.949494949494949481e+01 9.337005761843742823e-06
2.909090909090909349e+01 5.451143983957214341e-06
2.868686868686868507e+01 4.363948499702904904e-06
2.828282828282828376e+01 1.554809391743512602e-05
2.787878787878787890e+01 2.551851458616001458e-05
2.747474747474747403e+01 2.832810300768878801e-05
2.707070707070707272e+01 3.919533585858574112e-05
2.666666666666666430e+01 5.620341666666668157e-05
2.626262626262626299e+01 4.409027065004886064e-05
2.585858585858585812e+01 4.871569436298456041e-05
2.545454545454545325e+01 7.775740175953017950e-05
2.505050505050505194e+01 9.679095820707028948e-05
2.464646464646464707e+01 1.276059021246947521e-04
2.424242424242424221e+01 1.775710710553805307e-04
2.383838383838383734e+01 1.833505615476798951e-04
2.343434343434343603e+01 1.958930014430013610e-04
2.303030303030303116e+01 2.152389113355778860e-04
2.262626262626262630e+01 2.269373774784881636e-04
2.222222222222222143e+01 2.662192222222219541e-04
2.181818181818182012e+01 3.154793181818176103e-04
2.141414141414141525e+01 3.637487820512814822e-04
2.101010101010101039e+01 3.896462179487177784e-04
2.060606060606060552e+01 4.602499896019013781e-04
2.020202020202020066e+01 4.915277893518516352e-04
1.979797979797979934e+01 5.123458564814806692e-04
1.939393939393939448e+01 5.571625856389980603e-04
1.898989898989898961e+01 5.947773292709704080e-04
1.858585858585858475e+01 5.858335435880543569e-04
1.818181818181818343e+01 5.577848450413222612e-04
1.777777777777777857e+01 5.611954263565889327e-04
1.737373737373737370e+01 6.191667030772844216e-04
1.696969696969696884e+01 6.285199134199134004e-04
1.656565656565656752e+01 7.180234343434336490e-04
1.616161616161616266e+01 7.518024526515149943e-04
1.575757575757575779e+01 6.680200524475519075e-04
1.535353535353535293e+01 7.236001435406652724e-04
1.494949494949495161e+01 7.434128091728076874e-04
1.454545454545454675e+01 7.704734532828271063e-04
1.414141414141414188e+01 7.420019622697555765e-04
1.373737373737373701e+01 6.796038265002966742e-04
1.333333333333333215e+01 6.736554545454503246e-04
1.292929292929293084e+01 6.822676830808048834e-04
1.252525252525252597e+01 7.450399828934508402e-04
1.212121212121212110e+01 6.874032979797972545e-04
1.171717171717171624e+01 6.894675087077651796e-04
1.131313131313131493e+01 6.291078228715715065e-04
1.090909090909091006e+01 5.492079058441554518e-04
1.050505050505050519e+01 5.647750271950261781e-04
1.010101010101010033e+01 4.298575271950268520e-04
9.696969696969699015e+00 3.947534820541471080e-04
9.292929292929294149e+00 3.377616041116531789e-04
8.888888888888889284e+00 2.101544785575045447e-04
8.484848484848484418e+00 1.066474369850571049e-04
8.080808080808083105e+00 7.971964442039412239e-05
7.676767676767674686e+00 5.802385004871028485e-05
7.272727272727273373e+00 4.283673409090906707e-05
6.868686868686872060e+00 3.341327701043593837e-05
6.464646464646463642e+00 3.163981069313827771e-05
6.060606060606062329e+00 2.062011521658301138e-05
5.656565656565653910e+00 1.879620972629508134e-05
5.252525252525252597e+00 1.350466566708752702e-05
4.848484848484851284e+00 1.007644945725915898e-05
4.444444444444442865e+00 0.000000000000000000e+00
4.040404040404041552e+00 0.000000000000000000e+00
3.636363636363640239e+00 0.000000000000000000e+00
3.232323232323231821e+00 0.000000000000000000e+00
2.828282828282830508e+00 0.000000000000000000e+00
2.424242424242422089e+00 0.000000000000000000e+00
2.020202020202020776e+00 0.000000000000000000e+00
1.616161616161619463e+00 0.000000000000000000e+00
1.212121212121211045e+00 0.000000000000000000e+00
8.080808080808097316e-01 0.000000000000000000e+00
4.040404040404013131e-01 0.000000000000000000e+00
0.000000000000000000e+00 0.000000000000000000e+00
