2.906208718626156	2.212860967872708e-6
2.959048877146632	1.0475710456643901e-5
3.276089828269485	3.914358067993981e-5
3.5402906208718625	9.749690416357968e-5
3.857331571994716	0.00018220087517675852
4.544253632760898	0.000389785507829087
5.12549537648613	0.0007284258025108297
5.495376486129459	0.0010042338643617167
6.446499339498018	0.0017839231722186065
7.6089828269484805	0.0027682278581098872
8.877146631439894	0.0033337711183217904
10.25099075297226	0.0033905896295997684
11.941875825627477	0.002721838703727147
12.892998678996037	0.002184990440728027
14.266842800528401	0.0014812971997157488
15.482166446499338	0.0010042338643617167
16.274768824306474	0.0007408405929107063
17.331571994715983	0.0005283671150651676
18.282694848084546	0.00037051631786626417
18.91677675033025	0.00027799481593834477
20.026420079260237	0.0001916764720826975
20.871862615587848	0.00013441271917332998
21.928665785997357	8.516776085408746e-5
23.09114927344782	6.0741601539723076e-5
23.830911492734476	4.4059209132016296e-5
24.72919418758256	3.195855657624136e-5
25.416116248348747	2.5655135450507318e-5
26.050198150594454	2.0594984426586593e-5
26.631439894319684	1.7101236888666714e-5
27.318361955085866	1.3271981871880554e-5
27.899603698811095	1.1208339685050789e-5
28.639365918097752	9.306949115011592e-6
29.220607661822985	8.268584950673144e-6
29.537648612945837	6.417109492481524e-6
30.4887714663144	4.7340120363343594e-6
31.598414795244384	4.205844492778347e-6
32.54953764861295	3.433838111857083e-6
33.39498018494056	2.9996060452506335e-6
34.02906208718626	2.4907507813546696e-6
34.76882430647292	2.212860967872708e-6
35.29722589167768	1.900636575835831e-6
36.248348745046236	1.57821126005192e-6
