7.547922313013227580e+00 7.363367650392546896e-04
7.736754682253954130e+00 7.469714702315017685e-04
7.925587051494680679e+00 7.723869313187399152e-04
8.114419420735407229e+00 7.687038811170307127e-04
8.303251789976133779e+00 7.668689471064100939e-04
8.492084159216860328e+00 7.302032467172298860e-04
8.680916528457586878e+00 7.293312104575505302e-04
8.869748897698313428e+00 7.241208192123336834e-04
9.058581266939039978e+00 6.903234116170605967e-04
9.247413636179766527e+00 6.977876030069918387e-04
9.436246005420493077e+00 6.911488075924487971e-04
9.625078374661217850e+00 6.199349636873593408e-04
9.813910743901946176e+00 5.364779476846022813e-04
1.000274311314267095e+01 5.429270534724468626e-04
1.019157548238339928e+01 5.647642384128587255e-04
1.038040785162412405e+01 5.634161183701445925e-04
1.056924022086485238e+01 5.881821707652117861e-04
1.075807259010557893e+01 5.888854399697249697e-04
1.094690495934630547e+01 5.487975069000611619e-04
1.113573732858703202e+01 5.501106481012460947e-04
1.132456969782775857e+01 6.074685483709648531e-04
1.151340206706848512e+01 5.627432655901611807e-04
1.170223443630920990e+01 5.282084984206719853e-04
1.189106680554993645e+01 4.587414791934483539e-04
1.207989917479066300e+01 4.687154885900612325e-04
1.226873154403138955e+01 4.631478976015740304e-04
1.245756391327211610e+01 4.603889517067298056e-04
1.264639628251284265e+01 4.829290434830516834e-04
1.283522865175356920e+01 4.648111948299490275e-04
1.302406102099429575e+01 4.420589888776752224e-04
1.321289339023502230e+01 4.447080898783003708e-04
1.340172575947574884e+01 4.447080898783003708e-04
1.359055812871647539e+01 4.184157553693325111e-04
1.377939049795720194e+01 3.839218699715029443e-04
1.396822286719792849e+01 3.118485104871187631e-04
1.415705523643865504e+01 2.666611882232267864e-04
1.434588760567938159e+01 2.548233963376749151e-04
1.453471997492010814e+01 2.663427313740888741e-04
1.472355234416083469e+01 2.426397261844824528e-04
1.491238471340156124e+01 2.102260894931058405e-04
1.510121708264228779e+01 1.858804221212573846e-04
1.529004945188301434e+01 1.721948503083909167e-04
1.547888182112374089e+01 1.669272268602350342e-04
1.566771419036446744e+01 1.730198783767281556e-04
1.585654655960519399e+01 1.724007377722018000e-04
1.604537892884592054e+01 1.625960687806482909e-04
1.623421129808664887e+01 1.397018059016934385e-04
1.642304366732737364e+01 1.140193826340831575e-04
1.661187603656809841e+01 9.645487308928265625e-05
1.680070840580882674e+01 8.277461934872937049e-05
1.698954077504955507e+01 7.540814374840644160e-05
1.717837314429027984e+01 6.993969277612686582e-05
1.736720551353100461e+01 6.016371705786971902e-05
1.755603788277173294e+01 5.005122345052864813e-05
1.773628696250151648e+01 5.215151739741756928e-05
1.789936946320941757e+01 7.080865011254755309e-05
1.807103525342825989e+01 9.406455326346193973e-05
1.825128433315804344e+01 8.121677038774342892e-05
1.842295012337688576e+01 6.066182748632816424e-05
1.860319920310666930e+01 4.975307113636320778e-05
1.879203157234739763e+01 5.721874220231406655e-05
1.898086394158812240e+01 6.796239283273403141e-05
1.916969631082885073e+01 7.180271362111294135e-05
1.935852868006957550e+01 6.675506902036446347e-05
1.954736104931030383e+01 6.228515122050740668e-05
1.973619341855102860e+01 5.287944573478411774e-05
1.992502578779175693e+01 4.259464378031035074e-05
2.011385815703248170e+01 3.435121064674649579e-05
2.030269052627321003e+01 2.969127385482424865e-05
2.049152289551393480e+01 2.679157235193470809e-05
2.068035526475466312e+01 2.414618997735618890e-05
2.086918763399538790e+01 2.147783271241323570e-05
2.105802000323611622e+01 1.863091227220789264e-05
2.124685237247684100e+01 1.629710681032346762e-05
2.143568474171756932e+01 1.403590475783060469e-05
2.162451711095829410e+01 1.138733962497344665e-05
2.181334948019902242e+01 9.117915557816688818e-06
2.200218184943974720e+01 7.283345909482901732e-06
2.219101421868047552e+01 5.965742223772685338e-06
2.237984658792120030e+01 5.376688728787816342e-06
2.256867895716192862e+01 4.898193670244783285e-06
2.275751132640265340e+01 4.462281980871740787e-06
2.294634369564338172e+01 4.002502192560686383e-06
2.313517606488410649e+01 3.434824854572098626e-06
2.332400843412483482e+01 2.905695398254421183e-06
2.351284080336555959e+01 2.461016555092465340e-06
2.370167317260628792e+01 2.096881020263569086e-06
2.389050554184701269e+01 1.956473918088313634e-06
2.407933791108774102e+01 1.965847867974161140e-06
2.426817028032846579e+01 2.003794953663339022e-06
2.445700264956919412e+01 2.018213204605403716e-06
2.464583501880991889e+01 2.054714355695745745e-06
2.483466738805064367e+01 1.903434621397219038e-06
2.502349975729137199e+01 1.659042352797302393e-06
2.521233212653209677e+01 1.452957211564035219e-06
2.540116449577282509e+01 1.267918370632718051e-06
2.558999686501354986e+01 1.103803691470020349e-06
2.574449607621050973e+01 9.328085269734933777e-07
2.576166265523239218e+01 6.702900600130243042e-07
2.576411502366408968e+01 4.852830138117224062e-07
2.578128160268597568e+01 2.631109295284747215e-07
2.578741252376521942e+01 3.559885010636165836e-07
2.580457910278710543e+01 1.953190773782873676e-07
