6.274204491770654 1.1325413151528117e-06
6.357886142276385 1.9421746814890253e-06
6.48387608160476 3.4716868189265604e-06
6.64892938469415 4.838209664925955e-06
6.805579837514359 7.63629826128224e-06
6.979912870594705 1.2563166024741203e-05
7.184106542368361 1.6114142772530186e-05
7.434190801430057 2.245697995539774e-05
7.704225249618368 3.0024617090855485e-05
7.958990563743336 3.8511070023255685e-05
8.274096774915755 4.9396217438783205e-05
8.603307608595362 5.594325706169378e-05
8.97966568260421 5.831305113526217e-05
9.359273795849678 8.126619200091944e-05
9.91880313799958 9.999999999999995e-05
10.608280462356129 0.00012305240043592605
11.533119060315528 0.0001645190587753662
12.419624591955504 0.00017148819698705397
13.523980438649257 0.00021102034285685944
14.782498151514783 0.0002024446509976803
16.554438723520065 0.0001942174681489026
18.474710111052488 0.00017148819698705397
20.79198574691415 0.0002024446509976803
23.62844895199982 0.0002024446509976803
25.715621213478045 0.0001336983741824947
27.830511308467706 7.479522515621819e-05
30.709399216742124 3.262222009711667e-05
32.606679227722786 1.6114142772530186e-05
35.20720333896042 4.452958509942655e-06
37.87042835924806 1.0423606739764015e-06
