<?xml version="1.0" encoding="UTF-8" standalone="no"?>
<!-- Created with Inkscape (http://www.inkscape.org/) -->

<svg
   version="1.1"
   id="svg1"
   width="378.07999"
   height="378.07999"
   viewBox="0 0 378.07999 378.07999"
   sodipodi:docname="Maestro_logo.svg"
   inkscape:version="1.3 (0e150ed6c4, 2023-07-21)"
   xmlns:inkscape="http://www.inkscape.org/namespaces/inkscape"
   xmlns:sodipodi="http://sodipodi.sourceforge.net/DTD/sodipodi-0.dtd"
   xmlns="http://www.w3.org/2000/svg"
   xmlns:svg="http://www.w3.org/2000/svg">
  <defs
     id="defs1">
    <clipPath
       clipPathUnits="userSpaceOnUse"
       id="clipPath3">
      <path
         d="M 0,6.1035e-5 H 283.56 V 283.56006 H 0 Z"
         clip-rule="evenodd"
         id="path3" />
    </clipPath>
    <clipPath
       clipPathUnits="userSpaceOnUse"
       id="clipPath5">
      <path
         d="M 0,6.1035e-5 H 283.56 V 283.56006 H 0 Z"
         clip-rule="evenodd"
         id="path5" />
    </clipPath>
    <clipPath
       clipPathUnits="userSpaceOnUse"
       id="clipPath7">
      <path
         d="M 4.225e-6,0 H 283.56 V 283.56 H 4.225e-6 Z"
         transform="matrix(1,0,0,-1,-26.088001,126.22)"
         clip-rule="evenodd"
         id="path7" />
    </clipPath>
    <clipPath
       clipPathUnits="userSpaceOnUse"
       id="clipPath11">
      <path
         d="M -4.5776e-5,283.56 H 283.56 V 1.2207e-4 L -4.5776e-5,9.1553e-5"
         clip-rule="evenodd"
         id="path11" />
    </clipPath>
    <clipPath
       clipPathUnits="userSpaceOnUse"
       id="clipPath13">
      <path
         d="M 3.0518e-5,283.56 H 283.56 V 1.2207e-4 L 4.5776e-5,9.1553e-5"
         clip-rule="evenodd"
         id="path13" />
    </clipPath>
    <clipPath
       clipPathUnits="userSpaceOnUse"
       id="clipPath15">
      <path
         d="M 0,6.1035e-5 H 283.56 V 283.56006 H 0 Z"
         clip-rule="evenodd"
         id="path15" />
    </clipPath>
    <clipPath
       clipPathUnits="userSpaceOnUse"
       id="clipPath18">
      <path
         d="M 4.225e-6,0 H 283.56 V 283.56 H 4.225e-6 Z"
         transform="matrix(1,0,0,-1,-26.088001,126.22)"
         clip-rule="evenodd"
         id="path18" />
    </clipPath>
    <clipPath
       clipPathUnits="userSpaceOnUse"
       id="clipPath22">
      <path
         d="M -4.5776e-5,283.56 H 283.56 V 1.2207e-4 L -4.5776e-5,9.1553e-5"
         clip-rule="evenodd"
         id="path22" />
    </clipPath>
    <clipPath
       clipPathUnits="userSpaceOnUse"
       id="clipPath24">
      <path
         d="M 3.0518e-5,283.56 H 283.56 V 1.2207e-4 L 4.5776e-5,9.1553e-5"
         clip-rule="evenodd"
         id="path24" />
    </clipPath>
    <clipPath
       clipPathUnits="userSpaceOnUse"
       id="clipPath26">
      <path
         d="M 0,6.1035e-5 H 283.56 V 283.56006 H 0 Z"
         clip-rule="evenodd"
         id="path26" />
    </clipPath>
    <clipPath
       clipPathUnits="userSpaceOnUse"
       id="clipPath28">
      <path
         d="M 0,6.1035e-5 H 283.56 V 283.56006 H 0 Z"
         clip-rule="evenodd"
         id="path28" />
    </clipPath>
    <clipPath
       clipPathUnits="userSpaceOnUse"
       id="clipPath30">
      <path
         d="M 4.225e-6,0 H 283.56 V 283.56 H 4.225e-6 Z"
         transform="matrix(1,0,0,-1,-26.088001,126.22)"
         clip-rule="evenodd"
         id="path30" />
    </clipPath>
    <clipPath
       clipPathUnits="userSpaceOnUse"
       id="clipPath34">
      <path
         d="M -4.5776e-5,283.56 H 283.56 V 1.2207e-4 L -4.5776e-5,9.1553e-5"
         clip-rule="evenodd"
         id="path34" />
    </clipPath>
    <clipPath
       clipPathUnits="userSpaceOnUse"
       id="clipPath36">
      <path
         d="M 3.0518e-5,283.56 H 283.56 V 1.2207e-4 L 4.5776e-5,9.1553e-5"
         clip-rule="evenodd"
         id="path36" />
    </clipPath>
    <clipPath
       clipPathUnits="userSpaceOnUse"
       id="clipPath38">
      <path
         d="M 0,6.1035e-5 H 283.56 V 283.56006 H 0 Z"
         clip-rule="evenodd"
         id="path38" />
    </clipPath>
    <clipPath
       clipPathUnits="userSpaceOnUse"
       id="clipPath41">
      <path
         d="M 4.225e-6,0 H 283.56 V 283.56 H 4.225e-6 Z"
         transform="matrix(1,0,0,-1,-26.088001,126.22)"
         clip-rule="evenodd"
         id="path41" />
    </clipPath>
    <clipPath
       clipPathUnits="userSpaceOnUse"
       id="clipPath45">
      <path
         d="M -4.5776e-5,283.56 H 283.56 V 1.2207e-4 L -4.5776e-5,9.1553e-5"
         clip-rule="evenodd"
         id="path45" />
    </clipPath>
    <clipPath
       clipPathUnits="userSpaceOnUse"
       id="clipPath47">
      <path
         d="M 3.0518e-5,283.56 H 283.56 V 1.2207e-4 L 4.5776e-5,9.1553e-5"
         clip-rule="evenodd"
         id="path47" />
    </clipPath>
    <clipPath
       clipPathUnits="userSpaceOnUse"
       id="clipPath49">
      <path
         d="M 0,6.1035e-5 H 283.56 V 283.56006 H 0 Z"
         clip-rule="evenodd"
         id="path49" />
    </clipPath>
    <clipPath
       clipPathUnits="userSpaceOnUse"
       id="clipPath53">
      <path
         d="M -3.0518e-5,283.56 H 283.56 V 9.1553e-5 H -3.0518e-5"
         clip-rule="evenodd"
         id="path53" />
    </clipPath>
    <clipPath
       clipPathUnits="userSpaceOnUse"
       id="clipPath55">
      <path
         d="M 3.0518e-5,283.56 H 283.56 V 1.2207e-4 L 4.5776e-5,9.1553e-5"
         clip-rule="evenodd"
         id="path55" />
    </clipPath>
    <clipPath
       clipPathUnits="userSpaceOnUse"
       id="clipPath57">
      <path
         d="M 0,6.1035e-5 H 283.56 V 283.56006 H 0 Z"
         clip-rule="evenodd"
         id="path57" />
    </clipPath>
    <clipPath
       clipPathUnits="userSpaceOnUse"
       id="clipPath59">
      <path
         d="M 0,6.1035e-5 H 283.56 V 283.56006 H 0 Z"
         clip-rule="evenodd"
         id="path59" />
    </clipPath>
    <clipPath
       clipPathUnits="userSpaceOnUse"
       id="clipPath63">
      <path
         d="M -1.5259e-5,283.56 H 283.56 V 9.1553e-5 L -3.0518e-5,6.1035e-5"
         clip-rule="evenodd"
         id="path63" />
    </clipPath>
    <clipPath
       clipPathUnits="userSpaceOnUse"
       id="clipPath65">
      <path
         d="M 3.0518e-5,283.56 H 283.56 V 1.2207e-4 L 4.5776e-5,9.1553e-5"
         clip-rule="evenodd"
         id="path65" />
    </clipPath>
  </defs>
  <sodipodi:namedview
     id="namedview1"
     pagecolor="#ffffff"
     bordercolor="#000000"
     borderopacity="0.25"
     inkscape:showpageshadow="2"
     inkscape:pageopacity="0.0"
     inkscape:pagecheckerboard="true"
     inkscape:deskcolor="#d1d1d1"
     inkscape:zoom="0.58916105"
     inkscape:cx="1188.9788"
     inkscape:cy="353.89305"
     inkscape:window-width="2560"
     inkscape:window-height="1369"
     inkscape:window-x="1912"
     inkscape:window-y="-8"
     inkscape:window-maximized="1"
     inkscape:current-layer="g36">
    <inkscape:page
       x="0"
       y="0"
       inkscape:label="1"
       id="page1"
       width="378.07999"
       height="378.07999"
       margin="0"
       bleed="0" />
    <inkscape:page
       x="438.39999"
       y="136"
       inkscape:label="2"
       id="page13"
       width="289.92001"
       height="83.840004"
       margin="0"
       bleed="0" />
    <inkscape:page
       x="796.16"
       y="0"
       inkscape:label="3"
       id="page24"
       width="378.08"
       height="378.08" />
    <inkscape:page
       x="1234.5601"
       y="136"
       inkscape:label="4"
       id="page36"
       width="289.91995"
       height="83.840004"
       margin="0"
       bleed="0" />
    <inkscape:page
       x="1592.32"
       y="0"
       inkscape:label="5"
       id="page47"
       width="378.08"
       height="378.08" />
    <inkscape:page
       x="1990.4"
       y="0"
       inkscape:label="6"
       id="page55"
       width="378.08"
       height="378.08" />
  </sodipodi:namedview>
  <g
     id="g1"
     inkscape:groupmode="layer"
     inkscape:label="bluesq">
    <g
       id="g3">
      <path
         id="path4"
         d="M 0,3.0518e-5 H 283.56 V 283.56003 H 0 Z"
         style="fill:#23455c;fill-opacity:1;fill-rule:evenodd;stroke:none"
         transform="matrix(1.3333333,0,0,-1.3333333,0,378.08)"
         clip-path="url(#clipPath5)" />
    </g>
    <g
       id="g5">
      <path
         id="path6"
         d="m 7.9344609,-0.00113281 h -3.5625 V -26.93082 h 5.8476561 l 8.578125,22.4179684 h 0.105469 L 27.551648,-26.93082 h 5.730469 V -0.00113281 H 29.78993 V -16.161289 l 0.04687,-7.253906 H 29.684461 L 20.50868,-0.00113281 H 17.192273 L 7.9344609,-23.415195 H 7.7821172 l 0.1523437,7.253906 z m 55.0078121,0 H 59.157117 L 56.78993,-6.3761328 H 44.32118 l -2.367188,6.37499999 H 38.063367 L 48.739148,-27.258945 h 3.5625 z M 50.473523,-22.887852 45.516492,-9.5636328 H 55.618055 L 50.672742,-22.887852 Z M 84.493055,-0.00113281 H 67.629773 V -26.93082 h 16.664063 v 3.269531 H 71.41493 v 8.25 h 10.089843 v 3.269531 H 71.41493 v 8.8593752 h 13.078125 z m 13.643554,0.328125 c -4.49414,0 -7.992187,-1.48828129 -10.5,-4.46484379 l 2.414063,-2.4609375 c 1.130859,1.2744141 2.320312,2.203125 3.5625,2.7890625 1.242187,0.5800782 2.712891,0.8671875 4.417969,0.8671875 1.740234,0 3.076169,-0.3544922 4.007809,-1.0664062 0.9375,-0.7089844 1.40625,-1.7402344 1.40625,-3.09375 0,-1.171875 -0.3955,-2.1240235 -1.18359,-2.859375 -0.78223,-0.7412107 -2.11816,-1.3769527 -4.007813,-1.9101567 l -3.035156,-0.855468 c -2.273438,-0.647461 -3.949219,-1.582032 -5.027344,-2.800782 -1.078125,-1.224609 -1.617188,-2.742187 -1.617188,-4.546875 0,-1.271484 0.357422,-2.466796 1.078125,-3.585937 0.717774,-1.125 1.749024,-2.027344 3.09375,-2.707031 1.341797,-0.679688 2.90625,-1.019532 4.6875,-1.019532 1.96875,0 3.741216,0.372071 5.320316,1.113282 1.58496,0.735351 2.88867,1.731445 3.91406,2.988281 l -2.4375,2.203125 c -0.75,-0.905274 -1.72266,-1.623047 -2.91797,-2.15625 -1.18945,-0.539063 -2.43457,-0.808594 -3.738281,-0.808594 -1.148437,0 -2.115234,0.18457 -2.894531,0.550781 -0.782226,0.360352 -1.368164,0.84961 -1.757812,1.464844 -0.392578,0.618164 -0.585938,1.300781 -0.585938,2.050781 0,0.978516 0.307617,1.775391 0.925781,2.390625 0.615235,0.618164 1.664063,1.136719 3.140625,1.558594 l 2.601563,0.726563 c 2.827153,0.796875 4.869143,1.836914 6.128903,3.117187 1.25684,1.283203 1.88672,2.9414064 1.88672,4.9804689 0,1.4619141 -0.35742,2.765625 -1.0664,3.9140625 -0.71192,1.1425782 -1.74024,2.0332032 -3.08204,2.67187504 -1.33593,0.6328125 -2.915035,0.94921875 -4.734371,0.94921875 z m 22.951171,-0.328125 h -3.76172 V -23.661289 h -8.63672 v -3.269531 h 21.08203 v 3.269531 h -8.68359 z m 35.22656,0 h -4.51172 L 143.76356,-10.665195 h -5.08594 v 10.66406219 h -3.73828 V -26.93082 h 9.72657 c 1.94531,0 3.64453,0.322265 5.09765,0.960937 1.45899,0.632813 2.58985,1.564453 3.38672,2.789063 0.80274,1.21875 1.20703,2.671875 1.20703,4.359375 0,1.977539 -0.61816,3.65332 -1.85156,5.027343 -1.22754,1.368164 -2.91211,2.293946 -5.05078,2.777344 z M 138.67762,-23.661289 v 9.761719 h 5.56641 c 1.92188,0 3.43652,-0.416016 4.54688,-1.253907 1.11621,-0.84375 1.67578,-2.074218 1.67578,-3.691406 0,-1.640625 -0.51563,-2.850586 -1.54688,-3.632812 -1.02539,-0.788086 -2.44336,-1.183594 -4.2539,-1.183594 z m 0,0"
         style="fill:#ffffff;fill-opacity:1;fill-rule:nonzero;stroke:none"
         aria-label="MAESTR"
         transform="matrix(1.3333333,0,0,1.3333333,34.784,209.78667)"
         clip-path="url(#clipPath7)" />
    </g>
    <g
       id="g7">
      <path
         id="path8"
         d="m 185.88,139.02 c 0,11.23 9.11,20.34 20.34,20.34 11.23,0 20.34,-9.11 20.34,-20.34 0,-11.23 -9.11,-20.34 -20.34,-20.34 -11.23,0 -20.34,9.11 -20.34,20.34 z"
         style="fill:#ffffff;fill-opacity:1;fill-rule:evenodd;stroke:none"
         transform="matrix(1.3333333,0,0,-1.3333333,0,378.08)" />
    </g>
    <g
       id="g8">
      <path
         id="path9"
         d="m 195.72,171.24 h 5.25 v 10.32 h 10.5 v -10.32 h 5.25 l -10.5,-10.32 z"
         style="fill:#ffffff;fill-opacity:1;fill-rule:evenodd;stroke:none"
         transform="matrix(1.3333333,0,0,-1.3333333,0,378.08)" />
    </g>
    <g
       id="g9">
      <path
         id="path10"
         d="m 221.89,169.92 3.71,-3.71 7.47,7.48 7.43,-7.42 -7.48,-7.48 3.71,-3.71 h -14.84 z"
         style="fill:#ffffff;fill-opacity:1;fill-rule:evenodd;stroke:none"
         transform="matrix(1.3333333,0,0,-1.3333333,0,378.08)"
         clip-path="url(#clipPath11)" />
    </g>
    <g
       id="g11">
      <path
         id="path12"
         d="m 237.84,149.4 v -5.25 h 9.84 v -10.5 h -9.84 V 128.4 L 228,138.9 Z"
         style="fill:#ffffff;fill-opacity:1;fill-rule:evenodd;stroke:none"
         transform="matrix(1.3333333,0,0,-1.3333333,0,378.08)"
         clip-path="url(#clipPath13)" />
    </g>
  </g>
  <g
     id="g13"
     inkscape:groupmode="layer"
     inkscape:label="white">
    <g
       id="g16">
      <path
         id="path17"
         d="m 7.9344609,-0.00113281 h -3.5625 V -26.93082 h 5.8476561 l 8.578125,22.4179684 h 0.105469 L 27.551648,-26.93082 h 5.730469 V -0.00113281 H 29.78993 V -16.161289 l 0.04687,-7.253906 H 29.684461 L 20.50868,-0.00113281 H 17.192273 L 7.9344609,-23.415195 H 7.7821172 l 0.1523437,7.253906 z m 55.0078121,0 H 59.157117 L 56.78993,-6.3761328 H 44.32118 l -2.367188,6.37499999 H 38.063367 L 48.739148,-27.258945 h 3.5625 z M 50.473523,-22.887852 45.516492,-9.5636328 H 55.618055 L 50.672742,-22.887852 Z M 84.493055,-0.00113281 H 67.629773 V -26.93082 h 16.664063 v 3.269531 H 71.41493 v 8.25 h 10.089843 v 3.269531 H 71.41493 v 8.8593752 h 13.078125 z m 13.643554,0.328125 c -4.49414,0 -7.992187,-1.48828129 -10.5,-4.46484379 l 2.414063,-2.4609375 c 1.130859,1.2744141 2.320312,2.203125 3.5625,2.7890625 1.242187,0.5800782 2.712891,0.8671875 4.417969,0.8671875 1.740234,0 3.076169,-0.3544922 4.007809,-1.0664062 0.9375,-0.7089844 1.40625,-1.7402344 1.40625,-3.09375 0,-1.171875 -0.3955,-2.1240235 -1.18359,-2.859375 -0.78223,-0.7412107 -2.11816,-1.3769527 -4.007813,-1.9101567 l -3.035156,-0.855468 c -2.273438,-0.647461 -3.949219,-1.582032 -5.027344,-2.800782 -1.078125,-1.224609 -1.617188,-2.742187 -1.617188,-4.546875 0,-1.271484 0.357422,-2.466796 1.078125,-3.585937 0.717774,-1.125 1.749024,-2.027344 3.09375,-2.707031 1.341797,-0.679688 2.90625,-1.019532 4.6875,-1.019532 1.96875,0 3.741216,0.372071 5.320316,1.113282 1.58496,0.735351 2.88867,1.731445 3.91406,2.988281 l -2.4375,2.203125 c -0.75,-0.905274 -1.72266,-1.623047 -2.91797,-2.15625 -1.18945,-0.539063 -2.43457,-0.808594 -3.738281,-0.808594 -1.148437,0 -2.115234,0.18457 -2.894531,0.550781 -0.782226,0.360352 -1.368164,0.84961 -1.757812,1.464844 -0.392578,0.618164 -0.585938,1.300781 -0.585938,2.050781 0,0.978516 0.307617,1.775391 0.925781,2.390625 0.615235,0.618164 1.664063,1.136719 3.140625,1.558594 l 2.601563,0.726563 c 2.827153,0.796875 4.869143,1.836914 6.128903,3.117187 1.25684,1.283203 1.88672,2.9414064 1.88672,4.9804689 0,1.4619141 -0.35742,2.765625 -1.0664,3.9140625 -0.71192,1.1425782 -1.74024,2.0332032 -3.08204,2.67187504 -1.33593,0.6328125 -2.915035,0.94921875 -4.734371,0.94921875 z m 22.951171,-0.328125 h -3.76172 V -23.661289 h -8.63672 v -3.269531 h 21.08203 v 3.269531 h -8.68359 z m 35.22656,0 h -4.51172 L 143.76356,-10.665195 h -5.08594 v 10.66406219 h -3.73828 V -26.93082 h 9.72657 c 1.94531,0 3.64453,0.322265 5.09765,0.960937 1.45899,0.632813 2.58985,1.564453 3.38672,2.789063 0.80274,1.21875 1.20703,2.671875 1.20703,4.359375 0,1.977539 -0.61816,3.65332 -1.85156,5.027343 -1.22754,1.368164 -2.91211,2.293946 -5.05078,2.777344 z M 138.67762,-23.661289 v 9.761719 h 5.56641 c 1.92188,0 3.43652,-0.416016 4.54688,-1.253907 1.11621,-0.84375 1.67578,-2.074218 1.67578,-3.691406 0,-1.640625 -0.51563,-2.850586 -1.54688,-3.632812 -1.02539,-0.788086 -2.44336,-1.183594 -4.2539,-1.183594 z m 0,0"
         style="fill:#ffffff;fill-opacity:1;fill-rule:nonzero;stroke:none"
         aria-label="MAESTR"
         transform="matrix(1.3333333,0,0,1.3333333,432.864,209.78667)"
         clip-path="url(#clipPath18)" />
    </g>
    <g
       id="g18">
      <path
         id="path19"
         d="m 185.88,139.02 c 0,11.23 9.11,20.34 20.34,20.34 11.23,0 20.34,-9.11 20.34,-20.34 0,-11.23 -9.11,-20.34 -20.34,-20.34 -11.23,0 -20.34,9.11 -20.34,20.34 z"
         style="fill:#ffffff;fill-opacity:1;fill-rule:evenodd;stroke:none"
         transform="matrix(1.3333333,0,0,-1.3333333,398.08,378.08)" />
    </g>
    <g
       id="g19">
      <path
         id="path20"
         d="m 195.72,171.24 h 5.25 v 10.32 h 10.5 v -10.32 h 5.25 l -10.5,-10.32 z"
         style="fill:#ffffff;fill-opacity:1;fill-rule:evenodd;stroke:none"
         transform="matrix(1.3333333,0,0,-1.3333333,398.08,378.08)" />
    </g>
    <g
       id="g20">
      <path
         id="path21"
         d="m 221.89,169.92 3.71,-3.71 7.47,7.48 7.43,-7.42 -7.48,-7.48 3.71,-3.71 h -14.84 z"
         style="fill:#ffffff;fill-opacity:1;fill-rule:evenodd;stroke:none"
         transform="matrix(1.3333333,0,0,-1.3333333,398.08,378.08)"
         clip-path="url(#clipPath22)" />
    </g>
    <g
       id="g22">
      <path
         id="path23"
         d="m 237.84,149.4 v -5.25 h 9.84 v -10.5 h -9.84 V 128.4 L 228,138.9 Z"
         style="fill:#ffffff;fill-opacity:1;fill-rule:evenodd;stroke:none"
         transform="matrix(1.3333333,0,0,-1.3333333,398.08,378.08)"
         clip-path="url(#clipPath24)" />
    </g>
  </g>
  <g
     id="g24"
     inkscape:groupmode="layer"
     inkscape:label="whitesq">
    <g
       id="g26">
      <path
         id="path27"
         d="M 0,3.0518e-5 H 283.56 V 283.56003 H 0 Z"
         style="fill:#ffffff;fill-opacity:1;fill-rule:evenodd;stroke:none"
         transform="matrix(1.3333333,0,0,-1.3333333,796.16,378.08)"
         clip-path="url(#clipPath28)" />
    </g>
    <g
       id="g28">
      <path
         id="path29"
         d="m 7.9344609,-0.00113281 h -3.5625 V -26.93082 h 5.8476561 l 8.578125,22.4179684 h 0.105469 L 27.551648,-26.93082 h 5.730469 V -0.00113281 H 29.78993 V -16.161289 l 0.04687,-7.253906 H 29.684461 L 20.50868,-0.00113281 H 17.192273 L 7.9344609,-23.415195 H 7.7821172 l 0.1523437,7.253906 z m 55.0078121,0 H 59.157117 L 56.78993,-6.3761328 H 44.32118 l -2.367188,6.37499999 H 38.063367 L 48.739148,-27.258945 h 3.5625 z M 50.473523,-22.887852 45.516492,-9.5636328 H 55.618055 L 50.672742,-22.887852 Z M 84.493055,-0.00113281 H 67.629773 V -26.93082 h 16.664063 v 3.269531 H 71.41493 v 8.25 h 10.089843 v 3.269531 H 71.41493 v 8.8593752 h 13.078125 z m 13.643554,0.328125 c -4.49414,0 -7.992187,-1.48828129 -10.5,-4.46484379 l 2.414063,-2.4609375 c 1.130859,1.2744141 2.320312,2.203125 3.5625,2.7890625 1.242187,0.5800782 2.712891,0.8671875 4.417969,0.8671875 1.740234,0 3.076169,-0.3544922 4.007809,-1.0664062 0.9375,-0.7089844 1.40625,-1.7402344 1.40625,-3.09375 0,-1.171875 -0.3955,-2.1240235 -1.18359,-2.859375 -0.78223,-0.7412107 -2.11816,-1.3769527 -4.007813,-1.9101567 l -3.035156,-0.855468 c -2.273438,-0.647461 -3.949219,-1.582032 -5.027344,-2.800782 -1.078125,-1.224609 -1.617188,-2.742187 -1.617188,-4.546875 0,-1.271484 0.357422,-2.466796 1.078125,-3.585937 0.717774,-1.125 1.749024,-2.027344 3.09375,-2.707031 1.341797,-0.679688 2.90625,-1.019532 4.6875,-1.019532 1.96875,0 3.741216,0.372071 5.320316,1.113282 1.58496,0.735351 2.88867,1.731445 3.91406,2.988281 l -2.4375,2.203125 c -0.75,-0.905274 -1.72266,-1.623047 -2.91797,-2.15625 -1.18945,-0.539063 -2.43457,-0.808594 -3.738281,-0.808594 -1.148437,0 -2.115234,0.18457 -2.894531,0.550781 -0.782226,0.360352 -1.368164,0.84961 -1.757812,1.464844 -0.392578,0.618164 -0.585938,1.300781 -0.585938,2.050781 0,0.978516 0.307617,1.775391 0.925781,2.390625 0.615235,0.618164 1.664063,1.136719 3.140625,1.558594 l 2.601563,0.726563 c 2.827153,0.796875 4.869143,1.836914 6.128903,3.117187 1.25684,1.283203 1.88672,2.9414064 1.88672,4.9804689 0,1.4619141 -0.35742,2.765625 -1.0664,3.9140625 -0.71192,1.1425782 -1.74024,2.0332032 -3.08204,2.67187504 -1.33593,0.6328125 -2.915035,0.94921875 -4.734371,0.94921875 z m 22.951171,-0.328125 h -3.76172 V -23.661289 h -8.63672 v -3.269531 h 21.08203 v 3.269531 h -8.68359 z m 35.22656,0 h -4.51172 L 143.76356,-10.665195 h -5.08594 v 10.66406219 h -3.73828 V -26.93082 h 9.72657 c 1.94531,0 3.64453,0.322265 5.09765,0.960937 1.45899,0.632813 2.58985,1.564453 3.38672,2.789063 0.80274,1.21875 1.20703,2.671875 1.20703,4.359375 0,1.977539 -0.61816,3.65332 -1.85156,5.027343 -1.22754,1.368164 -2.91211,2.293946 -5.05078,2.777344 z M 138.67762,-23.661289 v 9.761719 h 5.56641 c 1.92188,0 3.43652,-0.416016 4.54688,-1.253907 1.11621,-0.84375 1.67578,-2.074218 1.67578,-3.691406 0,-1.640625 -0.51563,-2.850586 -1.54688,-3.632812 -1.02539,-0.788086 -2.44336,-1.183594 -4.2539,-1.183594 z m 0,0"
         style="fill:#23455c;fill-opacity:1;fill-rule:nonzero;stroke:none"
         aria-label="MAESTR"
         transform="matrix(1.3333333,0,0,1.3333333,830.944,209.78667)"
         clip-path="url(#clipPath30)" />
    </g>
    <g
       id="g30">
      <path
         id="path31"
         d="m 185.88,139.02 c 0,11.23 9.11,20.34 20.34,20.34 11.23,0 20.34,-9.11 20.34,-20.34 0,-11.23 -9.11,-20.34 -20.34,-20.34 -11.23,0 -20.34,9.11 -20.34,20.34 z"
         style="fill:#23455c;fill-opacity:1;fill-rule:evenodd;stroke:none"
         transform="matrix(1.3333333,0,0,-1.3333333,796.16,378.08)" />
    </g>
    <g
       id="g31">
      <path
         id="path32"
         d="m 195.72,171.24 h 5.25 v 10.32 h 10.5 v -10.32 h 5.25 l -10.5,-10.32 z"
         style="fill:#23455c;fill-opacity:1;fill-rule:evenodd;stroke:none"
         transform="matrix(1.3333333,0,0,-1.3333333,796.16,378.08)" />
    </g>
    <g
       id="g32">
      <path
         id="path33"
         d="m 221.89,169.92 3.71,-3.71 7.47,7.48 7.43,-7.42 -7.48,-7.48 3.71,-3.71 h -14.84 z"
         style="fill:#23455c;fill-opacity:1;fill-rule:evenodd;stroke:none"
         transform="matrix(1.3333333,0,0,-1.3333333,796.16,378.08)"
         clip-path="url(#clipPath34)" />
    </g>
    <g
       id="g34">
      <path
         id="path35"
         d="m 237.84,149.4 v -5.25 h 9.84 v -10.5 h -9.84 V 128.4 L 228,138.9 Z"
         style="fill:#23455c;fill-opacity:1;fill-rule:evenodd;stroke:none"
         transform="matrix(1.3333333,0,0,-1.3333333,796.16,378.08)"
         clip-path="url(#clipPath36)" />
    </g>
  </g>
  <g
     id="g36"
     inkscape:groupmode="layer"
     inkscape:label="blue">
    <g
       id="g39">
      <path
         id="path40"
         d="m 7.9344609,-0.00113281 h -3.5625 V -26.93082 h 5.8476561 l 8.578125,22.4179684 h 0.105469 L 27.551648,-26.93082 h 5.730469 V -0.00113281 H 29.78993 V -16.161289 l 0.04687,-7.253906 H 29.684461 L 20.50868,-0.00113281 H 17.192273 L 7.9344609,-23.415195 H 7.7821172 l 0.1523437,7.253906 z m 55.0078121,0 H 59.157117 L 56.78993,-6.3761328 H 44.32118 l -2.367188,6.37499999 H 38.063367 L 48.739148,-27.258945 h 3.5625 z M 50.473523,-22.887852 45.516492,-9.5636328 H 55.618055 L 50.672742,-22.887852 Z M 84.493055,-0.00113281 H 67.629773 V -26.93082 h 16.664063 v 3.269531 H 71.41493 v 8.25 h 10.089843 v 3.269531 H 71.41493 v 8.8593752 h 13.078125 z m 13.643554,0.328125 c -4.49414,0 -7.992187,-1.48828129 -10.5,-4.46484379 l 2.414063,-2.4609375 c 1.130859,1.2744141 2.320312,2.203125 3.5625,2.7890625 1.242187,0.5800782 2.712891,0.8671875 4.417969,0.8671875 1.740234,0 3.076169,-0.3544922 4.007809,-1.0664062 0.9375,-0.7089844 1.40625,-1.7402344 1.40625,-3.09375 0,-1.171875 -0.3955,-2.1240235 -1.18359,-2.859375 -0.78223,-0.7412107 -2.11816,-1.3769527 -4.007813,-1.9101567 l -3.035156,-0.855468 c -2.273438,-0.647461 -3.949219,-1.582032 -5.027344,-2.800782 -1.078125,-1.224609 -1.617188,-2.742187 -1.617188,-4.546875 0,-1.271484 0.357422,-2.466796 1.078125,-3.585937 0.717774,-1.125 1.749024,-2.027344 3.09375,-2.707031 1.341797,-0.679688 2.90625,-1.019532 4.6875,-1.019532 1.96875,0 3.741216,0.372071 5.320316,1.113282 1.58496,0.735351 2.88867,1.731445 3.91406,2.988281 l -2.4375,2.203125 c -0.75,-0.905274 -1.72266,-1.623047 -2.91797,-2.15625 -1.18945,-0.539063 -2.43457,-0.808594 -3.738281,-0.808594 -1.148437,0 -2.115234,0.18457 -2.894531,0.550781 -0.782226,0.360352 -1.368164,0.84961 -1.757812,1.464844 -0.392578,0.618164 -0.585938,1.300781 -0.585938,2.050781 0,0.978516 0.307617,1.775391 0.925781,2.390625 0.615235,0.618164 1.664063,1.136719 3.140625,1.558594 l 2.601563,0.726563 c 2.827153,0.796875 4.869143,1.836914 6.128903,3.117187 1.25684,1.283203 1.88672,2.9414064 1.88672,4.9804689 0,1.4619141 -0.35742,2.765625 -1.0664,3.9140625 -0.71192,1.1425782 -1.74024,2.0332032 -3.08204,2.67187504 -1.33593,0.6328125 -2.915035,0.94921875 -4.734371,0.94921875 z m 22.951171,-0.328125 h -3.76172 V -23.661289 h -8.63672 v -3.269531 h 21.08203 v 3.269531 h -8.68359 z m 35.22656,0 h -4.51172 L 143.76356,-10.665195 h -5.08594 v 10.66406219 h -3.73828 V -26.93082 h 9.72657 c 1.94531,0 3.64453,0.322265 5.09765,0.960937 1.45899,0.632813 2.58985,1.564453 3.38672,2.789063 0.80274,1.21875 1.20703,2.671875 1.20703,4.359375 0,1.977539 -0.61816,3.65332 -1.85156,5.027343 -1.22754,1.368164 -2.91211,2.293946 -5.05078,2.777344 z M 138.67762,-23.661289 v 9.761719 h 5.56641 c 1.92188,0 3.43652,-0.416016 4.54688,-1.253907 1.11621,-0.84375 1.67578,-2.074218 1.67578,-3.691406 0,-1.640625 -0.51563,-2.850586 -1.54688,-3.632812 -1.02539,-0.788086 -2.44336,-1.183594 -4.2539,-1.183594 z m 0,0"
         style="fill:#23455c;fill-opacity:1;fill-rule:nonzero;stroke:none"
         aria-label="MAESTR"
         transform="matrix(1.3333333,0,0,1.3333333,1229.024,209.78667)"
         clip-path="url(#clipPath41)" />
    </g>
    <g
       id="g41">
      <path
         id="path42"
         d="m 185.88,139.02 c 0,11.23 9.11,20.34 20.34,20.34 11.23,0 20.34,-9.11 20.34,-20.34 0,-11.23 -9.11,-20.34 -20.34,-20.34 -11.23,0 -20.34,9.11 -20.34,20.34 z"
         style="fill:#23455c;fill-opacity:1;fill-rule:evenodd;stroke:none"
         transform="matrix(1.3333333,0,0,-1.3333333,1194.24,378.08)" />
    </g>
    <g
       id="g42">
      <path
         id="path43"
         d="m 195.72,171.24 h 5.25 v 10.32 h 10.5 v -10.32 h 5.25 l -10.5,-10.32 z"
         style="fill:#23455c;fill-opacity:1;fill-rule:evenodd;stroke:none"
         transform="matrix(1.3333333,0,0,-1.3333333,1194.24,378.08)" />
    </g>
    <g
       id="g43">
      <path
         id="path44"
         d="m 221.89,169.92 3.71,-3.71 7.47,7.48 7.43,-7.42 -7.48,-7.48 3.71,-3.71 h -14.84 z"
         style="fill:#23455c;fill-opacity:1;fill-rule:evenodd;stroke:none"
         transform="matrix(1.3333333,0,0,-1.3333333,1194.24,378.08)"
         clip-path="url(#clipPath45)" />
    </g>
    <g
       id="g45">
      <path
         id="path46"
         d="m 237.84,149.4 v -5.25 h 9.84 v -10.5 h -9.84 V 128.4 L 228,138.9 Z"
         style="fill:#23455c;fill-opacity:1;fill-rule:evenodd;stroke:none"
         transform="matrix(1.3333333,0,0,-1.3333333,1194.24,378.08)"
         clip-path="url(#clipPath47)" />
    </g>
  </g>
  <g
     id="g47"
     inkscape:groupmode="layer"
     inkscape:label="icon_white">
    <g
       id="g48">
      <path
         id="path48"
         d="M 0,3.0518e-5 H 283.56 V 283.56003 H 0 Z"
         style="fill:#ffffff;fill-opacity:1;fill-rule:evenodd;stroke:none"
         transform="matrix(1.3333333,0,0,-1.3333333,1592.32,378.08)"
         clip-path="url(#clipPath49)" />
    </g>
    <g
       id="g49">
      <path
         id="path50"
         d="m 61.32,113.04 c 0,29.29 23.666,53.04 52.86,53.04 29.19,0 52.86,-23.75 52.86,-53.04 C 167.04,83.747 143.37,60 114.18,60 84.986,60 61.32,83.747 61.32,113.04 Z"
         style="fill:#23455c;fill-opacity:1;fill-rule:evenodd;stroke:none"
         transform="matrix(1.3333333,0,0,-1.3333333,1592.32,378.08)" />
    </g>
    <g
       id="g50">
      <path
         id="path51"
         d="m 86.88,196.8 h 13.65 v 26.76 h 27.3 V 196.8 h 13.65 l -27.3,-26.76 z"
         style="fill:#23455c;fill-opacity:1;fill-rule:evenodd;stroke:none"
         transform="matrix(1.3333333,0,0,-1.3333333,1592.32,378.08)" />
    </g>
    <g
       id="g51">
      <path
         id="path52"
         d="m 155.02,193.39 9.64,-9.65 19.44,19.44 19.29,-19.3 -19.43,-19.43 9.64,-9.65 h -38.58 z"
         style="fill:#23455c;fill-opacity:1;fill-rule:evenodd;stroke:none"
         transform="matrix(1.3333333,0,0,-1.3333333,1592.32,378.08)"
         clip-path="url(#clipPath53)" />
    </g>
    <g
       id="g53">
      <path
         id="path54"
         d="m 196.5,140.04 v -13.62 h 25.62 V 99.18 H 196.5 V 85.56 l -25.62,27.24 z"
         style="fill:#23455c;fill-opacity:1;fill-rule:evenodd;stroke:none"
         transform="matrix(1.3333333,0,0,-1.3333333,1592.32,378.08)"
         clip-path="url(#clipPath55)" />
    </g>
  </g>
  <g
     id="g55"
     inkscape:groupmode="layer"
     inkscape:label="icon_blue">
    <g
       id="g56">
      <path
         id="path56"
         d="M 0,3.0518e-5 H 283.56 V 283.56003 H 0 Z"
         style="fill:#ffffff;fill-opacity:1;fill-rule:evenodd;stroke:none"
         transform="matrix(1.3333333,0,0,-1.3333333,1990.4,378.08)"
         clip-path="url(#clipPath57)" />
    </g>
    <g
       id="g57">
      <path
         id="path58"
         d="M 0,3.0518e-5 H 283.56 V 283.56003 H 0 Z"
         style="fill:#23455c;fill-opacity:1;fill-rule:evenodd;stroke:none"
         transform="matrix(1.3333333,0,0,-1.3333333,1990.4,378.08)"
         clip-path="url(#clipPath59)" />
    </g>
    <g
       id="g59">
      <path
         id="path60"
         d="m 61.32,113.04 c 0,29.29 23.666,53.04 52.86,53.04 29.19,0 52.86,-23.75 52.86,-53.04 C 167.04,83.747 143.37,60 114.18,60 84.986,60 61.32,83.747 61.32,113.04 Z"
         style="fill:#ffffff;fill-opacity:1;fill-rule:evenodd;stroke:none"
         transform="matrix(1.3333333,0,0,-1.3333333,1990.4,378.08)" />
    </g>
    <g
       id="g60">
      <path
         id="path61"
         d="m 86.88,196.8 h 13.65 v 26.76 h 27.3 V 196.8 h 13.65 l -27.3,-26.76 z"
         style="fill:#ffffff;fill-opacity:1;fill-rule:evenodd;stroke:none"
         transform="matrix(1.3333333,0,0,-1.3333333,1990.4,378.08)" />
    </g>
    <g
       id="g61">
      <path
         id="path62"
         d="m 155.02,193.41 9.65,-9.65 19.44,19.44 19.3,-19.3 -19.44,-19.44 9.65,-9.65 h -38.6 z"
         style="fill:#ffffff;fill-opacity:1;fill-rule:evenodd;stroke:none"
         transform="matrix(1.3333333,0,0,-1.3333333,1990.4,378.08)"
         clip-path="url(#clipPath63)" />
    </g>
    <g
       id="g63">
      <path
         id="path64"
         d="m 196.5,140.04 v -13.65 h 25.62 V 99.09 H 196.5 V 85.44 l -25.62,27.3 z"
         style="fill:#ffffff;fill-opacity:1;fill-rule:evenodd;stroke:none"
         transform="matrix(1.3333333,0,0,-1.3333333,1990.4,378.08)"
         clip-path="url(#clipPath65)" />
    </g>
  </g>
</svg>
