<?xml version="1.0" encoding="UTF-8" standalone="no"?>
<svg
   width="1083.7334mm"
   height="304.80002mm"
   viewBox="0 0 1083.7334 304.80002"
   version="1.1"
   id="svg8"
   sodipodi:docname="centos-connect-website.svg"
   inkscape:version="1.2.1 (9c6d41e410, 2022-07-14)"
   xml:space="preserve"
   inkscape:export-filename="../Final/centos-connect-website-c10.png"
   inkscape:export-xdpi="96"
   inkscape:export-ydpi="96"
   xmlns:inkscape="http://www.inkscape.org/namespaces/inkscape"
   xmlns:sodipodi="http://sodipodi.sourceforge.net/DTD/sodipodi-0.dtd"
   xmlns:xlink="http://www.w3.org/1999/xlink"
   xmlns="http://www.w3.org/2000/svg"
   xmlns:svg="http://www.w3.org/2000/svg"
   xmlns:rdf="http://www.w3.org/1999/02/22-rdf-syntax-ns#"
   xmlns:cc="http://creativecommons.org/ns#"
   xmlns:dc="http://purl.org/dc/elements/1.1/"><defs
     id="defs2"><rect
       x="1333.5532"
       y="1290.5054"
       width="1225.5212"
       height="530.72656"
       id="rect7975" /><rect
       x="1288.1405"
       y="908.68811"
       width="194.3992"
       height="16.323502"
       id="rect3414" /><clipPath
       clipPathUnits="userSpaceOnUse"
       id="clipPath1739"><rect
         style="fill:#160d27;fill-opacity:1;stroke-width:1.12252;stroke-linecap:round;stroke-dasharray:1.12252, 1.12252;paint-order:fill markers stroke;stop-color:#000000"
         id="rect1741"
         width="1083.7334"
         height="304.80002"
         x="58.03772"
         y="264.34106" /></clipPath></defs><sodipodi:namedview
     id="base"
     pagecolor="#ffffff"
     bordercolor="#666666"
     borderopacity="1.0"
     inkscape:pageopacity="0.0"
     inkscape:pageshadow="2"
     inkscape:zoom="0.35355339"
     inkscape:cx="1398.6572"
     inkscape:cy="560.02857"
     inkscape:document-units="px"
     inkscape:current-layer="layer1"
     inkscape:document-rotation="0"
     showgrid="false"
     units="mm"
     fit-margin-top="0"
     fit-margin-left="0"
     fit-margin-right="0"
     fit-margin-bottom="0"
     showborder="true"
     inkscape:showpageshadow="false"
     inkscape:window-width="3440"
     inkscape:window-height="1371"
     inkscape:window-x="0"
     inkscape:window-y="32"
     inkscape:window-maximized="1"
     inkscape:pagecheckerboard="0"
     inkscape:deskcolor="#d1d1d1"
     showguides="false"><inkscape:grid
       type="xygrid"
       id="grid2839"
       originx="252.78901"
       originy="-4.4531252e-06" /><sodipodi:guide
       position="721.63072,192.61668"
       orientation="0,-1"
       id="guide3282"
       inkscape:locked="false" /><sodipodi:guide
       position="735.38906,113.24168"
       orientation="0,-1"
       id="guide3284"
       inkscape:locked="false" /></sodipodi:namedview><metadata
     id="metadata5"><rdf:RDF><cc:Work
         rdf:about=""><dc:format>image/svg+xml</dc:format><dc:type
           rdf:resource="http://purl.org/dc/dcmitype/StillImage" /></cc:Work></rdf:RDF></metadata><g
     inkscape:label="Layer 1"
     inkscape:groupmode="layer"
     id="layer1"
     transform="translate(-58.03772,-264.34106)"><rect
       style="fill:#130221;fill-opacity:1;stroke-width:1.12252;stroke-linecap:round;stroke-dasharray:1.12252, 1.12252;paint-order:fill markers stroke;stop-color:#000000"
       id="rect1523"
       width="1083.7334"
       height="304.80002"
       x="58.03772"
       y="264.34106" /><image
       width="578.15533"
       height="325.21237"
       preserveAspectRatio="none"
       xlink:href="../Final/centos-connect-c10-bg.png"
       id="image2471"
       x="310.82675"
       y="264.34106"
       clip-path="url(#clipPath1739)"
       inkscape:export-filename="../Final/centos-connect-c10-bg.png"
       inkscape:export-xdpi="95.999947"
       inkscape:export-ydpi="95.999947" /><rect
       style="fill:#160d27;fill-opacity:1;stroke-width:0.793745;stroke-linecap:round;stroke-dasharray:0.793745, 0.793745;paint-order:fill markers stroke;stop-color:#000000"
       id="rect13934"
       width="541.8667"
       height="304.80002"
       x="310.82675"
       y="740.31409" /><g
       id="g4102"
       transform="matrix(0.26458334,0,0,0.26458334,445.52796,623.86207)"><rect
         style="fill:#a14f8c;stroke:none;stroke-width:1.39273;stroke-linecap:round;stroke-dasharray:1.39273, 1.39273;paint-order:fill markers stroke;stop-color:#000000"
         id="rect474"
         width="60"
         height="797.42963"
         x="-115.8064"
         y="-330.36835"
         transform="rotate(-90)" /><rect
         style="fill:#efa724;stroke-width:0.98481;stroke-linecap:round;stroke-dasharray:0.98481, 0.98481;paint-order:fill markers stroke;stop-color:#000000"
         id="rect478"
         width="30"
         height="797.42963"
         x="-115.8064"
         y="-330.36835"
         transform="rotate(-90)" /></g><text
       xml:space="preserve"
       style="font-style:normal;font-variant:normal;font-weight:normal;font-stretch:normal;font-size:10.9545px;line-height:1.25;font-family:Montserrat;-inkscape-font-specification:Montserrat;text-align:start;letter-spacing:0px;word-spacing:0px;writing-mode:lr-tb;text-anchor:start;white-space:pre;inline-size:232.9;display:inline;fill:#eceff4;stroke-width:0.434048"
       x="594.87433"
       y="478.91888"
       id="text4080"
       transform="matrix(1.2317629,0,0,1.2317629,-381.12311,-121.8197)"><tspan
         x="594.87433"
         y="478.91888"
         id="tspan11930">
</tspan><tspan
         x="594.87433"
         y="492.612"
         id="tspan11932">February 3rd, 2023 — Brussels, Belgium
</tspan></text><g
       id="g902-2"
       transform="matrix(1.0529091,0,0,1.0528868,-371.78771,792.7927)"><ellipse
         style="fill:#a14f8c;fill-opacity:1;stroke:none;stroke-width:1.32292;stroke-linecap:round;stroke-miterlimit:4;stroke-dasharray:none;stroke-opacity:1;paint-order:fill markers stroke;stop-color:#000000"
         id="ellipse894-9"
         cx="435.07938"
         cy="-124.14428"
         inkscape:export-filename="/home/areguera/Pictures/centos-symbol-v10.png"
         inkscape:export-xdpi="13.06"
         inkscape:export-ydpi="13.06"
         rx="20.103001"
         ry="20.103493"
         transform="rotate(-15)" /><g
         id="g907-3"
         transform="matrix(1.1500001,0,0,1.1500001,-53.772279,39.324566)"><path
           id="path896-1"
           style="fill:#ffffff;fill-opacity:1;stroke-width:7.93746;stroke-linecap:round;paint-order:fill markers stroke;stop-color:#000000"
           d="m 384.25717,-249.61659 -3.87493,3.87494 -5.47925,-4.5e-4 -4.5e-4,5.47974 -3.87454,3.87494 3.87454,3.87454 2e-4,5.47989 5.4795,-2e-4 3.87493,3.87493 3.87454,-3.87493 5.47994,-2.5e-4 -2.5e-4,-5.47944 3.87494,-3.87454 -3.87532,-3.87456 -5.47949,-5.47949 z m 1.17607,3.87454 v 4.18045 l -1.17607,1.17608 -1.17607,-1.17608 v -4.18005 z m -6.95928,1.90827 2.95599,2.95639 4.4e-4,1.66269 -1.66359,4.5e-4 -2.95599,-2.95639 z m -3.57142,6.27028 h 4.18045 l 1.17608,1.17608 -1.17608,1.17607 h -4.18045 z m 14.43444,0 h 4.18045 v 2.35215 h -4.18045 l -1.17608,-1.17607 z m -9.50341,3.93651 1.66316,1e-5 v 1.66314 l -2.95599,2.956 -1.66315,-1.66316 z m 7.18429,-2.3e-4 1.6629,2.4e-4 2.95599,2.95599 -1.66314,1.66314 -2.95599,-2.95599 z m -2.76069,1.14353 1.17607,1.17607 v 4.18046 h -2.35214 v -4.18046 z"
           sodipodi:nodetypes="cccccccccccccccccccccccccccccccccccccccccccccccccccccccccc" /><path
           id="path898-9"
           style="fill:#efa724;fill-opacity:1;stroke-width:8.59212;stroke-linecap:round;paint-order:fill markers stroke;stop-color:#000000"
           d="m 385.43324,-239.08983 -1.17607,1.03926 -1.17607,-1.03961 v 1.52668 h -1.52649 l 1.03941,1.17607 -1.03964,1.17608 h 1.52672 v 1.5264 l 1.17607,-1.03934 1.17607,1.03947 v -1.52653 h 1.52628 l -1.03921,-1.17604 1.0396,-1.17611 h -1.52667 z"
           inkscape:export-filename="/home/areguera/Pictures/centos-symbol-482380-v3.png"
           inkscape:export-xdpi="14.35"
           inkscape:export-ydpi="14.35"
           sodipodi:nodetypes="ccccccccccccccccc" /><path
           id="path900-4"
           style="fill:#efa724;fill-opacity:1;stroke-width:6.14231;stroke-linecap:round;paint-order:fill markers stroke;stop-color:#000000"
           d="m 388.13486,-245.73814 1.90493,1.90493 -2.95599,2.95599 7e-5,1.6631 1.66309,5e-5 2.95598,-2.95598 1.91153,1.91153 -0.003,-5.48309 z"
           inkscape:export-filename="/home/areguera/Pictures/centos-symbol-v10.png"
           inkscape:export-xdpi="13.06"
           inkscape:export-ydpi="13.06"
           sodipodi:nodetypes="ccccccccc" /></g></g><g
       id="g3396"
       transform="matrix(1.0529091,0,0,1.0528868,-371.78771,750.45937)"><ellipse
         style="fill:#a14f8c;fill-opacity:1;stroke:none;stroke-width:1.32292;stroke-linecap:round;stroke-miterlimit:4;stroke-dasharray:none;stroke-opacity:1;paint-order:fill markers stroke;stop-color:#000000"
         id="ellipse3386"
         cx="435.07938"
         cy="-124.14428"
         inkscape:export-filename="/home/areguera/Pictures/centos-symbol-v10.png"
         inkscape:export-xdpi="13.06"
         inkscape:export-ydpi="13.06"
         rx="20.103001"
         ry="20.103493"
         transform="rotate(-15)" /><g
         id="g3394"
         transform="matrix(1.1500001,0,0,1.1500001,-53.772279,39.324566)"><path
           id="path3388"
           style="fill:#ffffff;fill-opacity:1;stroke-width:7.93746;stroke-linecap:round;paint-order:fill markers stroke;stop-color:#000000"
           d="m 384.25717,-249.61659 -3.87493,3.87494 -5.47925,-4.5e-4 -4.5e-4,5.47974 -3.87454,3.87494 3.87454,3.87454 2e-4,5.47989 5.4795,-2e-4 3.87493,3.87493 3.87454,-3.87493 5.47994,-2.5e-4 -2.5e-4,-5.47944 3.87494,-3.87454 -3.87532,-3.87456 -5.47949,-5.47949 z m 1.17607,3.87454 v 4.18045 l -1.17607,1.17608 -1.17607,-1.17608 v -4.18005 z m -6.95928,1.90827 2.95599,2.95639 4.4e-4,1.66269 -1.66359,4.5e-4 -2.95599,-2.95639 z m -3.57142,6.27028 h 4.18045 l 1.17608,1.17608 -1.17608,1.17607 h -4.18045 z m 14.43444,0 h 4.18045 v 2.35215 h -4.18045 l -1.17608,-1.17607 z m -9.50341,3.93651 1.66316,1e-5 v 1.66314 l -2.95599,2.956 -1.66315,-1.66316 z m 7.18429,-2.3e-4 1.6629,2.4e-4 2.95599,2.95599 -1.66314,1.66314 -2.95599,-2.95599 z m -2.76069,1.14353 1.17607,1.17607 v 4.18046 h -2.35214 v -4.18046 z"
           sodipodi:nodetypes="cccccccccccccccccccccccccccccccccccccccccccccccccccccccccc" /><path
           id="path3390"
           style="fill:#efa724;fill-opacity:1;stroke-width:8.59212;stroke-linecap:round;paint-order:fill markers stroke;stop-color:#000000"
           d="m 385.43324,-239.08983 -1.17607,1.03926 -1.17607,-1.03961 v 1.52668 h -1.52649 l 1.03941,1.17607 -1.03964,1.17608 h 1.52672 v 1.5264 l 1.17607,-1.03934 1.17607,1.03947 v -1.52653 h 1.52628 l -1.03921,-1.17604 1.0396,-1.17611 h -1.52667 z"
           inkscape:export-filename="/home/areguera/Pictures/centos-symbol-482380-v3.png"
           inkscape:export-xdpi="14.35"
           inkscape:export-ydpi="14.35"
           sodipodi:nodetypes="ccccccccccccccccc" /><path
           id="path3392"
           style="fill:#efa724;fill-opacity:1;stroke-width:6.14231;stroke-linecap:round;paint-order:fill markers stroke;stop-color:#000000"
           d="m 388.13486,-245.73814 1.90493,1.90493 -2.95599,2.95599 7e-5,1.6631 1.66309,5e-5 2.95598,-2.95598 1.91153,1.91153 -0.003,-5.48309 z"
           inkscape:export-filename="/home/areguera/Pictures/centos-symbol-v10.png"
           inkscape:export-xdpi="13.06"
           inkscape:export-ydpi="13.06"
           sodipodi:nodetypes="ccccccccc" /></g></g><g
       id="g3408"
       transform="matrix(1.0529091,0,0,1.0528868,-371.78771,572.65935)"><ellipse
         style="fill:#a14f8c;fill-opacity:1;stroke:none;stroke-width:1.32292;stroke-linecap:round;stroke-miterlimit:4;stroke-dasharray:none;stroke-opacity:1;paint-order:fill markers stroke;stop-color:#000000"
         id="ellipse3398"
         cx="435.07938"
         cy="-124.14428"
         inkscape:export-filename="/home/areguera/Pictures/centos-symbol-v10.png"
         inkscape:export-xdpi="13.06"
         inkscape:export-ydpi="13.06"
         rx="20.103001"
         ry="20.103493"
         transform="rotate(-15)" /><g
         id="g3406"
         transform="matrix(1.1500001,0,0,1.1500001,-53.772279,39.324566)"><path
           id="path3400"
           style="fill:#ffffff;fill-opacity:1;stroke-width:7.93746;stroke-linecap:round;paint-order:fill markers stroke;stop-color:#000000"
           d="m 384.25717,-249.61659 -3.87493,3.87494 -5.47925,-4.5e-4 -4.5e-4,5.47974 -3.87454,3.87494 3.87454,3.87454 2e-4,5.47989 5.4795,-2e-4 3.87493,3.87493 3.87454,-3.87493 5.47994,-2.5e-4 -2.5e-4,-5.47944 3.87494,-3.87454 -3.87532,-3.87456 -5.47949,-5.47949 z m 1.17607,3.87454 v 4.18045 l -1.17607,1.17608 -1.17607,-1.17608 v -4.18005 z m -6.95928,1.90827 2.95599,2.95639 4.4e-4,1.66269 -1.66359,4.5e-4 -2.95599,-2.95639 z m -3.57142,6.27028 h 4.18045 l 1.17608,1.17608 -1.17608,1.17607 h -4.18045 z m 14.43444,0 h 4.18045 v 2.35215 h -4.18045 l -1.17608,-1.17607 z m -9.50341,3.93651 1.66316,1e-5 v 1.66314 l -2.95599,2.956 -1.66315,-1.66316 z m 7.18429,-2.3e-4 1.6629,2.4e-4 2.95599,2.95599 -1.66314,1.66314 -2.95599,-2.95599 z m -2.76069,1.14353 1.17607,1.17607 v 4.18046 h -2.35214 v -4.18046 z"
           sodipodi:nodetypes="cccccccccccccccccccccccccccccccccccccccccccccccccccccccccc" /><path
           id="path3402"
           style="fill:#efa724;fill-opacity:1;stroke-width:8.59212;stroke-linecap:round;paint-order:fill markers stroke;stop-color:#000000"
           d="m 385.43324,-239.08983 -1.17607,1.03926 -1.17607,-1.03961 v 1.52668 h -1.52649 l 1.03941,1.17607 -1.03964,1.17608 h 1.52672 v 1.5264 l 1.17607,-1.03934 1.17607,1.03947 v -1.52653 h 1.52628 l -1.03921,-1.17604 1.0396,-1.17611 h -1.52667 z"
           inkscape:export-filename="/home/areguera/Pictures/centos-symbol-482380-v3.png"
           inkscape:export-xdpi="14.35"
           inkscape:export-ydpi="14.35"
           sodipodi:nodetypes="ccccccccccccccccc" /><path
           id="path3404"
           style="fill:#efa724;fill-opacity:1;stroke-width:6.14231;stroke-linecap:round;paint-order:fill markers stroke;stop-color:#000000"
           d="m 388.13486,-245.73814 1.90493,1.90493 -2.95599,2.95599 7e-5,1.6631 1.66309,5e-5 2.95598,-2.95598 1.91153,1.91153 -0.003,-5.48309 z"
           inkscape:export-filename="/home/areguera/Pictures/centos-symbol-v10.png"
           inkscape:export-xdpi="13.06"
           inkscape:export-ydpi="13.06"
           sodipodi:nodetypes="ccccccccc" /></g></g><text
       xml:space="preserve"
       transform="matrix(0.26458333,0,0,0.26458333,310.82675,264.34106)"
       id="text3412"
       style="font-size:13.3333px;line-height:1.95;font-family:Montserrat;-inkscape-font-specification:'Montserrat, Normal';white-space:pre;shape-inside:url(#rect3414);display:inline" /><text
       xml:space="preserve"
       style="font-style:normal;font-variant:normal;font-weight:100;font-stretch:normal;font-size:9.17222px;line-height:1.45;font-family:Montserrat;-inkscape-font-specification:'Montserrat Thin';white-space:pre;inline-size:262.813;display:inline;fill:#ffffff;stroke-width:0.319051"
       x="357.55447"
       y="507.21719"
       id="text3424"
       transform="matrix(1.098575,0,0,1.098575,-40.18468,-56.770893)"><tspan
         x="357.55447"
         y="507.21719"
         id="tspan11934">Connect with developers and users of CentOS to learn </tspan><tspan
         x="357.55447"
         y="520.51691"
         id="tspan11936">about the latest developments in the Enterprise Linux </tspan><tspan
         x="357.55447"
         y="533.81665"
         id="tspan11938">ecosystem.</tspan></text><g
       id="g980"
       transform="matrix(0.05027084,0,0,0.05027084,25.680203,377.69885)"
       style="opacity:1;fill:#000000;fill-opacity:1;stroke:#000000;stroke-opacity:1"><path
         sodipodi:nodetypes="ccccccccccccccccccccccccccccccccccccccccccccccccccccccccccccccccccccccccc"
         inkscape:connector-curvature="0"
         id="path5281"
         d="m 537.00421,385.70277 -8.35403,0.99542 -4.45146,19.57797 c -5.62542,1.39695 -11.08487,3.39298 -16.28475,5.95386 l -16.1452,-11.64026 -6.933,4.76308 4.96542,19.05236 c -4.38509,3.91809 -8.33102,8.30151 -11.76816,13.07292 l -19.3989,-2.68388 -3.92582,7.43998 13.02871,14.41254 c -2.05368,5.56284 -3.49105,11.33414 -4.28632,17.21038 l -18.2616,6.62368 -0.0187,8.41216 18.23372,6.70507 c 0.78665,5.86957 2.21385,11.63533 4.25608,17.1941 l -13.14269,14.38696 3.89094,7.45861 19.39658,-2.58855 c 3.42933,4.77346 7.36744,9.15997 11.74492,13.08221 l -5.0724,19.06399 6.91206,4.79568 16.17078,-11.53562 c 5.19902,2.57462 10.6593,4.58392 16.28708,5.99339 l 4.36307,19.60124 8.34706,1.03264 9.05637,-18.14999 v -0.037 c 5.71572,-0.14201 11.4004,-0.88807 16.9592,-2.22573 l 0.0534,0.23723 13.06594,15.5126 7.87259,-2.9653 -0.4163,-20.27801 -0.18838,-0.34886 c 4.97614,-2.76632 9.64715,-6.04898 13.93575,-9.79364 l 0.37676,0.43956 18.77793,7.66559 5.59338,-6.2841 -9.79365,-17.7616 -0.60701,-0.40699 c 3.14462,-4.72333 5.78482,-9.76365 7.87723,-15.03814 l 0.72796,0.29069 20.18965,-1.94198 2.03036,-8.16097 -16.92432,-11.17746 -0.90472,-0.0976 c 0.34077,-2.87728 0.5271,-5.77075 0.55818,-8.66798 -0.003,-2.76699 -0.14715,-5.53202 -0.43257,-8.28425 l 0.81632,-0.0861 16.97548,-11.1007 -1.99546,-8.17027 -20.17802,-2.03268 -0.77911,0.30698 c -2.05044,-5.28874 -4.65009,-10.34777 -7.75627,-15.094 l 0.60472,-0.40235 9.8727,-17.7174 -5.56315,-6.30968 -18.8128,7.57953 -0.39537,0.45817 c -4.27427,-3.75616 -8.932,-7.05204 -13.89622,-9.83318 l 0.21163,-0.38841 0.50702,-20.278 -7.85865,-3.0002 -13.13569,15.45446 -0.0465,0.20235 c -5.55678,-1.37091 -11.24307,-2.14973 -16.96383,-2.32343 z m 4.54912,45.64705 c 25.46962,-1.00377 48.12118,16.07294 54.1662,40.83513 7.01868,28.75022 -10.59861,57.74654 -39.34899,64.76455 -28.74945,7.0172 -57.74417,-10.59976 -64.76221,-39.349 -7.01868,-28.7502 10.59861,-57.74651 39.34898,-64.76452 3.47358,-0.84766 7.02327,-1.34553 10.59602,-1.48616 z"
         style="fill:#000000;fill-opacity:1;stroke:#000000;stroke-width:3.01322;stroke-linecap:round;stroke-linejoin:round;stroke-miterlimit:4;stroke-dasharray:none;stroke-dashoffset:0;stroke-opacity:1" /><g
         transform="matrix(0.66960547,0,0,0.66960547,-18.506287,15.207043)"
         id="g5387"
         style="fill:#000000;fill-opacity:1;stroke:#000000;stroke-opacity:1"><circle
           style="fill:#000000;fill-opacity:1;stroke:#000000;stroke-width:4.34665;stroke-linecap:round;stroke-linejoin:round;stroke-miterlimit:4;stroke-dasharray:none;stroke-dashoffset:0;stroke-opacity:1"
           id="path5368"
           cx="813.30109"
           cy="701.43646"
           r="20.60915" /><circle
           style="fill:#000000;fill-opacity:1;stroke:#000000;stroke-width:4.34665;stroke-linecap:round;stroke-linejoin:round;stroke-miterlimit:4;stroke-dasharray:none;stroke-dashoffset:0;stroke-opacity:1"
           id="path5368-6"
           cx="865.80731"
           cy="701.43646"
           r="20.60915" /></g></g><use
       x="0"
       y="0"
       xlink:href="#g3408"
       id="use7820"
       transform="translate(295.12237,-84.666667)" /><text
       xml:space="preserve"
       transform="matrix(0.26458334,0,0,0.26458334,310.82675,264.34106)"
       id="text7973"
       style="font-size:13.3333px;line-height:1.95;font-family:Montserrat;-inkscape-font-specification:'Montserrat, Normal';white-space:pre;shape-inside:url(#rect7975);display:inline" /><use
       x="0"
       y="0"
       xlink:href="#g3396"
       id="use13936"
       transform="translate(-4.5869086e-6,-51.85833)" /><use
       x="0"
       y="0"
       xlink:href="#g3408"
       id="use13938"
       transform="translate(-4.5869086e-6,42.333335)" /><use
       x="0"
       y="0"
       xlink:href="#g3408"
       id="use2019"
       transform="translate(-4.5869086e-6,-42.333335)" /><text
       xml:space="preserve"
       style="font-size:40.48px;line-height:1.95;font-family:Montserrat;-inkscape-font-specification:'Montserrat, Normal';fill:#ffffff;fill-opacity:1;stroke-width:3.28901"
       x="351.58136"
       y="430.90909"
       id="text504"><tspan
         sodipodi:role="line"
         id="tspan502"
         style="font-weight:bold;font-size:40.48px;fill:#ffffff;fill-opacity:1;stroke-width:3.28901"
         x="351.58136"
         y="430.90909">Connect</tspan></text></g></svg>
