<?xml version="1.0" encoding="UTF-8"?>
<svg xmlns="http://www.w3.org/2000/svg" viewBox="0 0 500 500">
  <defs>
    <style>
      .cls-1 {
        fill: #1b2035;
      }

      .cls-2 {
        fill: #fff;
        font-family: spinweradBold, spinwerad;
        font-size: 500px;
      }
    </style>
  </defs>
  <g id="Capa_1" data-name="Capa 1">
    <rect class="cls-1" x=".91" y="0" width="500" height="500" rx="88.96" ry="88.96"/>
  </g>
  <g id="Capa_2" data-name="Capa 2">
    <text class="cls-2" transform="translate(98.53 417.5)"><tspan x="0" y="0">B</tspan></text>
  </g>
</svg>