{
    "flags": 1,
    "spoiler": false,
    "photo": {
        "flags": 0,
        "hasStickers": false,
        "id": "5278758366245673090",
        "accessHash": "-7600831235883780701",
        "fileReference": {
            "type": "Buffer",
            "data": [
                2,
                127,
                47,
                209,
                196,
                0,
                0,
                0,
                103,
                102,
                39,
                82,
                225,
                37,
                65,
                136,
                202,
                85,
                24,
                171,
                49,
                137,
                241,
                165,
                143,
                196,
                12,
                69,
                57
            ]
        },
        "date": 1713853014,
        "sizes": [
            {
                "type": "i",
                "bytes": {
                    "type": "Buffer",
                    "data": [
                        1,
                        36,
                        40,
                        203,
                        162,
                        159,
                        25,
                        198,
                        227,
                        128,
                        72,
                        29,
                        198,
                        123,
                        138,
                        124,
                        138,
                        3,
                        72,
                        0,
                        224,
                        14,
                        63,
                        239,
                        170,
                        0,
                        135,
                        173,
                        21,
                        101,
                        128,
                        69,
                        118,
                        80,
                        56,
                        9,
                        140,
                        143,
                        110,
                        105,
                        99,
                        64,
                        98,
                        46,
                        64,
                        36,
                        97,
                        186,
                        127,
                        189,
                        254,
                        20,
                        1,
                        86,
                        138,
                        154,
                        96,
                        0,
                        24,
                        0,
                        96,
                        144,
                        48,
                        59,
                        96,
                        81,
                        64,
                        13,
                        139,
                        3,
                        118,
                        224,
                        72,
                        199,
                        32,
                        28,
                        119,
                        20,
                        249,
                        51,
                        186,
                        92,
                        245,
                        193,
                        255,
                        0,
                        208,
                        170,
                        16,
                        112,
                        8,
                        245,
                        24,
                        167,
                        188,
                        165,
                        193,
                        249,
                        64,
                        39,
                        169,
                        252,
                        115,
                        64,
                        22,
                        28,
                        255,
                        0,
                        163,
                        150,
                        192,
                        56,
                        0,
                        96,
                        255,
                        0,
                        159,
                        122,
                        72,
                        142,
                        45,
                        25,
                        189,
                        138,
                        255,
                        0,
                        159,
                        206,
                        161,
                        19,
                        28,
                        21,
                        42,
                        8,
                        56,
                        226,
                        155,
                        230,
                        29,
                        133,
                        0,
                        194,
                        146,
                        127,
                        167,
                        248,
                        80,
                        2,
                        202,
                        187,
                        64,
                        245,
                        4,
                        169,
                        247,
                        255,
                        0,
                        57,
                        162,
                        145,
                        228,
                        46,
                        6,
                        64,
                        24,
                        231,
                        142,
                        244,
                        80,
                        3,
                        40,
                        162,
                        138,
                        0,
                        40,
                        162,
                        138,
                        0,
                        40,
                        162,
                        138,
                        0
                    ]
                },
                "className": "PhotoStrippedSize"
            },
            {
                "type": "m",
                "w": 320,
                "h": 283,
                "size": 8528,
                "className": "PhotoSize"
            },
            {
                "type": "x",
                "w": 648,
                "h": 574,
                "sizes": [
                    2937,
                    6121,
                    9869,
                    13321,
                    19548
                ],
                "className": "PhotoSizeProgressive"
            }
        ],
        "videoSizes": null,
        "dcId": 2,
        "className": "Photo"
    },
    "ttlSeconds": null,
    "className": "MessageMediaPhoto"
}