dev:    size   erasesize  name
mtd0: 00008000 00008000 "zloader"
mtd1: 00038000 00008000 "nvrofs"
mtd2: 00028000 00008000 "uboot"
mtd3: 00400000 00008000 "imagefs"
mtd4: 00318000 00008000 "rootfs"
mtd5: 00080000 00008000 "userdata"
