M48
; DRILL file {KiCad (5.1.9)-1} date 03/28/21 18:29:03
; FORMAT={-:-/ absolute / inch / decimal}
; #@! TF.CreationDate,2021-03-28T18:29:03+04:00
; #@! TF.GenerationSoftware,Kicad,Pcbnew,(5.1.9)-1
; #@! TF.FileFunction,Plated,1,2,PTH
FMAT,2
INCH
T1C0.0118
T2C0.0315
T3C0.0394
%
G90
G05
T1
X3.5535Y-0.998
X3.5535Y-1.1004
X3.5535Y-1.2028
X3.5535Y-1.5295
X3.5535Y-1.6319
X3.5535Y-1.7343
X3.5535Y-1.8366
X3.5535Y-1.935
X3.5535Y-2.0335
X3.5535Y-2.1358
X3.5535Y-2.2343
X3.5535Y-2.3327
X3.5535Y-2.435
X3.5535Y-2.5335
X3.5535Y-2.6319
X3.5535Y-2.7303
X3.5535Y-2.8287
X3.5535Y-2.9272
X3.8646Y-1.4705
X3.8646Y-1.5689
X3.8646Y-1.998
X3.8646Y-2.1004
X3.8646Y-2.2028
X3.8803Y-2.4075
X4.026Y-1.3169
X4.026Y-1.4114
X4.0299Y-2.2461
X4.0299Y-2.3484
X4.0299Y-2.4429
X4.0299Y-2.5571
X4.1559Y-1.5256
X4.1559Y-2.0413
X4.2031Y-1.4311
X4.2031Y-1.6201
X4.2031Y-1.9429
X4.2031Y-2.1398
X4.2031Y-2.2854
X4.2031Y-2.4862
X4.2031Y-2.5846
X4.2031Y-2.6831
X4.2031Y-2.7854
X4.2031Y-2.8839
X4.3646Y-2.002
X4.4315Y-1.6673
X4.4315Y-1.7671
X4.4315Y-1.8171
X4.4315Y-1.9171
X4.4315Y-2.4291
X4.4354Y-2.1791
X4.4354Y-2.2303
X4.4354Y-2.2776
X4.4354Y-2.3287
X4.4827Y-1.1083
X4.5142Y-1.3878
X4.5142Y-1.4862
X4.5299Y-1.1083
X4.5535Y-2.498
X4.5575Y-1.9665
X4.5811Y-1.1083
X4.7898Y-1.2461
X4.7898Y-1.3445
X4.7898Y-1.4429
X4.7898Y-1.5413
X4.7898Y-1.6398
X4.7898Y-1.7382
X4.7898Y-1.8366
X4.7898Y-1.935
X4.7898Y-2.0335
X4.7898Y-2.25
X5.1756Y-1.0453
X5.2425Y-0.998
X5.2425Y-1.1004
X5.2425Y-1.2028
X5.2425Y-1.5335
X5.2425Y-1.6358
X5.2425Y-1.7343
X5.2425Y-1.8366
X5.2425Y-1.935
X5.2425Y-2.0335
X5.2425Y-2.1358
X5.2425Y-2.2343
X5.2425Y-2.3327
X5.2425Y-2.435
X5.2425Y-2.5335
X5.2425Y-2.6319
X5.2425Y-2.7303
X5.2425Y-2.8287
X5.2425Y-2.9272
T2
X4.1Y-0.9852
X4.1Y-1.0852
X4.1Y-1.1852
X4.1Y-1.2852
X4.1Y-1.3852
X4.1Y-1.4852
X4.1Y-1.5852
X4.1Y-1.6852
X4.1Y-1.7852
X4.1Y-1.8852
X4.1Y-1.9852
X4.1Y-2.0852
X4.1Y-2.1852
X4.1Y-2.2852
X4.1Y-2.3852
X4.1Y-2.4852
X4.1Y-2.5852
X4.1Y-2.6852
X4.1Y-2.7852
X4.1Y-2.8852
X4.7Y-0.9852
X4.7Y-1.0852
X4.7Y-1.1852
X4.7Y-1.2852
X4.7Y-1.3852
X4.7Y-1.4852
X4.7Y-1.5852
X4.7Y-1.6852
X4.7Y-1.7852
X4.7Y-1.8852
X4.7Y-1.9852
X4.7Y-2.0852
X4.7Y-2.1852
X4.7Y-2.2852
X4.7Y-2.3852
X4.7Y-2.4852
X4.7Y-2.5852
X4.7Y-2.6852
X4.7Y-2.7852
X4.7Y-2.8852
T3
X3.6Y-1.2854
X3.6Y-1.3854
X3.6Y-1.4854
X3.6Y-1.5854
X3.6Y-1.6854
X3.6Y-1.7854
X3.6Y-1.8854
X3.6Y-1.9854
X3.6Y-2.0854
X3.6Y-2.1854
X3.6Y-2.2854
X3.6Y-2.3854
X3.6Y-2.4854
X3.6Y-2.5854
X3.7Y-1.2854
X3.7Y-1.3854
X3.7Y-1.4854
X3.7Y-1.5854
X3.7Y-1.6854
X3.7Y-1.7854
X3.7Y-1.8854
X3.7Y-1.9854
X3.7Y-2.0854
X3.7Y-2.1854
X3.7Y-2.2854
X3.7Y-2.3854
X3.7Y-2.4854
X3.7Y-2.5854
X3.8Y-1.2854
X3.8Y-1.3854
X3.8Y-1.4854
X3.8Y-1.5854
X3.8Y-1.6854
X3.8Y-1.7854
X3.8Y-1.8854
X3.8Y-1.9854
X3.8Y-2.0854
X3.8Y-2.1854
X3.8Y-2.2854
X3.8Y-2.3854
X3.8Y-2.4854
X3.8Y-2.5854
X5.0Y-1.2854
X5.0Y-1.3854
X5.0Y-1.4854
X5.0Y-1.5854
X5.0Y-1.6854
X5.0Y-1.7854
X5.0Y-1.8854
X5.0Y-1.9854
X5.0Y-2.0854
X5.0Y-2.1854
X5.0Y-2.2854
X5.0Y-2.3854
X5.0Y-2.4854
X5.0Y-2.5854
X5.1Y-1.2854
X5.1Y-1.3854
X5.1Y-1.4854
X5.1Y-1.5854
X5.1Y-1.6854
X5.1Y-1.7854
X5.1Y-1.8854
X5.1Y-1.9854
X5.1Y-2.0854
X5.1Y-2.1854
X5.1Y-2.2854
X5.1Y-2.3854
X5.1Y-2.4854
X5.1Y-2.5854
X5.2Y-1.2854
X5.2Y-1.3854
X5.2Y-1.4854
X5.2Y-1.5854
X5.2Y-1.6854
X5.2Y-1.7854
X5.2Y-1.8854
X5.2Y-1.9854
X5.2Y-2.0854
X5.2Y-2.1854
X5.2Y-2.2854
X5.2Y-2.3854
X5.2Y-2.4854
X5.2Y-2.5854
T0
M30
