EESchema Schematic File Version 4
EELAYER 30 0
EELAYER END
$Descr A4 11693 8268
encoding utf-8
Sheet 1 1
Title "zx-mini-pcb-debug-module-ym2149-v1"
Date ""
Rev "1"
Comp ""
Comment1 ""
Comment2 ""
Comment3 ""
Comment4 ""
$EndDescr
$Comp
L Device:C C5
U 1 1 5FFF84FE
P 9300 5050
F 0 "C5" H 9350 5150 50  0000 L CNN
F 1 "0.1uF" H 9350 4950 50  0000 L CNN
F 2 "Capacitor_SMD:C_0805_2012Metric" H 9338 4900 50  0001 C CNN
F 3 "~" H 9300 5050 50  0001 C CNN
	1    9300 5050
	1    0    0    -1  
$EndComp
$Comp
L Device:R R1
U 1 1 607AC187
P 3400 2350
F 0 "R1" V 3300 2400 50  0000 R CNN
F 1 "470" V 3500 2400 50  0000 R CNN
F 2 "Resistor_SMD:R_0805_2012Metric" V 3330 2350 50  0001 C CNN
F 3 "~" H 3400 2350 50  0001 C CNN
	1    3400 2350
	1    0    0    1   
$EndComp
$Comp
L Device:LED D1
U 1 1 607AC18D
P 3400 2650
F 0 "D1" H 3400 2550 50  0000 C CNN
F 1 "TO-1608BC-MRE" H 3393 2486 50  0001 C CNN
F 2 "LED_SMD:LED_0603_1608Metric" H 3400 2650 50  0001 C CNN
F 3 "https://www.oasistek.com/pdf/TO-1608BC-MRE_9201T098.pdf" H 3400 2650 50  0001 C CNN
	1    3400 2650
	0    1    -1   0   
$EndComp
$Comp
L power:GND #PWR027
U 1 1 607DAFBC
P 9650 5250
F 0 "#PWR027" H 9650 5000 50  0001 C CNN
F 1 "GND" H 9655 5077 50  0000 C CNN
F 2 "" H 9650 5250 50  0001 C CNN
F 3 "" H 9650 5250 50  0001 C CNN
	1    9650 5250
	1    0    0    -1  
$EndComp
$Comp
L Connector_Generic:Conn_01x14 J4
U 1 1 6086846F
P 2600 4600
F 0 "J4" H 2600 5300 50  0000 C CNN
F 1 "PLS-14" H 2600 3800 50  0000 C CNN
F 2 "Connector_PinHeader_2.54mm:PinHeader_1x14_P2.54mm_Vertical" H 2600 4600 50  0001 C CNN
F 3 "~" H 2600 4600 50  0001 C CNN
	1    2600 4600
	1    0    0    -1  
$EndComp
$Comp
L Connector_Generic:Conn_01x14 J2
U 1 1 60868447
P 1600 4600
F 0 "J2" H 1600 5300 50  0000 C CNN
F 1 "PBS-14" H 1600 3800 50  0000 C CNN
F 2 "Connector_PinSocket_2.54mm:PinSocket_1x14_P2.54mm_Vertical" H 1600 4600 50  0001 C CNN
F 3 "~" H 1600 4600 50  0001 C CNN
	1    1600 4600
	-1   0    0    -1  
$EndComp
$Comp
L Device:CP C7
U 1 1 605E39A7
P 10000 5050
F 0 "C7" H 10118 5096 50  0000 L CNN
F 1 "10uF" H 10118 5005 50  0000 L CNN
F 2 "Capacitor_Tantalum_SMD:CP_EIA-3216-18_Kemet-A" H 10038 4900 50  0001 C CNN
F 3 "~" H 10000 5050 50  0001 C CNN
	1    10000 5050
	1    0    0    -1  
$EndComp
$Comp
L Device:C C6
U 1 1 605E5770
P 9650 5050
F 0 "C6" H 9700 5150 50  0000 L CNN
F 1 "1uF" H 9700 4950 50  0000 L CNN
F 2 "Capacitor_SMD:C_0805_2012Metric" H 9688 4900 50  0001 C CNN
F 3 "~" H 9650 5050 50  0001 C CNN
	1    9650 5050
	1    0    0    -1  
$EndComp
Wire Wire Line
	9100 5250 9300 5250
Wire Wire Line
	9300 5250 9300 5200
Wire Wire Line
	9300 5250 9650 5250
Wire Wire Line
	9650 5250 9650 5200
Connection ~ 9300 5250
Wire Wire Line
	9650 5250 10000 5250
Wire Wire Line
	10000 5250 10000 5200
Connection ~ 9650 5250
Wire Wire Line
	9100 4850 9300 4850
Wire Wire Line
	9300 4850 9300 4900
Wire Wire Line
	9300 4850 9650 4850
Wire Wire Line
	9650 4850 9650 4900
Connection ~ 9300 4850
Wire Wire Line
	9650 4850 10000 4850
Wire Wire Line
	10000 4850 10000 4900
Connection ~ 9650 4850
$Comp
L power:+5V #PWR026
U 1 1 605E7ED1
P 9650 4850
F 0 "#PWR026" H 9650 4700 50  0001 C CNN
F 1 "+5V" H 9665 5023 50  0000 C CNN
F 2 "" H 9650 4850 50  0001 C CNN
F 3 "" H 9650 4850 50  0001 C CNN
	1    9650 4850
	1    0    0    -1  
$EndComp
Wire Wire Line
	9100 2650 9700 2650
Wire Wire Line
	9100 2750 9700 2750
Wire Wire Line
	9100 2850 9700 2850
Text Label 9450 2650 0    50   ~ 0
AC_A
Text Label 9450 2750 0    50   ~ 0
AC_B
Text Label 9450 2850 0    50   ~ 0
AC_C
Wire Wire Line
	7650 3550 8100 3550
Text Label 7650 3550 0    50   ~ 0
CLOCK
$Comp
L Device:R R3
U 1 1 605ED34B
P 7150 2350
F 0 "R3" V 7050 2400 50  0000 R CNN
F 1 "4.7k" V 7250 2400 50  0000 R CNN
F 2 "Resistor_SMD:R_0805_2012Metric" V 7080 2350 50  0001 C CNN
F 3 "~" H 7150 2350 50  0001 C CNN
	1    7150 2350
	1    0    0    1   
$EndComp
$Comp
L power:+5V #PWR025
U 1 1 605EE18E
P 7150 2200
F 0 "#PWR025" H 7150 2050 50  0001 C CNN
F 1 "+5V" H 7165 2373 50  0000 C CNN
F 2 "" H 7150 2200 50  0001 C CNN
F 3 "" H 7150 2200 50  0001 C CNN
	1    7150 2200
	1    0    0    -1  
$EndComp
Text Label 6800 2650 0    50   ~ 0
BC1
Text Label 6800 2850 0    50   ~ 0
BDIR
Text Label 6800 3750 0    50   ~ 0
DA0
Text Label 6800 3850 0    50   ~ 0
DA1
Text Label 6800 3950 0    50   ~ 0
DA2
Text Label 6800 4050 0    50   ~ 0
DA3
Text Label 6800 4150 0    50   ~ 0
DA4
Text Label 6800 4250 0    50   ~ 0
DA5
Text Label 6800 4350 0    50   ~ 0
DA6
Text Label 6800 4450 0    50   ~ 0
DA7
$Comp
L power:GND #PWR018
U 1 1 60607C0B
P 4850 3950
F 0 "#PWR018" H 4850 3700 50  0001 C CNN
F 1 "GND" H 4855 3777 50  0000 C CNN
F 2 "" H 4850 3950 50  0001 C CNN
F 3 "" H 4850 3950 50  0001 C CNN
	1    4850 3950
	1    0    0    -1  
$EndComp
$Comp
L power:GND #PWR017
U 1 1 6060AA84
P 4500 2500
F 0 "#PWR017" H 4500 2250 50  0001 C CNN
F 1 "GND" H 4505 2327 50  0000 C CNN
F 2 "" H 4500 2500 50  0001 C CNN
F 3 "" H 4500 2500 50  0001 C CNN
	1    4500 2500
	1    0    0    -1  
$EndComp
$Comp
L Device:C C2
U 1 1 60609742
P 4500 2350
F 0 "C2" H 4550 2450 50  0000 L CNN
F 1 "0.1uF" H 4550 2250 50  0000 L CNN
F 2 "Capacitor_SMD:C_0805_2012Metric" H 4538 2200 50  0001 C CNN
F 3 "~" H 4500 2350 50  0001 C CNN
	1    4500 2350
	1    0    0    -1  
$EndComp
$Comp
L 74xx:74HC595 U1
U 1 1 6060223F
P 4850 3250
F 0 "U1" H 4950 3900 50  0000 C CNN
F 1 "74HC595" H 5050 3800 50  0000 C CNN
F 2 "Package_SO:SOIC-16_3.9x9.9mm_P1.27mm" H 4850 3250 50  0001 C CNN
F 3 "http://www.ti.com/lit/ds/symlink/sn74hc595.pdf" H 4850 3250 50  0001 C CNN
	1    4850 3250
	1    0    0    -1  
$EndComp
Wire Wire Line
	4850 2650 4850 2200
Wire Wire Line
	4850 2200 4500 2200
$Comp
L Device:C C1
U 1 1 6060E7D6
P 4200 2350
F 0 "C1" H 4250 2450 50  0000 L CNN
F 1 "1uF" H 4250 2250 50  0000 L CNN
F 2 "Capacitor_SMD:C_0805_2012Metric" H 4238 2200 50  0001 C CNN
F 3 "~" H 4200 2350 50  0001 C CNN
	1    4200 2350
	1    0    0    -1  
$EndComp
Wire Wire Line
	4200 2200 4500 2200
Connection ~ 4500 2200
Wire Wire Line
	4200 2500 4500 2500
Connection ~ 4500 2500
Wire Wire Line
	4450 2850 4150 2850
$Comp
L power:+5V #PWR016
U 1 1 606150A5
P 4500 2200
F 0 "#PWR016" H 4500 2050 50  0001 C CNN
F 1 "+5V" H 4515 2373 50  0000 C CNN
F 2 "" H 4500 2200 50  0001 C CNN
F 3 "" H 4500 2200 50  0001 C CNN
	1    4500 2200
	1    0    0    -1  
$EndComp
Text Label 4150 2850 0    50   ~ 0
DATA
$Comp
L power:GND #PWR015
U 1 1 60617DB8
P 4450 3450
F 0 "#PWR015" H 4450 3200 50  0001 C CNN
F 1 "GND" H 4455 3277 50  0000 C CNN
F 2 "" H 4450 3450 50  0001 C CNN
F 3 "" H 4450 3450 50  0001 C CNN
	1    4450 3450
	0    1    1    0   
$EndComp
Wire Wire Line
	4450 3350 4150 3350
Text Label 4150 3350 0    50   ~ 0
STROB
Wire Wire Line
	4450 3050 4150 3050
Text Label 4150 3050 0    50   ~ 0
CLK
$Comp
L power:+5V #PWR014
U 1 1 6061DF38
P 4450 3150
F 0 "#PWR014" H 4450 3000 50  0001 C CNN
F 1 "+5V" H 4465 3323 50  0000 C CNN
F 2 "" H 4450 3150 50  0001 C CNN
F 3 "" H 4450 3150 50  0001 C CNN
	1    4450 3150
	0    -1   -1   0   
$EndComp
$Comp
L power:GND #PWR023
U 1 1 6064B12A
P 6200 4850
F 0 "#PWR023" H 6200 4600 50  0001 C CNN
F 1 "GND" H 6205 4677 50  0000 C CNN
F 2 "" H 6200 4850 50  0001 C CNN
F 3 "" H 6200 4850 50  0001 C CNN
	1    6200 4850
	1    0    0    -1  
$EndComp
$Comp
L power:GND #PWR019
U 1 1 6064B130
P 5600 3500
F 0 "#PWR019" H 5600 3250 50  0001 C CNN
F 1 "GND" H 5605 3327 50  0000 C CNN
F 2 "" H 5600 3500 50  0001 C CNN
F 3 "" H 5600 3500 50  0001 C CNN
	1    5600 3500
	1    0    0    -1  
$EndComp
$Comp
L Device:C C4
U 1 1 6064B136
P 5850 3350
F 0 "C4" H 5900 3450 50  0000 L CNN
F 1 "0.1uF" H 5900 3250 50  0000 L CNN
F 2 "Capacitor_SMD:C_0805_2012Metric" H 5888 3200 50  0001 C CNN
F 3 "~" H 5850 3350 50  0001 C CNN
	1    5850 3350
	1    0    0    -1  
$EndComp
$Comp
L 74xx:74HC595 U2
U 1 1 6064B13C
P 6200 4150
F 0 "U2" H 6300 4800 50  0000 C CNN
F 1 "74HC595" H 6400 4700 50  0000 C CNN
F 2 "Package_SO:SOIC-16_3.9x9.9mm_P1.27mm" H 6200 4150 50  0001 C CNN
F 3 "http://www.ti.com/lit/ds/symlink/sn74hc595.pdf" H 6200 4150 50  0001 C CNN
	1    6200 4150
	1    0    0    -1  
$EndComp
Wire Wire Line
	6200 3550 6200 3200
Wire Wire Line
	6200 3200 5850 3200
$Comp
L Device:C C3
U 1 1 6064B144
P 5550 3350
F 0 "C3" H 5600 3450 50  0000 L CNN
F 1 "1uF" H 5600 3250 50  0000 L CNN
F 2 "Capacitor_SMD:C_0805_2012Metric" H 5588 3200 50  0001 C CNN
F 3 "~" H 5550 3350 50  0001 C CNN
	1    5550 3350
	1    0    0    -1  
$EndComp
Wire Wire Line
	5550 3200 5850 3200
Connection ~ 5850 3200
Wire Wire Line
	5550 3500 5600 3500
$Comp
L power:+5V #PWR022
U 1 1 6064B14F
P 5850 3200
F 0 "#PWR022" H 5850 3050 50  0001 C CNN
F 1 "+5V" H 5865 3373 50  0000 C CNN
F 2 "" H 5850 3200 50  0001 C CNN
F 3 "" H 5850 3200 50  0001 C CNN
	1    5850 3200
	1    0    0    -1  
$EndComp
$Comp
L power:GND #PWR021
U 1 1 6064B156
P 5800 4350
F 0 "#PWR021" H 5800 4100 50  0001 C CNN
F 1 "GND" H 5805 4177 50  0000 C CNN
F 2 "" H 5800 4350 50  0001 C CNN
F 3 "" H 5800 4350 50  0001 C CNN
	1    5800 4350
	0    1    1    0   
$EndComp
Wire Wire Line
	5800 4250 5500 4250
Text Label 5500 4250 0    50   ~ 0
STROB
Wire Wire Line
	5800 3950 5500 3950
Text Label 5500 3950 0    50   ~ 0
CLK
$Comp
L power:+5V #PWR020
U 1 1 6064B160
P 5800 4050
F 0 "#PWR020" H 5800 3900 50  0001 C CNN
F 1 "+5V" H 5815 4223 50  0000 C CNN
F 2 "" H 5800 4050 50  0001 C CNN
F 3 "" H 5800 4050 50  0001 C CNN
	1    5800 4050
	0    -1   -1   0   
$EndComp
NoConn ~ 5250 3050
NoConn ~ 5250 3150
NoConn ~ 5250 3250
NoConn ~ 5250 3350
NoConn ~ 5250 3450
NoConn ~ 5250 3550
Wire Wire Line
	5250 3750 5800 3750
Wire Wire Line
	5250 2950 6200 2950
Wire Wire Line
	6800 4650 6800 5150
Wire Wire Line
	6800 5150 4150 5150
Text Label 4150 5150 0    50   ~ 0
QH`
Wire Wire Line
	4200 2200 3400 2200
Connection ~ 4200 2200
$Comp
L power:GND #PWR013
U 1 1 606D9C25
P 3400 2800
F 0 "#PWR013" H 3400 2550 50  0001 C CNN
F 1 "GND" H 3405 2627 50  0000 C CNN
F 2 "" H 3400 2800 50  0001 C CNN
F 3 "" H 3400 2800 50  0001 C CNN
	1    3400 2800
	1    0    0    -1  
$EndComp
Wire Wire Line
	1800 4200 2400 4200
Wire Wire Line
	1800 4300 2400 4300
Wire Wire Line
	1800 4400 2400 4400
Wire Wire Line
	1800 4500 2400 4500
Wire Wire Line
	1800 4600 2400 4600
Wire Wire Line
	1800 4700 2400 4700
Wire Wire Line
	1800 4800 2400 4800
Wire Wire Line
	1800 4900 2400 4900
Text Label 2000 4200 0    50   ~ 0
DA0
Text Label 2000 4300 0    50   ~ 0
DA1
Text Label 2000 4400 0    50   ~ 0
DA2
Text Label 2000 4500 0    50   ~ 0
DA3
Text Label 2000 4600 0    50   ~ 0
DA4
Text Label 2000 4700 0    50   ~ 0
DA5
Text Label 2000 4800 0    50   ~ 0
DA6
Text Label 2000 4900 0    50   ~ 0
DA7
$Comp
L power:GND #PWR06
U 1 1 60700AEC
P 1800 5300
F 0 "#PWR06" H 1800 5050 50  0001 C CNN
F 1 "GND" V 1800 5100 50  0000 C CNN
F 2 "" H 1800 5300 50  0001 C CNN
F 3 "" H 1800 5300 50  0001 C CNN
	1    1800 5300
	0    -1   -1   0   
$EndComp
$Comp
L power:GND #PWR012
U 1 1 60702C7D
P 2400 5300
F 0 "#PWR012" H 2400 5050 50  0001 C CNN
F 1 "GND" V 2400 5100 50  0000 C CNN
F 2 "" H 2400 5300 50  0001 C CNN
F 3 "" H 2400 5300 50  0001 C CNN
	1    2400 5300
	0    1    1    0   
$EndComp
$Comp
L power:+5V #PWR05
U 1 1 60705467
P 1800 4000
F 0 "#PWR05" H 1800 3850 50  0001 C CNN
F 1 "+5V" V 1750 4150 50  0000 C CNN
F 2 "" H 1800 4000 50  0001 C CNN
F 3 "" H 1800 4000 50  0001 C CNN
	1    1800 4000
	0    1    1    0   
$EndComp
$Comp
L power:+5V #PWR011
U 1 1 607075DD
P 2400 4000
F 0 "#PWR011" H 2400 3850 50  0001 C CNN
F 1 "+5V" V 2450 4150 50  0000 C CNN
F 2 "" H 2400 4000 50  0001 C CNN
F 3 "" H 2400 4000 50  0001 C CNN
	1    2400 4000
	0    -1   -1   0   
$EndComp
$Comp
L Connector_Generic:Conn_01x14 J3
U 1 1 60713872
P 2600 2900
F 0 "J3" H 2600 3600 50  0000 C CNN
F 1 "PLS-14" H 2600 2100 50  0000 C CNN
F 2 "Connector_PinHeader_2.54mm:PinHeader_1x14_P2.54mm_Vertical" H 2600 2900 50  0001 C CNN
F 3 "~" H 2600 2900 50  0001 C CNN
	1    2600 2900
	1    0    0    -1  
$EndComp
$Comp
L Connector_Generic:Conn_01x14 J1
U 1 1 60713878
P 1600 2900
F 0 "J1" H 1600 3600 50  0000 C CNN
F 1 "PBS-14" H 1600 2100 50  0000 C CNN
F 2 "Connector_PinSocket_2.54mm:PinSocket_1x14_P2.54mm_Vertical" H 1600 2900 50  0001 C CNN
F 3 "~" H 1600 2900 50  0001 C CNN
	1    1600 2900
	-1   0    0    -1  
$EndComp
$Comp
L power:GND #PWR04
U 1 1 6071388E
P 1800 3600
F 0 "#PWR04" H 1800 3350 50  0001 C CNN
F 1 "GND" V 1800 3400 50  0000 C CNN
F 2 "" H 1800 3600 50  0001 C CNN
F 3 "" H 1800 3600 50  0001 C CNN
	1    1800 3600
	0    -1   -1   0   
$EndComp
$Comp
L power:GND #PWR010
U 1 1 60713894
P 2400 3600
F 0 "#PWR010" H 2400 3350 50  0001 C CNN
F 1 "GND" V 2400 3400 50  0000 C CNN
F 2 "" H 2400 3600 50  0001 C CNN
F 3 "" H 2400 3600 50  0001 C CNN
	1    2400 3600
	0    1    1    0   
$EndComp
$Comp
L power:+5V #PWR01
U 1 1 6071389A
P 1800 2300
F 0 "#PWR01" H 1800 2150 50  0001 C CNN
F 1 "+5V" V 1800 2500 50  0000 C CNN
F 2 "" H 1800 2300 50  0001 C CNN
F 3 "" H 1800 2300 50  0001 C CNN
	1    1800 2300
	0    1    1    0   
$EndComp
$Comp
L power:+5V #PWR07
U 1 1 607138A0
P 2400 2300
F 0 "#PWR07" H 2400 2150 50  0001 C CNN
F 1 "+5V" V 2400 2500 50  0000 C CNN
F 2 "" H 2400 2300 50  0001 C CNN
F 3 "" H 2400 2300 50  0001 C CNN
	1    2400 2300
	0    -1   -1   0   
$EndComp
Text Label 2000 3200 0    50   ~ 0
QH`
Text Label 2000 3000 0    50   ~ 0
STROB
Text Label 2000 3100 0    50   ~ 0
CLK
Text Label 2000 2900 0    50   ~ 0
DATA
Wire Wire Line
	1800 3100 2400 3100
Wire Wire Line
	1800 3400 2400 3400
Wire Wire Line
	1800 3200 2400 3200
Wire Wire Line
	1800 3000 2400 3000
Wire Wire Line
	1800 2900 2400 2900
Text Label 2000 5000 0    50   ~ 0
BC1
Text Label 2000 5100 0    50   ~ 0
BDIR
Wire Wire Line
	1800 2500 2400 2500
Wire Wire Line
	1800 2600 2400 2600
Wire Wire Line
	1800 2700 2400 2700
Text Label 2000 2500 0    50   ~ 0
AC_A
Text Label 2000 2600 0    50   ~ 0
AC_B
Text Label 2000 2700 0    50   ~ 0
AC_C
Wire Wire Line
	1800 5100 2400 5100
Wire Wire Line
	1800 5000 2400 5000
Text Label 2000 3400 0    50   ~ 0
CLOCK
Wire Wire Line
	1800 4100 1800 4000
Connection ~ 1800 4000
Wire Wire Line
	2400 4100 2400 4000
Connection ~ 2400 4000
Wire Wire Line
	1800 5200 1800 5300
Connection ~ 1800 5300
Wire Wire Line
	2400 5200 2400 5300
Connection ~ 2400 5300
Wire Wire Line
	1800 2400 1800 2300
Connection ~ 1800 2300
Wire Wire Line
	2400 2400 2400 2300
Connection ~ 2400 2300
$Comp
L power:GND #PWR08
U 1 1 60612467
P 2400 2800
F 0 "#PWR08" H 2400 2550 50  0001 C CNN
F 1 "GND" V 2400 2600 50  0000 C CNN
F 2 "" H 2400 2800 50  0001 C CNN
F 3 "" H 2400 2800 50  0001 C CNN
	1    2400 2800
	0    1    1    0   
$EndComp
$Comp
L power:GND #PWR02
U 1 1 60615101
P 1800 2800
F 0 "#PWR02" H 1800 2550 50  0001 C CNN
F 1 "GND" V 1800 2600 50  0000 C CNN
F 2 "" H 1800 2800 50  0001 C CNN
F 3 "" H 1800 2800 50  0001 C CNN
	1    1800 2800
	0    -1   -1   0   
$EndComp
Wire Wire Line
	1800 3500 1800 3600
Connection ~ 1800 3600
Wire Wire Line
	2400 3500 2400 3600
Connection ~ 2400 3600
$Comp
L power:GND #PWR03
U 1 1 60627997
P 1800 3300
F 0 "#PWR03" H 1800 3050 50  0001 C CNN
F 1 "GND" V 1800 3100 50  0000 C CNN
F 2 "" H 1800 3300 50  0001 C CNN
F 3 "" H 1800 3300 50  0001 C CNN
	1    1800 3300
	0    -1   -1   0   
$EndComp
$Comp
L power:GND #PWR09
U 1 1 6062A859
P 2400 3300
F 0 "#PWR09" H 2400 3050 50  0001 C CNN
F 1 "GND" V 2400 3100 50  0000 C CNN
F 2 "" H 2400 3300 50  0001 C CNN
F 3 "" H 2400 3300 50  0001 C CNN
	1    2400 3300
	0    1    1    0   
$EndComp
$Comp
L Connector_Generic:Conn_01x14 J5
U 1 1 60630E9F
P 3000 2900
F 0 "J5" H 3000 3600 50  0000 C CNN
F 1 "PLS-14" H 3000 2100 50  0000 C CNN
F 2 "Connector_PinHeader_2.54mm:PinHeader_1x14_P2.54mm_Vertical" H 3000 2900 50  0001 C CNN
F 3 "~" H 3000 2900 50  0001 C CNN
	1    3000 2900
	1    0    0    -1  
$EndComp
Wire Wire Line
	2400 2300 2800 2300
Wire Wire Line
	2400 2400 2800 2400
Connection ~ 2400 2400
Wire Wire Line
	2800 2500 2400 2500
Connection ~ 2400 2500
Wire Wire Line
	2400 2600 2800 2600
Connection ~ 2400 2600
Wire Wire Line
	2800 2700 2400 2700
Connection ~ 2400 2700
Wire Wire Line
	2400 2800 2800 2800
Connection ~ 2400 2800
Wire Wire Line
	2800 2900 2400 2900
Connection ~ 2400 2900
Wire Wire Line
	2400 3000 2800 3000
Connection ~ 2400 3000
Wire Wire Line
	2800 3100 2400 3100
Connection ~ 2400 3100
Wire Wire Line
	2400 3200 2800 3200
Connection ~ 2400 3200
Wire Wire Line
	2800 3300 2400 3300
Connection ~ 2400 3300
Wire Wire Line
	2400 3400 2800 3400
Connection ~ 2400 3400
Wire Wire Line
	2800 3500 2400 3500
Connection ~ 2400 3500
Wire Wire Line
	2400 3600 2800 3600
$Comp
L Connector_Generic:Conn_01x14 J6
U 1 1 6066654C
P 3000 4600
F 0 "J6" H 3000 5300 50  0000 C CNN
F 1 "PLS-14" H 3000 3800 50  0000 C CNN
F 2 "Connector_PinHeader_2.54mm:PinHeader_1x14_P2.54mm_Vertical" H 3000 4600 50  0001 C CNN
F 3 "~" H 3000 4600 50  0001 C CNN
	1    3000 4600
	1    0    0    -1  
$EndComp
Wire Wire Line
	2400 4000 2800 4000
Wire Wire Line
	2800 4100 2400 4100
Connection ~ 2400 4100
Wire Wire Line
	2400 4200 2800 4200
Wire Wire Line
	2800 4300 2400 4300
Wire Wire Line
	2400 4400 2800 4400
Wire Wire Line
	2800 4500 2400 4500
Wire Wire Line
	2400 4600 2800 4600
Wire Wire Line
	2800 4700 2400 4700
Wire Wire Line
	2400 4800 2800 4800
Wire Wire Line
	2800 4900 2400 4900
Wire Wire Line
	2400 5000 2800 5000
Wire Wire Line
	2800 5100 2400 5100
Wire Wire Line
	2400 5200 2800 5200
Connection ~ 2400 5200
Wire Wire Line
	2800 5300 2400 5300
Connection ~ 2400 5000
Connection ~ 2400 5100
Connection ~ 2400 4200
Connection ~ 2400 4300
Connection ~ 2400 4400
Connection ~ 2400 4500
Connection ~ 2400 4600
Connection ~ 2400 4700
Connection ~ 2400 4800
Connection ~ 2400 4900
NoConn ~ 8100 5150
NoConn ~ 8100 5050
NoConn ~ 8100 5250
$Comp
L Device:R R4
U 1 1 60641721
P 7450 2350
F 0 "R4" V 7350 2400 50  0000 R CNN
F 1 "4.7k" V 7550 2400 50  0000 R CNN
F 2 "Resistor_SMD:R_0805_2012Metric" V 7380 2350 50  0001 C CNN
F 3 "~" H 7450 2350 50  0001 C CNN
	1    7450 2350
	1    0    0    1   
$EndComp
$Comp
L Device:R R5
U 1 1 6064F50D
P 7750 2350
F 0 "R5" V 7650 2400 50  0000 R CNN
F 1 "4.7k" V 7850 2400 50  0000 R CNN
F 2 "Resistor_SMD:R_0805_2012Metric" V 7680 2350 50  0001 C CNN
F 3 "~" H 7750 2350 50  0001 C CNN
	1    7750 2350
	1    0    0    1   
$EndComp
$Comp
L Device:R R6
U 1 1 606591C6
P 8050 2350
F 0 "R6" V 7950 2400 50  0000 R CNN
F 1 "4.7k" V 8150 2400 50  0000 R CNN
F 2 "Resistor_SMD:R_0805_2012Metric" V 7980 2350 50  0001 C CNN
F 3 "~" H 8050 2350 50  0001 C CNN
	1    8050 2350
	1    0    0    1   
$EndComp
$Comp
L lib:YM2149 D2
U 1 1 6060F3BD
P 8100 2650
F 0 "D2" H 8600 2915 50  0000 C CNN
F 1 "YM2149" H 8600 2824 50  0000 C CNN
F 2 "Package_DIP:DIP-40_W15.24mm_Socket" H 7800 3550 50  0001 C CNN
F 3 "" H 7800 3550 50  0001 C CNN
	1    8100 2650
	1    0    0    -1  
$EndComp
Wire Wire Line
	8050 2200 7750 2200
Connection ~ 7150 2200
Connection ~ 7450 2200
Wire Wire Line
	7450 2200 7150 2200
Connection ~ 7750 2200
Wire Wire Line
	7750 2200 7450 2200
Wire Wire Line
	6200 2850 6200 2950
Wire Wire Line
	5250 2850 6100 2850
Wire Wire Line
	6100 2650 6100 2850
Wire Wire Line
	8100 2750 8050 2750
Wire Wire Line
	8050 2750 8050 2500
Wire Wire Line
	8100 2950 7750 2950
Wire Wire Line
	7750 2950 7750 2500
Wire Wire Line
	8100 3050 7450 3050
Wire Wire Line
	7450 3050 7450 2500
Wire Wire Line
	8100 3350 7150 3350
Wire Wire Line
	7150 3350 7150 2500
$Comp
L power:GND #PWR024
U 1 1 606BE6A8
P 6750 3150
F 0 "#PWR024" H 6750 2900 50  0001 C CNN
F 1 "GND" H 6755 2977 50  0000 C CNN
F 2 "" H 6750 3150 50  0001 C CNN
F 3 "" H 6750 3150 50  0001 C CNN
	1    6750 3150
	0    1    1    0   
$EndComp
$Comp
L Device:R R2
U 1 1 606C561C
P 6900 3150
F 0 "R2" V 6800 3200 50  0000 R CNN
F 1 "4.7k" V 7000 3200 50  0000 R CNN
F 2 "Resistor_SMD:R_0805_2012Metric" V 6830 3150 50  0001 C CNN
F 3 "~" H 6900 3150 50  0001 C CNN
	1    6900 3150
	0    1    -1   0   
$EndComp
Wire Wire Line
	8100 3150 7050 3150
NoConn ~ 9100 4650
NoConn ~ 9100 4550
NoConn ~ 9100 4450
NoConn ~ 9100 4350
NoConn ~ 9100 4250
NoConn ~ 9100 4150
NoConn ~ 9100 4050
NoConn ~ 9100 3950
NoConn ~ 9100 3750
NoConn ~ 9100 3650
NoConn ~ 9100 3550
NoConn ~ 9100 3450
NoConn ~ 9100 3350
NoConn ~ 9100 3250
NoConn ~ 9100 3150
NoConn ~ 9100 3050
Wire Wire Line
	6600 3750 8100 3750
Wire Wire Line
	6600 3850 8100 3850
Wire Wire Line
	6600 3950 8100 3950
Wire Wire Line
	6600 4050 8100 4050
Wire Wire Line
	6600 4150 8100 4150
Wire Wire Line
	6600 4250 8100 4250
Wire Wire Line
	6600 4350 8100 4350
Wire Wire Line
	6600 4450 8100 4450
Wire Wire Line
	6600 4650 6800 4650
Wire Wire Line
	6200 2850 8100 2850
Wire Wire Line
	6100 2650 8100 2650
Connection ~ 5600 3500
Wire Wire Line
	5600 3500 5850 3500
$EndSCHEMATC
