EESchema Schematic File Version 4
EELAYER 30 0
EELAYER END
$Descr A4 11693 8268
encoding utf-8
Sheet 1 1
Title "zx-mini-pcb-debug-module-usb-uart-v1"
Date ""
Rev "1"
Comp ""
Comment1 ""
Comment2 ""
Comment3 ""
Comment4 ""
$EndDescr
$Comp
L Interface_USB:CP2104 U2
U 1 1 5FE7EE82
P 7850 2950
F 0 "U2" H 7300 3900 50  0000 C CNN
F 1 "CP2104" H 7400 3800 50  0000 C CNN
F 2 "Package_DFN_QFN:QFN-24-1EP_4x4mm_P0.5mm_EP2.6x2.6mm" H 8000 2000 50  0001 L CNN
F 3 "https://www.silabs.com/documents/public/data-sheets/cp2104.pdf" H 7300 4200 50  0001 C CNN
	1    7850 2950
	1    0    0    -1  
$EndComp
$Comp
L Connector:USB_C_Receptacle_USB2.0 J3
U 1 1 5FEC314B
P 2950 2900
F 0 "J3" H 3057 3767 50  0000 C CNN
F 1 "HRO TYPE-C-31-M-12" H 3057 3676 50  0000 C CNN
F 2 "lib:USB_C_Receptacle_HRO_TYPE-C-31-M-12" H 3100 2900 50  0001 C CNN
F 3 "https://www.usb.org/sites/default/files/documents/usb_type-c.zip" H 3100 2900 50  0001 C CNN
	1    2950 2900
	1    0    0    -1  
$EndComp
$Comp
L Power_Protection:USBLC6-2SC6 U1
U 1 1 5FEC8CF4
P 5200 2900
F 0 "U1" V 4650 2750 50  0000 L CNN
F 1 "USBLC6-2SC6" V 4750 2750 50  0000 L CNN
F 2 "Package_TO_SOT_SMD:SOT-23-6" H 5200 2400 50  0001 C CNN
F 3 "https://www.st.com/resource/en/datasheet/usblc6-2.pdf" H 5400 3250 50  0001 C CNN
	1    5200 2900
	0    1    -1   0   
$EndComp
$Comp
L Device:R R1
U 1 1 5FED3658
P 3900 3300
F 0 "R1" H 3850 3350 50  0000 R CNN
F 1 "5.1k" H 3850 3250 50  0000 R CNN
F 2 "Resistor_SMD:R_0805_2012Metric" V 3830 3300 50  0001 C CNN
F 3 "~" H 3900 3300 50  0001 C CNN
	1    3900 3300
	-1   0    0    -1  
$EndComp
NoConn ~ 3550 3500
NoConn ~ 3550 3400
$Comp
L power:GND #PWR09
U 1 1 5FEDC43D
P 3900 3450
F 0 "#PWR09" H 3900 3200 50  0001 C CNN
F 1 "GND" H 3905 3277 50  0000 C CNN
F 2 "" H 3900 3450 50  0001 C CNN
F 3 "" H 3900 3450 50  0001 C CNN
	1    3900 3450
	1    0    0    -1  
$EndComp
$Comp
L Device:R R2
U 1 1 5FEDF71B
P 4200 3300
F 0 "R2" H 4150 3350 50  0000 R CNN
F 1 "5.1k" H 4150 3250 50  0000 R CNN
F 2 "Resistor_SMD:R_0805_2012Metric" V 4130 3300 50  0001 C CNN
F 3 "~" H 4200 3300 50  0001 C CNN
	1    4200 3300
	-1   0    0    -1  
$EndComp
$Comp
L power:GND #PWR010
U 1 1 5FEDF721
P 4200 3450
F 0 "#PWR010" H 4200 3200 50  0001 C CNN
F 1 "GND" H 4205 3277 50  0000 C CNN
F 2 "" H 4200 3450 50  0001 C CNN
F 3 "" H 4200 3450 50  0001 C CNN
	1    4200 3450
	1    0    0    -1  
$EndComp
Wire Wire Line
	3900 3150 3900 2600
Wire Wire Line
	3900 2600 3550 2600
Wire Wire Line
	4200 3150 4200 2500
Wire Wire Line
	4200 2500 3550 2500
Wire Wire Line
	3550 3100 3650 3100
Wire Wire Line
	3650 3100 3650 3000
Wire Wire Line
	3650 3000 3550 3000
Wire Wire Line
	3550 2900 3650 2900
Wire Wire Line
	3650 2900 3650 2800
Wire Wire Line
	3650 2800 3550 2800
Wire Wire Line
	3650 2800 4500 2800
Connection ~ 3650 2800
Wire Wire Line
	3650 3000 4500 3000
Connection ~ 3650 3000
$Comp
L power:+5V #PWR08
U 1 1 5FF0DA78
P 3550 2300
F 0 "#PWR08" H 3550 2150 50  0001 C CNN
F 1 "+5V" H 3565 2473 50  0000 C CNN
F 2 "" H 3550 2300 50  0001 C CNN
F 3 "" H 3550 2300 50  0001 C CNN
	1    3550 2300
	0    1    1    0   
$EndComp
$Comp
L power:GND #PWR011
U 1 1 5FF24D8D
P 4800 2900
F 0 "#PWR011" H 4800 2650 50  0001 C CNN
F 1 "GND" H 4805 2727 50  0000 C CNN
F 2 "" H 4800 2900 50  0001 C CNN
F 3 "" H 4800 2900 50  0001 C CNN
	1    4800 2900
	0    1    1    0   
$EndComp
$Comp
L power:+5V #PWR012
U 1 1 5FF291A9
P 5600 2900
F 0 "#PWR012" H 5600 2750 50  0001 C CNN
F 1 "+5V" H 5615 3073 50  0000 C CNN
F 2 "" H 5600 2900 50  0001 C CNN
F 3 "" H 5600 2900 50  0001 C CNN
	1    5600 2900
	0    1    1    0   
$EndComp
Wire Wire Line
	4500 2800 4500 2500
Wire Wire Line
	4500 2500 5100 2500
Wire Wire Line
	4500 3000 4500 3300
Wire Wire Line
	4500 3300 5100 3300
Wire Wire Line
	2650 3800 2950 3800
Wire Wire Line
	2950 3800 2950 3900
Connection ~ 2950 3800
$Comp
L power:GND #PWR03
U 1 1 5FF65936
P 2950 3900
F 0 "#PWR03" H 2950 3650 50  0001 C CNN
F 1 "GND" H 2955 3727 50  0000 C CNN
F 2 "" H 2950 3900 50  0001 C CNN
F 3 "" H 2950 3900 50  0001 C CNN
	1    2950 3900
	1    0    0    -1  
$EndComp
Wire Wire Line
	5300 2500 5900 2500
Wire Wire Line
	5900 2500 5900 2850
Wire Wire Line
	5300 3300 5900 3300
Wire Wire Line
	5900 3300 5900 2950
NoConn ~ 8550 2350
NoConn ~ 8550 2450
NoConn ~ 8550 2550
NoConn ~ 8550 2650
NoConn ~ 8550 3150
NoConn ~ 8550 3250
NoConn ~ 8550 3550
NoConn ~ 8550 3650
$Comp
L Device:R R5
U 1 1 5FFB918C
P 8900 3450
F 0 "R5" H 8850 3500 50  0000 R CNN
F 1 "4.7k" H 8850 3400 50  0000 R CNN
F 2 "Resistor_SMD:R_0805_2012Metric" V 8830 3450 50  0001 C CNN
F 3 "~" H 8900 3450 50  0001 C CNN
	1    8900 3450
	0    -1   1    0   
$EndComp
Wire Wire Line
	8550 3450 8750 3450
$Comp
L power:+3.3V #PWR019
U 1 1 5FFC7BFD
P 9050 3450
F 0 "#PWR019" H 9050 3300 50  0001 C CNN
F 1 "+3.3V" V 9065 3578 50  0000 L CNN
F 2 "" H 9050 3450 50  0001 C CNN
F 3 "" H 9050 3450 50  0001 C CNN
	1    9050 3450
	0    1    1    0   
$EndComp
Wire Wire Line
	7650 2050 7650 1850
Wire Wire Line
	7650 1850 7850 1850
Wire Wire Line
	7850 1850 7850 2050
$Comp
L Device:C C4
U 1 1 5FFE3C9B
P 8200 1850
F 0 "C4" V 8350 1850 50  0000 L CNN
F 1 "4.7uF" V 8050 1750 50  0000 L CNN
F 2 "Capacitor_SMD:C_0805_2012Metric" H 8238 1700 50  0001 C CNN
F 3 "~" H 8200 1850 50  0001 C CNN
	1    8200 1850
	0    -1   -1   0   
$EndComp
$Comp
L power:GND #PWR018
U 1 1 5FFE3CA1
P 8350 1850
F 0 "#PWR018" H 8350 1600 50  0001 C CNN
F 1 "GND" H 8355 1677 50  0000 C CNN
F 2 "" H 8350 1850 50  0001 C CNN
F 3 "" H 8350 1850 50  0001 C CNN
	1    8350 1850
	0    -1   -1   0   
$EndComp
Wire Wire Line
	7850 1850 8050 1850
NoConn ~ 8050 2050
$Comp
L power:GND #PWR017
U 1 1 60005122
P 7850 4050
F 0 "#PWR017" H 7850 3800 50  0001 C CNN
F 1 "GND" H 7855 3877 50  0000 C CNN
F 2 "" H 7850 4050 50  0001 C CNN
F 3 "" H 7850 4050 50  0001 C CNN
	1    7850 4050
	1    0    0    -1  
$EndComp
Wire Wire Line
	7850 4050 7850 3950
Wire Wire Line
	7850 4050 7950 4050
Wire Wire Line
	7950 4050 7950 3950
Connection ~ 7850 4050
$Comp
L Device:C C3
U 1 1 5FFCAC05
P 6750 3800
F 0 "C3" H 6850 3850 50  0000 L CNN
F 1 "4.7uF" H 6850 3750 50  0000 L CNN
F 2 "Capacitor_SMD:C_0805_2012Metric" H 6788 3650 50  0001 C CNN
F 3 "~" H 6750 3800 50  0001 C CNN
	1    6750 3800
	1    0    0    -1  
$EndComp
$Comp
L power:GND #PWR015
U 1 1 5FFD4CBE
P 6750 3950
F 0 "#PWR015" H 6750 3700 50  0001 C CNN
F 1 "GND" H 6755 3777 50  0000 C CNN
F 2 "" H 6750 3950 50  0001 C CNN
F 3 "" H 6750 3950 50  0001 C CNN
	1    6750 3950
	1    0    0    -1  
$EndComp
$Comp
L Device:C C2
U 1 1 6002D898
P 6750 2500
F 0 "C2" H 6850 2400 50  0000 L CNN
F 1 "4.7uF" H 6850 2300 50  0000 L CNN
F 2 "Capacitor_SMD:C_0805_2012Metric" H 6788 2350 50  0001 C CNN
F 3 "~" H 6750 2500 50  0001 C CNN
	1    6750 2500
	1    0    0    -1  
$EndComp
$Comp
L power:GND #PWR014
U 1 1 6002D89E
P 6750 2650
F 0 "#PWR014" H 6750 2400 50  0001 C CNN
F 1 "GND" H 6750 2500 50  0000 C CNN
F 2 "" H 6750 2650 50  0001 C CNN
F 3 "" H 6750 2650 50  0001 C CNN
	1    6750 2650
	1    0    0    -1  
$EndComp
Wire Wire Line
	7150 2350 7050 2350
Wire Wire Line
	6750 3650 7150 3650
$Comp
L power:+5V #PWR013
U 1 1 60052ED2
P 6750 1750
F 0 "#PWR013" H 6750 1600 50  0001 C CNN
F 1 "+5V" H 6765 1923 50  0000 C CNN
F 2 "" H 6750 1750 50  0001 C CNN
F 3 "" H 6750 1750 50  0001 C CNN
	1    6750 1750
	1    0    0    -1  
$EndComp
$Comp
L power:+3.3V #PWR016
U 1 1 600598E4
P 7650 1750
F 0 "#PWR016" H 7650 1600 50  0001 C CNN
F 1 "+3.3V" H 7665 1923 50  0000 C CNN
F 2 "" H 7650 1750 50  0001 C CNN
F 3 "" H 7650 1750 50  0001 C CNN
	1    7650 1750
	1    0    0    -1  
$EndComp
Wire Wire Line
	7650 1750 7650 1850
Connection ~ 7650 1850
Connection ~ 7850 1850
Wire Wire Line
	6750 2350 6750 1750
Connection ~ 6750 2350
Wire Wire Line
	7150 2550 7050 2550
Wire Wire Line
	7050 2550 7050 2350
Connection ~ 7050 2350
Wire Wire Line
	7050 2350 6750 2350
$Comp
L Device:LED D2
U 1 1 6008C352
P 6400 2500
F 0 "D2" H 6400 2400 50  0000 C CNN
F 1 "TO-1608BC-PG" H 6500 2350 50  0001 C CNN
F 2 "LED_SMD:LED_0603_1608Metric" H 6400 2500 50  0001 C CNN
F 3 "https://www.oasistek.com/pdf/TO-1608BC-PG_9201T057.pdf" H 6400 2500 50  0001 C CNN
	1    6400 2500
	0    -1   -1   0   
$EndComp
$Comp
L Device:R R4
U 1 1 6009D506
P 6400 2200
F 0 "R4" H 6350 2250 50  0000 R CNN
F 1 "470" H 6350 2150 50  0000 R CNN
F 2 "Resistor_SMD:R_0805_2012Metric" V 6330 2200 50  0001 C CNN
F 3 "~" H 6400 2200 50  0001 C CNN
	1    6400 2200
	1    0    0    1   
$EndComp
Wire Wire Line
	6400 2650 6400 3150
Wire Wire Line
	6400 3150 7150 3150
$Comp
L Device:LED D1
U 1 1 600AA361
P 6100 2500
F 0 "D1" H 6100 2400 50  0000 C CNN
F 1 "TO-1608BC-MYF" H 6200 2350 50  0001 C CNN
F 2 "LED_SMD:LED_0603_1608Metric" H 6100 2500 50  0001 C CNN
F 3 "https://www.oasistek.com/pdf/TO-1608BC-PG_9201T057.pdf" H 6100 2500 50  0001 C CNN
	1    6100 2500
	0    -1   -1   0   
$EndComp
$Comp
L Device:R R3
U 1 1 600AA367
P 6100 2200
F 0 "R3" H 6050 2250 50  0000 R CNN
F 1 "470" H 6050 2150 50  0000 R CNN
F 2 "Resistor_SMD:R_0805_2012Metric" V 6030 2200 50  0001 C CNN
F 3 "~" H 6100 2200 50  0001 C CNN
	1    6100 2200
	1    0    0    1   
$EndComp
Wire Wire Line
	7150 3250 6100 3250
Wire Wire Line
	6100 2650 6100 3250
Wire Wire Line
	6100 1850 6400 1850
Wire Wire Line
	6100 1850 6100 2050
Wire Wire Line
	6400 2050 6400 1850
Connection ~ 6400 1850
Wire Wire Line
	6400 1850 7650 1850
Wire Wire Line
	5900 2850 7150 2850
Wire Wire Line
	5900 2950 7150 2950
NoConn ~ 7150 3350
NoConn ~ 7150 3450
Wire Wire Line
	2800 4550 3400 4550
Wire Wire Line
	2800 4650 3400 4650
$Comp
L Connector_Generic:Conn_01x03 J4
U 1 1 6010E021
P 3600 4650
F 0 "J4" H 3600 4850 50  0000 C CNN
F 1 "PLS-3" H 3600 4450 50  0000 C CNN
F 2 "Connector_PinHeader_2.54mm:PinHeader_1x03_P2.54mm_Vertical" H 3600 4650 50  0001 C CNN
F 3 "~" H 3600 4650 50  0001 C CNN
	1    3600 4650
	1    0    0    -1  
$EndComp
$Comp
L Connector_Generic:Conn_01x03 J1
U 1 1 6010E027
P 2600 4650
F 0 "J1" H 2600 4850 50  0000 C CNN
F 1 "PBS-3" H 2550 4450 50  0000 C CNN
F 2 "Connector_PinSocket_2.54mm:PinSocket_1x03_P2.54mm_Vertical" H 2600 4650 50  0001 C CNN
F 3 "~" H 2600 4650 50  0001 C CNN
	1    2600 4650
	-1   0    0    -1  
$EndComp
$Comp
L power:GND #PWR01
U 1 1 6010E02F
P 2800 4750
F 0 "#PWR01" H 2800 4500 50  0001 C CNN
F 1 "GND" V 2800 4550 50  0000 C CNN
F 2 "" H 2800 4750 50  0001 C CNN
F 3 "" H 2800 4750 50  0001 C CNN
	1    2800 4750
	0    -1   -1   0   
$EndComp
$Comp
L power:GND #PWR05
U 1 1 6010E035
P 3400 4750
F 0 "#PWR05" H 3400 4500 50  0001 C CNN
F 1 "GND" V 3400 4550 50  0000 C CNN
F 2 "" H 3400 4750 50  0001 C CNN
F 3 "" H 3400 4750 50  0001 C CNN
	1    3400 4750
	0    1    1    0   
$EndComp
$Comp
L Connector_Generic:Conn_01x03 J5
U 1 1 6012B735
P 3600 5950
F 0 "J5" H 3600 6150 50  0000 C CNN
F 1 "PLS-3" H 3600 5750 50  0000 C CNN
F 2 "Connector_PinHeader_2.54mm:PinHeader_1x03_P2.54mm_Vertical" H 3600 5950 50  0001 C CNN
F 3 "~" H 3600 5950 50  0001 C CNN
	1    3600 5950
	1    0    0    -1  
$EndComp
$Comp
L Connector_Generic:Conn_01x03 J2
U 1 1 6012B73B
P 2600 5950
F 0 "J2" H 2600 6150 50  0000 C CNN
F 1 "PBS-3" H 2550 5750 50  0000 C CNN
F 2 "Connector_PinSocket_2.54mm:PinSocket_1x03_P2.54mm_Vertical" H 2600 5950 50  0001 C CNN
F 3 "~" H 2600 5950 50  0001 C CNN
	1    2600 5950
	-1   0    0    -1  
$EndComp
$Comp
L power:GND #PWR02
U 1 1 6012B743
P 2800 6050
F 0 "#PWR02" H 2800 5800 50  0001 C CNN
F 1 "GND" V 2800 5850 50  0000 C CNN
F 2 "" H 2800 6050 50  0001 C CNN
F 3 "" H 2800 6050 50  0001 C CNN
	1    2800 6050
	0    -1   -1   0   
$EndComp
$Comp
L power:GND #PWR06
U 1 1 6012B749
P 3400 6050
F 0 "#PWR06" H 3400 5800 50  0001 C CNN
F 1 "GND" V 3400 5850 50  0000 C CNN
F 2 "" H 3400 6050 50  0001 C CNN
F 3 "" H 3400 6050 50  0001 C CNN
	1    3400 6050
	0    1    1    0   
$EndComp
Wire Wire Line
	8550 2850 9200 2850
Wire Wire Line
	8550 2950 9200 2950
Text Label 9050 2850 0    50   ~ 0
TXD
Text Label 9050 2950 0    50   ~ 0
RXD
Text Label 3050 4550 0    50   ~ 0
TXD
Text Label 3050 4650 0    50   ~ 0
RXD
Wire Wire Line
	2850 5250 3100 5250
$Comp
L Device:L L1
U 1 1 60146036
P 3350 5250
F 0 "L1" V 3540 5250 50  0000 C CNN
F 1 "BLM21PG300SN1D" V 3449 5250 50  0000 C CNN
F 2 "Inductor_SMD:L_0805_2012Metric" H 3350 5250 50  0001 C CNN
F 3 "https://www.murata.com/en-eu/products/productdetail?partno=BLM21PG300SN1%23" H 3350 5250 50  0001 C CNN
	1    3350 5250
	0    -1   -1   0   
$EndComp
$Comp
L power:+5V #PWR07
U 1 1 6014D858
P 3500 5250
F 0 "#PWR07" H 3500 5100 50  0001 C CNN
F 1 "+5V" V 3500 5450 50  0000 C CNN
F 2 "" H 3500 5250 50  0001 C CNN
F 3 "" H 3500 5250 50  0001 C CNN
	1    3500 5250
	0    1    1    0   
$EndComp
$Comp
L Device:C C1
U 1 1 60152233
P 3100 5400
F 0 "C1" H 3250 5400 50  0000 L CNN
F 1 "4.7uF" H 3250 5300 50  0000 L CNN
F 2 "Capacitor_SMD:C_0805_2012Metric" H 3138 5250 50  0001 C CNN
F 3 "~" H 3100 5400 50  0001 C CNN
	1    3100 5400
	1    0    0    -1  
$EndComp
$Comp
L power:GND #PWR04
U 1 1 60153E45
P 3100 5550
F 0 "#PWR04" H 3100 5300 50  0001 C CNN
F 1 "GND" H 3105 5377 50  0000 C CNN
F 2 "" H 3100 5550 50  0001 C CNN
F 3 "" H 3100 5550 50  0001 C CNN
	1    3100 5550
	1    0    0    -1  
$EndComp
Wire Wire Line
	3200 5250 3100 5250
Connection ~ 3100 5250
Wire Wire Line
	2850 5250 2850 5850
Wire Wire Line
	2800 5850 2850 5850
Connection ~ 2850 5850
Wire Wire Line
	2850 5850 3350 5850
Text Notes 6450 2400 0    50   ~ 0
TX
Text Notes 6150 2400 0    50   ~ 0
RX
Wire Wire Line
	2800 5950 2850 5950
Wire Wire Line
	2850 5950 2850 5850
Wire Wire Line
	3400 5950 3350 5950
Wire Wire Line
	3350 5950 3350 5850
Connection ~ 3350 5850
Wire Wire Line
	3350 5850 3400 5850
$EndSCHEMATC
