M48
; DRILL file {KiCad (5.1.9)-1} date 02/10/21 20:51:55
; FORMAT={-:-/ absolute / inch / decimal}
; #@! TF.CreationDate,2021-02-10T20:51:55+04:00
; #@! TF.GenerationSoftware,Kicad,Pcbnew,(5.1.9)-1
; #@! TF.FileFunction,Plated,1,2,PTH
FMAT,2
INCH
T1C0.0157
T2C0.0394
%
G90
G05
T1
X5.7472Y-3.7819
X5.7472Y-3.9394
X5.7472Y-4.0378
X5.7472Y-4.1362
X5.7472Y-4.2346
X5.7472Y-4.2937
X5.9559Y-3.7819
X5.9559Y-4.2937
X5.9915Y-4.1207
X6.0701Y-3.9157
X6.3024Y-3.9079
X6.3988Y-4.0437
X6.4006Y-3.9707
X6.4441Y-4.2976
X6.5583Y-3.7819
X6.6528Y-3.7819
X6.6528Y-3.9394
X6.6528Y-4.0378
X6.6528Y-4.1362
X6.6528Y-4.2346
X6.6528Y-4.2937
T2
X5.8Y-3.8882
X5.8Y-3.9882
X5.8Y-4.0882
X5.8Y-4.1882
X5.9Y-3.8882
X5.9Y-3.9882
X5.9Y-4.0882
X5.9Y-4.1882
X6.0994Y-3.8252
X6.0994Y-4.2465
X6.1994Y-3.8252
X6.1994Y-4.2465
X6.2994Y-3.8252
X6.2994Y-4.2465
X6.5Y-3.8882
X6.5Y-3.9882
X6.5Y-4.0882
X6.5Y-4.1882
X6.6Y-3.8882
X6.6Y-3.9882
X6.6Y-4.0882
X6.6Y-4.1882
T0
M30
