%TF.GenerationSoftware,KiCad,Pcbnew,(5.1.9)-1*%
%TF.CreationDate,2021-02-10T20:52:00+04:00*%
%TF.ProjectId,zx-mini-pcb-debug-module-spi-flash-v1,7a782d6d-696e-4692-9d70-63622d646562,rev?*%
%TF.SameCoordinates,Original*%
%TF.FileFunction,Soldermask,Bot*%
%TF.FilePolarity,Negative*%
%FSLAX46Y46*%
G04 Gerber Fmt 4.6, Leading zero omitted, Abs format (unit mm)*
G04 Created by KiCad (PCBNEW (5.1.9)-1) date 2021-02-10 20:52:00*
%MOMM*%
%LPD*%
G01*
G04 APERTURE LIST*
%ADD10O,1.700000X1.700000*%
%ADD11R,1.700000X1.700000*%
G04 APERTURE END LIST*
D10*
%TO.C,J2*%
X167640000Y-106380000D03*
X167640000Y-103840000D03*
X167640000Y-101300000D03*
D11*
X167640000Y-98760000D03*
%TD*%
D10*
%TO.C,J4*%
X165100000Y-106380000D03*
X165100000Y-103840000D03*
X165100000Y-101300000D03*
D11*
X165100000Y-98760000D03*
%TD*%
%TO.C,C1*%
G36*
G01*
X160605000Y-100310000D02*
X161555000Y-100310000D01*
G75*
G02*
X161805000Y-100560000I0J-250000D01*
G01*
X161805000Y-101060000D01*
G75*
G02*
X161555000Y-101310000I-250000J0D01*
G01*
X160605000Y-101310000D01*
G75*
G02*
X160355000Y-101060000I0J250000D01*
G01*
X160355000Y-100560000D01*
G75*
G02*
X160605000Y-100310000I250000J0D01*
G01*
G37*
G36*
G01*
X160605000Y-102210000D02*
X161555000Y-102210000D01*
G75*
G02*
X161805000Y-102460000I0J-250000D01*
G01*
X161805000Y-102960000D01*
G75*
G02*
X161555000Y-103210000I-250000J0D01*
G01*
X160605000Y-103210000D01*
G75*
G02*
X160355000Y-102960000I0J250000D01*
G01*
X160355000Y-102460000D01*
G75*
G02*
X160605000Y-102210000I250000J0D01*
G01*
G37*
%TD*%
%TO.C,R2*%
G36*
G01*
X157680000Y-98809998D02*
X157680000Y-99710002D01*
G75*
G02*
X157430002Y-99960000I-249998J0D01*
G01*
X156904998Y-99960000D01*
G75*
G02*
X156655000Y-99710002I0J249998D01*
G01*
X156655000Y-98809998D01*
G75*
G02*
X156904998Y-98560000I249998J0D01*
G01*
X157430002Y-98560000D01*
G75*
G02*
X157680000Y-98809998I0J-249998D01*
G01*
G37*
G36*
G01*
X159505000Y-98809998D02*
X159505000Y-99710002D01*
G75*
G02*
X159255002Y-99960000I-249998J0D01*
G01*
X158729998Y-99960000D01*
G75*
G02*
X158480000Y-99710002I0J249998D01*
G01*
X158480000Y-98809998D01*
G75*
G02*
X158729998Y-98560000I249998J0D01*
G01*
X159255002Y-98560000D01*
G75*
G02*
X159505000Y-98809998I0J-249998D01*
G01*
G37*
%TD*%
%TO.C,C2*%
G36*
G01*
X158605000Y-100310000D02*
X159555000Y-100310000D01*
G75*
G02*
X159805000Y-100560000I0J-250000D01*
G01*
X159805000Y-101060000D01*
G75*
G02*
X159555000Y-101310000I-250000J0D01*
G01*
X158605000Y-101310000D01*
G75*
G02*
X158355000Y-101060000I0J250000D01*
G01*
X158355000Y-100560000D01*
G75*
G02*
X158605000Y-100310000I250000J0D01*
G01*
G37*
G36*
G01*
X158605000Y-102210000D02*
X159555000Y-102210000D01*
G75*
G02*
X159805000Y-102460000I0J-250000D01*
G01*
X159805000Y-102960000D01*
G75*
G02*
X159555000Y-103210000I-250000J0D01*
G01*
X158605000Y-103210000D01*
G75*
G02*
X158355000Y-102960000I0J250000D01*
G01*
X158355000Y-102460000D01*
G75*
G02*
X158605000Y-102210000I250000J0D01*
G01*
G37*
%TD*%
%TO.C,J1*%
X147320000Y-98760000D03*
D10*
X147320000Y-101300000D03*
X147320000Y-103840000D03*
X147320000Y-106380000D03*
%TD*%
D11*
%TO.C,J3*%
X149860000Y-98760000D03*
D10*
X149860000Y-101300000D03*
X149860000Y-103840000D03*
X149860000Y-106380000D03*
%TD*%
D11*
%TO.C,J5*%
X160005000Y-107860000D03*
D10*
X157465000Y-107860000D03*
X154925000Y-107860000D03*
%TD*%
%TO.C,J6*%
X154925000Y-97160000D03*
X157465000Y-97160000D03*
D11*
X160005000Y-97160000D03*
%TD*%
%TO.C,R1*%
G36*
G01*
X154705000Y-102509998D02*
X154705000Y-103410002D01*
G75*
G02*
X154455002Y-103660000I-249998J0D01*
G01*
X153929998Y-103660000D01*
G75*
G02*
X153680000Y-103410002I0J249998D01*
G01*
X153680000Y-102509998D01*
G75*
G02*
X153929998Y-102260000I249998J0D01*
G01*
X154455002Y-102260000D01*
G75*
G02*
X154705000Y-102509998I0J-249998D01*
G01*
G37*
G36*
G01*
X152880000Y-102509998D02*
X152880000Y-103410002D01*
G75*
G02*
X152630002Y-103660000I-249998J0D01*
G01*
X152104998Y-103660000D01*
G75*
G02*
X151855000Y-103410002I0J249998D01*
G01*
X151855000Y-102509998D01*
G75*
G02*
X152104998Y-102260000I249998J0D01*
G01*
X152630002Y-102260000D01*
G75*
G02*
X152880000Y-102509998I0J-249998D01*
G01*
G37*
%TD*%
%TO.C,R3*%
G36*
G01*
X163130002Y-106560000D02*
X162229998Y-106560000D01*
G75*
G02*
X161980000Y-106310002I0J249998D01*
G01*
X161980000Y-105784998D01*
G75*
G02*
X162229998Y-105535000I249998J0D01*
G01*
X163130002Y-105535000D01*
G75*
G02*
X163380000Y-105784998I0J-249998D01*
G01*
X163380000Y-106310002D01*
G75*
G02*
X163130002Y-106560000I-249998J0D01*
G01*
G37*
G36*
G01*
X163130002Y-108385000D02*
X162229998Y-108385000D01*
G75*
G02*
X161980000Y-108135002I0J249998D01*
G01*
X161980000Y-107609998D01*
G75*
G02*
X162229998Y-107360000I249998J0D01*
G01*
X163130002Y-107360000D01*
G75*
G02*
X163380000Y-107609998I0J-249998D01*
G01*
X163380000Y-108135002D01*
G75*
G02*
X163130002Y-108385000I-249998J0D01*
G01*
G37*
%TD*%
%TO.C,R4*%
G36*
G01*
X152730002Y-108385000D02*
X151829998Y-108385000D01*
G75*
G02*
X151580000Y-108135002I0J249998D01*
G01*
X151580000Y-107609998D01*
G75*
G02*
X151829998Y-107360000I249998J0D01*
G01*
X152730002Y-107360000D01*
G75*
G02*
X152980000Y-107609998I0J-249998D01*
G01*
X152980000Y-108135002D01*
G75*
G02*
X152730002Y-108385000I-249998J0D01*
G01*
G37*
G36*
G01*
X152730002Y-106560000D02*
X151829998Y-106560000D01*
G75*
G02*
X151580000Y-106310002I0J249998D01*
G01*
X151580000Y-105784998D01*
G75*
G02*
X151829998Y-105535000I249998J0D01*
G01*
X152730002Y-105535000D01*
G75*
G02*
X152980000Y-105784998I0J-249998D01*
G01*
X152980000Y-106310002D01*
G75*
G02*
X152730002Y-106560000I-249998J0D01*
G01*
G37*
%TD*%
%TO.C,R5*%
G36*
G01*
X162229998Y-98460000D02*
X163130002Y-98460000D01*
G75*
G02*
X163380000Y-98709998I0J-249998D01*
G01*
X163380000Y-99235002D01*
G75*
G02*
X163130002Y-99485000I-249998J0D01*
G01*
X162229998Y-99485000D01*
G75*
G02*
X161980000Y-99235002I0J249998D01*
G01*
X161980000Y-98709998D01*
G75*
G02*
X162229998Y-98460000I249998J0D01*
G01*
G37*
G36*
G01*
X162229998Y-96635000D02*
X163130002Y-96635000D01*
G75*
G02*
X163380000Y-96884998I0J-249998D01*
G01*
X163380000Y-97410002D01*
G75*
G02*
X163130002Y-97660000I-249998J0D01*
G01*
X162229998Y-97660000D01*
G75*
G02*
X161980000Y-97410002I0J249998D01*
G01*
X161980000Y-96884998D01*
G75*
G02*
X162229998Y-96635000I249998J0D01*
G01*
G37*
%TD*%
%TO.C,R6*%
G36*
G01*
X152229998Y-96735000D02*
X153130002Y-96735000D01*
G75*
G02*
X153380000Y-96984998I0J-249998D01*
G01*
X153380000Y-97510002D01*
G75*
G02*
X153130002Y-97760000I-249998J0D01*
G01*
X152229998Y-97760000D01*
G75*
G02*
X151980000Y-97510002I0J249998D01*
G01*
X151980000Y-96984998D01*
G75*
G02*
X152229998Y-96735000I249998J0D01*
G01*
G37*
G36*
G01*
X152229998Y-98560000D02*
X153130002Y-98560000D01*
G75*
G02*
X153380000Y-98809998I0J-249998D01*
G01*
X153380000Y-99335002D01*
G75*
G02*
X153130002Y-99585000I-249998J0D01*
G01*
X152229998Y-99585000D01*
G75*
G02*
X151980000Y-99335002I0J249998D01*
G01*
X151980000Y-98809998D01*
G75*
G02*
X152229998Y-98560000I249998J0D01*
G01*
G37*
%TD*%
M02*
