EESchema Schematic File Version 4
EELAYER 30 0
EELAYER END
$Descr A4 11693 8268
encoding utf-8
Sheet 1 1
Title "zx-mini-pcb-debug-module-spi-flash-v1"
Date ""
Rev "1"
Comp ""
Comment1 ""
Comment2 ""
Comment3 ""
Comment4 ""
$EndDescr
$Comp
L power:GND #PWR08
U 1 1 5FEDF721
P 6150 3900
F 0 "#PWR08" H 6150 3650 50  0001 C CNN
F 1 "GND" H 6155 3727 50  0000 C CNN
F 2 "" H 6150 3900 50  0001 C CNN
F 3 "" H 6150 3900 50  0001 C CNN
	1    6150 3900
	1    0    0    -1  
$EndComp
$Comp
L power:GND #PWR09
U 1 1 5FFD4CBE
P 6400 2950
F 0 "#PWR09" H 6400 2700 50  0001 C CNN
F 1 "GND" H 6405 2777 50  0000 C CNN
F 2 "" H 6400 2950 50  0001 C CNN
F 3 "" H 6400 2950 50  0001 C CNN
	1    6400 2950
	1    0    0    -1  
$EndComp
$Comp
L Device:C C1
U 1 1 6002D898
P 6400 2800
F 0 "C1" H 6450 3000 50  0000 L CNN
F 1 "0.1uF" H 6450 2900 50  0000 L CNN
F 2 "Capacitor_SMD:C_0805_2012Metric" H 6438 2650 50  0001 C CNN
F 3 "~" H 6400 2800 50  0001 C CNN
	1    6400 2800
	1    0    0    -1  
$EndComp
$Comp
L power:+3.3V #PWR07
U 1 1 600598E4
P 6150 2600
F 0 "#PWR07" H 6150 2450 50  0001 C CNN
F 1 "+3.3V" H 6165 2773 50  0000 C CNN
F 2 "" H 6150 2600 50  0001 C CNN
F 3 "" H 6150 2600 50  0001 C CNN
	1    6150 2600
	1    0    0    -1  
$EndComp
$Comp
L Device:LED D1
U 1 1 600AA361
P 5200 4450
F 0 "D1" H 5200 4350 50  0000 C CNN
F 1 "TO-1608BC-MRE" H 5300 4300 50  0001 C CNN
F 2 "LED_SMD:LED_0603_1608Metric" H 5200 4450 50  0001 C CNN
F 3 "https://www.oasistek.com/pdf/TO-1608BC-PG_9201T057.pdf" H 5200 4450 50  0001 C CNN
	1    5200 4450
	1    0    0    1   
$EndComp
$Comp
L Device:R R2
U 1 1 600AA367
P 5550 4450
F 0 "R2" V 5450 4500 50  0000 R CNN
F 1 "470" V 5650 4500 50  0000 R CNN
F 2 "Resistor_SMD:R_0805_2012Metric" V 5480 4450 50  0001 C CNN
F 3 "~" H 5550 4450 50  0001 C CNN
	1    5550 4450
	0    -1   1    0   
$EndComp
Wire Wire Line
	2950 2850 3250 2850
Wire Wire Line
	2950 2950 3550 2950
$Comp
L Connector_Generic:Conn_01x04 J3
U 1 1 6010E021
P 3750 2950
F 0 "J3" H 3750 3150 50  0000 C CNN
F 1 "PLS-4" H 3750 2650 50  0000 C CNN
F 2 "Connector_PinHeader_2.54mm:PinHeader_1x04_P2.54mm_Vertical" H 3750 2950 50  0001 C CNN
F 3 "~" H 3750 2950 50  0001 C CNN
	1    3750 2950
	1    0    0    -1  
$EndComp
$Comp
L Connector_Generic:Conn_01x04 J1
U 1 1 6010E027
P 2750 2950
F 0 "J1" H 2750 3150 50  0000 C CNN
F 1 "PBS-4" H 2750 2650 50  0000 C CNN
F 2 "Connector_PinSocket_2.54mm:PinSocket_1x04_P2.54mm_Vertical" H 2750 2950 50  0001 C CNN
F 3 "~" H 2750 2950 50  0001 C CNN
	1    2750 2950
	-1   0    0    -1  
$EndComp
$Comp
L power:GND #PWR01
U 1 1 6010E02F
P 2950 3150
F 0 "#PWR01" H 2950 2900 50  0001 C CNN
F 1 "GND" V 2950 2950 50  0000 C CNN
F 2 "" H 2950 3150 50  0001 C CNN
F 3 "" H 2950 3150 50  0001 C CNN
	1    2950 3150
	0    -1   -1   0   
$EndComp
$Comp
L power:GND #PWR03
U 1 1 6010E035
P 3550 3150
F 0 "#PWR03" H 3550 2900 50  0001 C CNN
F 1 "GND" V 3550 2950 50  0000 C CNN
F 2 "" H 3550 3150 50  0001 C CNN
F 3 "" H 3550 3150 50  0001 C CNN
	1    3550 3150
	0    1    1    0   
$EndComp
$Comp
L Connector_Generic:Conn_01x04 J4
U 1 1 6012B735
P 3750 3850
F 0 "J4" H 3750 4050 50  0000 C CNN
F 1 "PLS-4" H 3750 3550 50  0000 C CNN
F 2 "Connector_PinHeader_2.54mm:PinHeader_1x04_P2.54mm_Vertical" H 3750 3850 50  0001 C CNN
F 3 "~" H 3750 3850 50  0001 C CNN
	1    3750 3850
	1    0    0    -1  
$EndComp
$Comp
L Connector_Generic:Conn_01x04 J2
U 1 1 6012B73B
P 2750 3850
F 0 "J2" H 2750 4050 50  0000 C CNN
F 1 "PBS-4" H 2750 3550 50  0000 C CNN
F 2 "Connector_PinSocket_2.54mm:PinSocket_1x04_P2.54mm_Vertical" H 2750 3850 50  0001 C CNN
F 3 "~" H 2750 3850 50  0001 C CNN
	1    2750 3850
	-1   0    0    -1  
$EndComp
$Comp
L Memory_Flash:W25Q128JVS U1
U 1 1 601F7AAD
P 6150 3500
F 0 "U1" H 5800 3850 50  0000 C CNN
F 1 "W25Q128JVS" H 5800 3150 50  0000 C CNN
F 2 "lib:SOIC-8_5.23x5.23mm_P1.27mm" H 6150 3500 50  0001 C CNN
F 3 "http://www.winbond.com/resource-files/w25q128jv_dtr%20revc%2003272018%20plus.pdf" H 6150 3500 50  0001 C CNN
	1    6150 3500
	1    0    0    -1  
$EndComp
Wire Wire Line
	6400 2650 6150 2650
Connection ~ 6150 2650
Wire Wire Line
	6150 2650 6150 2600
Wire Wire Line
	6150 2650 6150 3100
$Comp
L Device:C C2
U 1 1 602081F4
P 6750 2800
F 0 "C2" H 6800 3000 50  0000 L CNN
F 1 "4.7uF" H 6800 2900 50  0000 L CNN
F 2 "Capacitor_SMD:C_0805_2012Metric" H 6788 2650 50  0001 C CNN
F 3 "~" H 6750 2800 50  0001 C CNN
	1    6750 2800
	1    0    0    -1  
$EndComp
Wire Wire Line
	6400 2650 6750 2650
Connection ~ 6400 2650
$Comp
L power:GND #PWR010
U 1 1 6020A244
P 6750 2950
F 0 "#PWR010" H 6750 2700 50  0001 C CNN
F 1 "GND" H 6755 2777 50  0000 C CNN
F 2 "" H 6750 2950 50  0001 C CNN
F 3 "" H 6750 2950 50  0001 C CNN
	1    6750 2950
	1    0    0    -1  
$EndComp
$Comp
L Device:R R1
U 1 1 6020DD11
P 5300 3250
F 0 "R1" H 5250 3300 50  0000 R CNN
F 1 "4.7k" H 5250 3200 50  0000 R CNN
F 2 "Resistor_SMD:R_0805_2012Metric" V 5230 3250 50  0001 C CNN
F 3 "~" H 5300 3250 50  0001 C CNN
	1    5300 3250
	-1   0    0    -1  
$EndComp
Wire Wire Line
	5650 3400 5300 3400
Connection ~ 5300 3400
Wire Wire Line
	5300 3400 4850 3400
Text Label 4950 3400 0    50   ~ 0
CS
Wire Wire Line
	5650 3600 4850 3600
Text Label 4950 3600 0    50   ~ 0
CLK
$Comp
L power:+3.3V #PWR05
U 1 1 602105A2
P 5300 3100
F 0 "#PWR05" H 5300 2950 50  0001 C CNN
F 1 "+3.3V" H 5315 3273 50  0000 C CNN
F 2 "" H 5300 3100 50  0001 C CNN
F 3 "" H 5300 3100 50  0001 C CNN
	1    5300 3100
	1    0    0    -1  
$EndComp
Wire Wire Line
	6650 3300 7350 3300
Wire Wire Line
	6650 3400 7350 3400
Text Label 7000 3300 0    50   ~ 0
MOSI
Text Label 7000 3400 0    50   ~ 0
MISO
Wire Wire Line
	6650 3600 7350 3600
Wire Wire Line
	6650 3700 7350 3700
Text Label 7000 3600 0    50   ~ 0
WP
Text Label 7000 3700 0    50   ~ 0
HOLD
$Comp
L Connector_Generic:Conn_01x03 J5
U 1 1 60214DD7
P 8850 2750
F 0 "J5" H 8850 2950 50  0000 C CNN
F 1 "PLS-3" H 8850 2500 50  0000 C CNN
F 2 "Connector_PinHeader_2.54mm:PinHeader_1x03_P2.54mm_Vertical" H 8850 2750 50  0001 C CNN
F 3 "~" H 8850 2750 50  0001 C CNN
	1    8850 2750
	1    0    0    -1  
$EndComp
$Comp
L Device:R R3
U 1 1 602156D2
P 8450 2450
F 0 "R3" H 8400 2500 50  0000 R CNN
F 1 "4.7k" H 8400 2400 50  0000 R CNN
F 2 "Resistor_SMD:R_0805_2012Metric" V 8380 2450 50  0001 C CNN
F 3 "~" H 8450 2450 50  0001 C CNN
	1    8450 2450
	-1   0    0    1   
$EndComp
$Comp
L Device:R R4
U 1 1 6021613E
P 8450 3050
F 0 "R4" H 8400 3100 50  0000 R CNN
F 1 "4.7k" H 8400 3000 50  0000 R CNN
F 2 "Resistor_SMD:R_0805_2012Metric" V 8380 3050 50  0001 C CNN
F 3 "~" H 8450 3050 50  0001 C CNN
	1    8450 3050
	-1   0    0    -1  
$EndComp
$Comp
L power:+3.3V #PWR011
U 1 1 602169CA
P 8450 2300
F 0 "#PWR011" H 8450 2150 50  0001 C CNN
F 1 "+3.3V" H 8465 2473 50  0000 C CNN
F 2 "" H 8450 2300 50  0001 C CNN
F 3 "" H 8450 2300 50  0001 C CNN
	1    8450 2300
	1    0    0    -1  
$EndComp
$Comp
L power:GND #PWR012
U 1 1 60219FD6
P 8450 3200
F 0 "#PWR012" H 8450 2950 50  0001 C CNN
F 1 "GND" H 8455 3027 50  0000 C CNN
F 2 "" H 8450 3200 50  0001 C CNN
F 3 "" H 8450 3200 50  0001 C CNN
	1    8450 3200
	1    0    0    -1  
$EndComp
Wire Wire Line
	8450 2900 8450 2850
Wire Wire Line
	8450 2850 8650 2850
Wire Wire Line
	8450 2600 8450 2650
Wire Wire Line
	8450 2650 8650 2650
Wire Wire Line
	8650 2750 8100 2750
$Comp
L Connector_Generic:Conn_01x03 J6
U 1 1 6021C399
P 8850 4300
F 0 "J6" H 8850 4500 50  0000 C CNN
F 1 "PLS-3" H 8850 4050 50  0000 C CNN
F 2 "Connector_PinHeader_2.54mm:PinHeader_1x03_P2.54mm_Vertical" H 8850 4300 50  0001 C CNN
F 3 "~" H 8850 4300 50  0001 C CNN
	1    8850 4300
	1    0    0    -1  
$EndComp
$Comp
L Device:R R5
U 1 1 6021C39F
P 8450 4000
F 0 "R5" H 8400 4050 50  0000 R CNN
F 1 "4.7k" H 8400 3950 50  0000 R CNN
F 2 "Resistor_SMD:R_0805_2012Metric" V 8380 4000 50  0001 C CNN
F 3 "~" H 8450 4000 50  0001 C CNN
	1    8450 4000
	-1   0    0    1   
$EndComp
$Comp
L Device:R R6
U 1 1 6021C3A5
P 8450 4600
F 0 "R6" H 8400 4650 50  0000 R CNN
F 1 "4.7k" H 8400 4550 50  0000 R CNN
F 2 "Resistor_SMD:R_0805_2012Metric" V 8380 4600 50  0001 C CNN
F 3 "~" H 8450 4600 50  0001 C CNN
	1    8450 4600
	-1   0    0    -1  
$EndComp
$Comp
L power:+3.3V #PWR013
U 1 1 6021C3AB
P 8450 3850
F 0 "#PWR013" H 8450 3700 50  0001 C CNN
F 1 "+3.3V" H 8465 4023 50  0000 C CNN
F 2 "" H 8450 3850 50  0001 C CNN
F 3 "" H 8450 3850 50  0001 C CNN
	1    8450 3850
	1    0    0    -1  
$EndComp
$Comp
L power:GND #PWR014
U 1 1 6021C3B1
P 8450 4750
F 0 "#PWR014" H 8450 4500 50  0001 C CNN
F 1 "GND" H 8455 4577 50  0000 C CNN
F 2 "" H 8450 4750 50  0001 C CNN
F 3 "" H 8450 4750 50  0001 C CNN
	1    8450 4750
	1    0    0    -1  
$EndComp
Wire Wire Line
	8450 4450 8450 4400
Wire Wire Line
	8450 4400 8650 4400
Wire Wire Line
	8450 4150 8450 4200
Wire Wire Line
	8450 4200 8650 4200
Wire Wire Line
	8650 4300 8100 4300
Text Label 8150 2750 0    50   ~ 0
WP
Text Label 8150 4300 0    50   ~ 0
HOLD
$Comp
L power:GND #PWR04
U 1 1 6023C487
P 5050 4450
F 0 "#PWR04" H 5050 4200 50  0001 C CNN
F 1 "GND" H 5055 4277 50  0000 C CNN
F 2 "" H 5050 4450 50  0001 C CNN
F 3 "" H 5050 4450 50  0001 C CNN
	1    5050 4450
	0    1    1    0   
$EndComp
Wire Wire Line
	5350 4450 5400 4450
$Comp
L power:+3.3V #PWR06
U 1 1 6023E467
P 5700 4450
F 0 "#PWR06" H 5700 4300 50  0001 C CNN
F 1 "+3.3V" V 5700 4700 50  0000 C CNN
F 2 "" H 5700 4450 50  0001 C CNN
F 3 "" H 5700 4450 50  0001 C CNN
	1    5700 4450
	0    1    1    0   
$EndComp
$Comp
L power:+3.3V #PWR02
U 1 1 6023F940
P 3250 2850
F 0 "#PWR02" H 3250 2700 50  0001 C CNN
F 1 "+3.3V" H 3265 3023 50  0000 C CNN
F 2 "" H 3250 2850 50  0001 C CNN
F 3 "" H 3250 2850 50  0001 C CNN
	1    3250 2850
	1    0    0    -1  
$EndComp
Wire Wire Line
	2950 3050 3550 3050
Wire Wire Line
	2950 3750 3550 3750
Wire Wire Line
	2950 3850 3550 3850
Wire Wire Line
	2950 3950 3550 3950
Text Label 3150 3950 0    50   ~ 0
MOSI
Text Label 3150 3750 0    50   ~ 0
HOLD
Text Label 3150 3850 0    50   ~ 0
CLK
Text Label 3200 2950 0    50   ~ 0
CS
Text Label 3200 3050 0    50   ~ 0
WP
Wire Wire Line
	2950 4050 3550 4050
Text Label 3150 4050 0    50   ~ 0
MISO
Connection ~ 3250 2850
Wire Wire Line
	3250 2850 3550 2850
$EndSCHEMATC
