EESchema Schematic File Version 4
EELAYER 30 0
EELAYER END
$Descr A4 11693 8268
encoding utf-8
Sheet 1 1
Title "zx-mini-pcb-debug-module-port-expander-v1"
Date ""
Rev "1"
Comp ""
Comment1 ""
Comment2 ""
Comment3 ""
Comment4 ""
$EndDescr
$Comp
L Device:R R1
U 1 1 607AC187
P 800 1750
F 0 "R1" V 700 1800 50  0000 R CNN
F 1 "470" V 900 1800 50  0000 R CNN
F 2 "Resistor_SMD:R_0805_2012Metric" V 730 1750 50  0001 C CNN
F 3 "~" H 800 1750 50  0001 C CNN
	1    800  1750
	1    0    0    1   
$EndComp
$Comp
L Device:LED D1
U 1 1 607AC18D
P 800 2050
F 0 "D1" H 800 1950 50  0000 C CNN
F 1 "TO-1608BC-MRE" H 793 1886 50  0001 C CNN
F 2 "LED_SMD:LED_0603_1608Metric" H 800 2050 50  0001 C CNN
F 3 "https://www.oasistek.com/pdf/TO-1608BC-MRE_9201T098.pdf" H 800 2050 50  0001 C CNN
	1    800  2050
	0    1    -1   0   
$EndComp
Text Label 2400 2250 0    50   ~ 0
DA0
Text Label 2400 2350 0    50   ~ 0
DA1
Text Label 2400 2450 0    50   ~ 0
DA2
Text Label 2400 2550 0    50   ~ 0
DA3
Text Label 2400 2650 0    50   ~ 0
DA4
Text Label 2400 2750 0    50   ~ 0
DA5
Text Label 2400 2850 0    50   ~ 0
DA6
Text Label 2400 2950 0    50   ~ 0
DA7
$Comp
L power:GND #PWR08
U 1 1 60607C0B
P 1850 3350
F 0 "#PWR08" H 1850 3100 50  0001 C CNN
F 1 "GND" H 1855 3177 50  0000 C CNN
F 2 "" H 1850 3350 50  0001 C CNN
F 3 "" H 1850 3350 50  0001 C CNN
	1    1850 3350
	1    0    0    -1  
$EndComp
$Comp
L power:GND #PWR05
U 1 1 6060AA84
P 1500 1900
F 0 "#PWR05" H 1500 1650 50  0001 C CNN
F 1 "GND" H 1505 1727 50  0000 C CNN
F 2 "" H 1500 1900 50  0001 C CNN
F 3 "" H 1500 1900 50  0001 C CNN
	1    1500 1900
	1    0    0    -1  
$EndComp
$Comp
L Device:C C2
U 1 1 60609742
P 1500 1750
F 0 "C2" H 1550 1850 50  0000 L CNN
F 1 "0.1uF" H 1550 1650 50  0000 L CNN
F 2 "Capacitor_SMD:C_0805_2012Metric" H 1538 1600 50  0001 C CNN
F 3 "~" H 1500 1750 50  0001 C CNN
	1    1500 1750
	1    0    0    -1  
$EndComp
$Comp
L 74xx:74HC595 U1
U 1 1 6060223F
P 1850 2650
F 0 "U1" H 1950 3300 50  0000 C CNN
F 1 "74HC595" H 2050 3200 50  0000 C CNN
F 2 "Package_SO:SOIC-16_3.9x9.9mm_P1.27mm" H 1850 2650 50  0001 C CNN
F 3 "http://www.ti.com/lit/ds/symlink/sn74hc595.pdf" H 1850 2650 50  0001 C CNN
	1    1850 2650
	1    0    0    -1  
$EndComp
Wire Wire Line
	1850 2050 1850 1600
Wire Wire Line
	1850 1600 1500 1600
$Comp
L Device:C C1
U 1 1 6060E7D6
P 1200 1750
F 0 "C1" H 1250 1850 50  0000 L CNN
F 1 "1uF" H 1250 1650 50  0000 L CNN
F 2 "Capacitor_SMD:C_0805_2012Metric" H 1238 1600 50  0001 C CNN
F 3 "~" H 1200 1750 50  0001 C CNN
	1    1200 1750
	1    0    0    -1  
$EndComp
Wire Wire Line
	1200 1600 1500 1600
Connection ~ 1500 1600
Wire Wire Line
	1200 1900 1500 1900
Connection ~ 1500 1900
Wire Wire Line
	1450 2250 1150 2250
$Comp
L power:+5V #PWR04
U 1 1 606150A5
P 1500 1600
F 0 "#PWR04" H 1500 1450 50  0001 C CNN
F 1 "+5V" H 1515 1773 50  0000 C CNN
F 2 "" H 1500 1600 50  0001 C CNN
F 3 "" H 1500 1600 50  0001 C CNN
	1    1500 1600
	1    0    0    -1  
$EndComp
Text Label 1150 2250 0    50   ~ 0
DATA
$Comp
L power:GND #PWR03
U 1 1 60617DB8
P 1450 2850
F 0 "#PWR03" H 1450 2600 50  0001 C CNN
F 1 "GND" H 1455 2677 50  0000 C CNN
F 2 "" H 1450 2850 50  0001 C CNN
F 3 "" H 1450 2850 50  0001 C CNN
	1    1450 2850
	0    1    1    0   
$EndComp
Wire Wire Line
	1450 2750 1150 2750
Text Label 1150 2750 0    50   ~ 0
STROB
Wire Wire Line
	1450 2450 1150 2450
Text Label 1150 2450 0    50   ~ 0
CLK
$Comp
L power:+5V #PWR02
U 1 1 6061DF38
P 1450 2550
F 0 "#PWR02" H 1450 2400 50  0001 C CNN
F 1 "+5V" H 1465 2723 50  0000 C CNN
F 2 "" H 1450 2550 50  0001 C CNN
F 3 "" H 1450 2550 50  0001 C CNN
	1    1450 2550
	0    -1   -1   0   
$EndComp
$Comp
L power:GND #PWR01
U 1 1 606D9C25
P 800 2200
F 0 "#PWR01" H 800 1950 50  0001 C CNN
F 1 "GND" H 805 2027 50  0000 C CNN
F 2 "" H 800 2200 50  0001 C CNN
F 3 "" H 800 2200 50  0001 C CNN
	1    800  2200
	1    0    0    -1  
$EndComp
$Comp
L power:+5V #PWR012
U 1 1 6064B160
P 3100 2550
F 0 "#PWR012" H 3100 2400 50  0001 C CNN
F 1 "+5V" H 3115 2723 50  0000 C CNN
F 2 "" H 3100 2550 50  0001 C CNN
F 3 "" H 3100 2550 50  0001 C CNN
	1    3100 2550
	0    -1   -1   0   
$EndComp
Text Label 2800 2450 0    50   ~ 0
CLK
Wire Wire Line
	3100 2450 2800 2450
Text Label 2800 2750 0    50   ~ 0
STROB
Wire Wire Line
	3100 2750 2800 2750
$Comp
L power:GND #PWR013
U 1 1 6064B156
P 3100 2850
F 0 "#PWR013" H 3100 2600 50  0001 C CNN
F 1 "GND" H 3105 2677 50  0000 C CNN
F 2 "" H 3100 2850 50  0001 C CNN
F 3 "" H 3100 2850 50  0001 C CNN
	1    3100 2850
	0    1    1    0   
$EndComp
$Comp
L 74xx:74HC595 U2
U 1 1 6064B13C
P 3500 2650
F 0 "U2" H 3600 3300 50  0000 C CNN
F 1 "74HC595" H 3700 3200 50  0000 C CNN
F 2 "Package_SO:SOIC-16_3.9x9.9mm_P1.27mm" H 3500 2650 50  0001 C CNN
F 3 "http://www.ti.com/lit/ds/symlink/sn74hc595.pdf" H 3500 2650 50  0001 C CNN
	1    3500 2650
	1    0    0    -1  
$EndComp
$Comp
L power:GND #PWR017
U 1 1 6064B12A
P 3500 3350
F 0 "#PWR017" H 3500 3100 50  0001 C CNN
F 1 "GND" H 3505 3177 50  0000 C CNN
F 2 "" H 3500 3350 50  0001 C CNN
F 3 "" H 3500 3350 50  0001 C CNN
	1    3500 3350
	1    0    0    -1  
$EndComp
Wire Wire Line
	2250 2250 2600 2250
Wire Wire Line
	2250 2350 2600 2350
Wire Wire Line
	2250 2450 2600 2450
Wire Wire Line
	2250 2550 2600 2550
Wire Wire Line
	2250 2650 2600 2650
Wire Wire Line
	2250 2750 2600 2750
Wire Wire Line
	2250 2850 2600 2850
Wire Wire Line
	2250 2950 2600 2950
Wire Wire Line
	2250 3150 2700 3150
Wire Wire Line
	2700 3150 2700 2250
Wire Wire Line
	2700 2250 3100 2250
Connection ~ 4500 2000
$Comp
L power:+5V #PWR021
U 1 1 60656B19
P 4750 2550
F 0 "#PWR021" H 4750 2400 50  0001 C CNN
F 1 "+5V" H 4765 2723 50  0000 C CNN
F 2 "" H 4750 2550 50  0001 C CNN
F 3 "" H 4750 2550 50  0001 C CNN
	1    4750 2550
	0    -1   -1   0   
$EndComp
Text Label 4450 2450 0    50   ~ 0
CLK
Wire Wire Line
	4750 2450 4450 2450
Text Label 4450 2750 0    50   ~ 0
STROB
Wire Wire Line
	4750 2750 4450 2750
$Comp
L power:GND #PWR022
U 1 1 60656B23
P 4750 2850
F 0 "#PWR022" H 4750 2600 50  0001 C CNN
F 1 "GND" H 4755 2677 50  0000 C CNN
F 2 "" H 4750 2850 50  0001 C CNN
F 3 "" H 4750 2850 50  0001 C CNN
	1    4750 2850
	0    1    1    0   
$EndComp
$Comp
L power:+5V #PWR023
U 1 1 60656B29
P 4800 1700
F 0 "#PWR023" H 4800 1550 50  0001 C CNN
F 1 "+5V" H 4815 1873 50  0000 C CNN
F 2 "" H 4800 1700 50  0001 C CNN
F 3 "" H 4800 1700 50  0001 C CNN
	1    4800 1700
	1    0    0    -1  
$EndComp
Wire Wire Line
	4500 2000 4800 2000
Connection ~ 4800 1700
Wire Wire Line
	4500 1700 4800 1700
$Comp
L Device:C C5
U 1 1 60656B32
P 4500 1850
F 0 "C5" H 4550 1950 50  0000 L CNN
F 1 "1uF" H 4550 1750 50  0000 L CNN
F 2 "Capacitor_SMD:C_0805_2012Metric" H 4538 1700 50  0001 C CNN
F 3 "~" H 4500 1850 50  0001 C CNN
	1    4500 1850
	1    0    0    -1  
$EndComp
Wire Wire Line
	5150 1700 4800 1700
Wire Wire Line
	5150 2050 5150 1700
$Comp
L 74xx:74HC595 U3
U 1 1 60656B3A
P 5150 2650
F 0 "U3" H 5250 3300 50  0000 C CNN
F 1 "74HC595" H 5350 3200 50  0000 C CNN
F 2 "Package_SO:SOIC-16_3.9x9.9mm_P1.27mm" H 5150 2650 50  0001 C CNN
F 3 "http://www.ti.com/lit/ds/symlink/sn74hc595.pdf" H 5150 2650 50  0001 C CNN
	1    5150 2650
	1    0    0    -1  
$EndComp
$Comp
L Device:C C6
U 1 1 60656B40
P 4800 1850
F 0 "C6" H 4850 1950 50  0000 L CNN
F 1 "0.1uF" H 4850 1750 50  0000 L CNN
F 2 "Capacitor_SMD:C_0805_2012Metric" H 4838 1700 50  0001 C CNN
F 3 "~" H 4800 1850 50  0001 C CNN
	1    4800 1850
	1    0    0    -1  
$EndComp
$Comp
L power:GND #PWR020
U 1 1 60656B46
P 4500 2000
F 0 "#PWR020" H 4500 1750 50  0001 C CNN
F 1 "GND" H 4505 1827 50  0000 C CNN
F 2 "" H 4500 2000 50  0001 C CNN
F 3 "" H 4500 2000 50  0001 C CNN
	1    4500 2000
	1    0    0    -1  
$EndComp
$Comp
L power:GND #PWR024
U 1 1 60656B4C
P 5150 3350
F 0 "#PWR024" H 5150 3100 50  0001 C CNN
F 1 "GND" H 5155 3177 50  0000 C CNN
F 2 "" H 5150 3350 50  0001 C CNN
F 3 "" H 5150 3350 50  0001 C CNN
	1    5150 3350
	1    0    0    -1  
$EndComp
Wire Wire Line
	3900 3150 4350 3150
Wire Wire Line
	4350 3150 4350 2250
Wire Wire Line
	4350 2250 4750 2250
$Comp
L power:+5V #PWR026
U 1 1 6065CD75
P 6400 2550
F 0 "#PWR026" H 6400 2400 50  0001 C CNN
F 1 "+5V" H 6415 2723 50  0000 C CNN
F 2 "" H 6400 2550 50  0001 C CNN
F 3 "" H 6400 2550 50  0001 C CNN
	1    6400 2550
	0    -1   -1   0   
$EndComp
Text Label 6100 2450 0    50   ~ 0
CLK
Wire Wire Line
	6400 2450 6100 2450
Text Label 6100 2750 0    50   ~ 0
STROB
Wire Wire Line
	6400 2750 6100 2750
$Comp
L power:GND #PWR027
U 1 1 6065CD7F
P 6400 2850
F 0 "#PWR027" H 6400 2600 50  0001 C CNN
F 1 "GND" H 6405 2677 50  0000 C CNN
F 2 "" H 6400 2850 50  0001 C CNN
F 3 "" H 6400 2850 50  0001 C CNN
	1    6400 2850
	0    1    1    0   
$EndComp
$Comp
L 74xx:74HC595 U4
U 1 1 6065CD96
P 6800 2650
F 0 "U4" H 6900 3300 50  0000 C CNN
F 1 "74HC595" H 7000 3200 50  0000 C CNN
F 2 "Package_SO:SOIC-16_3.9x9.9mm_P1.27mm" H 6800 2650 50  0001 C CNN
F 3 "http://www.ti.com/lit/ds/symlink/sn74hc595.pdf" H 6800 2650 50  0001 C CNN
	1    6800 2650
	1    0    0    -1  
$EndComp
$Comp
L power:GND #PWR031
U 1 1 6065CDA8
P 6800 3350
F 0 "#PWR031" H 6800 3100 50  0001 C CNN
F 1 "GND" H 6805 3177 50  0000 C CNN
F 2 "" H 6800 3350 50  0001 C CNN
F 3 "" H 6800 3350 50  0001 C CNN
	1    6800 3350
	1    0    0    -1  
$EndComp
Wire Wire Line
	5550 3150 6000 3150
Wire Wire Line
	6000 3150 6000 2250
Wire Wire Line
	6000 2250 6400 2250
Wire Wire Line
	800  1600 1200 1600
Connection ~ 1200 1600
Connection ~ 7800 2000
$Comp
L power:+5V #PWR035
U 1 1 606850C4
P 8050 2550
F 0 "#PWR035" H 8050 2400 50  0001 C CNN
F 1 "+5V" H 8065 2723 50  0000 C CNN
F 2 "" H 8050 2550 50  0001 C CNN
F 3 "" H 8050 2550 50  0001 C CNN
	1    8050 2550
	0    -1   -1   0   
$EndComp
Text Label 7750 2450 0    50   ~ 0
CLK
Wire Wire Line
	8050 2450 7750 2450
Text Label 7750 2750 0    50   ~ 0
STROB
Wire Wire Line
	8050 2750 7750 2750
$Comp
L power:GND #PWR036
U 1 1 606850CE
P 8050 2850
F 0 "#PWR036" H 8050 2600 50  0001 C CNN
F 1 "GND" H 8055 2677 50  0000 C CNN
F 2 "" H 8050 2850 50  0001 C CNN
F 3 "" H 8050 2850 50  0001 C CNN
	1    8050 2850
	0    1    1    0   
$EndComp
$Comp
L power:+5V #PWR037
U 1 1 606850D4
P 8100 1700
F 0 "#PWR037" H 8100 1550 50  0001 C CNN
F 1 "+5V" H 8115 1873 50  0000 C CNN
F 2 "" H 8100 1700 50  0001 C CNN
F 3 "" H 8100 1700 50  0001 C CNN
	1    8100 1700
	1    0    0    -1  
$EndComp
Wire Wire Line
	7800 2000 8100 2000
Connection ~ 8100 1700
Wire Wire Line
	7800 1700 8100 1700
$Comp
L Device:C C9
U 1 1 606850DD
P 7800 1850
F 0 "C9" H 7850 1950 50  0000 L CNN
F 1 "1uF" H 7850 1750 50  0000 L CNN
F 2 "Capacitor_SMD:C_0805_2012Metric" H 7838 1700 50  0001 C CNN
F 3 "~" H 7800 1850 50  0001 C CNN
	1    7800 1850
	1    0    0    -1  
$EndComp
Wire Wire Line
	8450 1700 8100 1700
Wire Wire Line
	8450 2050 8450 1700
$Comp
L 74xx:74HC595 U5
U 1 1 606850E5
P 8450 2650
F 0 "U5" H 8550 3300 50  0000 C CNN
F 1 "74HC595" H 8650 3200 50  0000 C CNN
F 2 "Package_SO:SOIC-16_3.9x9.9mm_P1.27mm" H 8450 2650 50  0001 C CNN
F 3 "http://www.ti.com/lit/ds/symlink/sn74hc595.pdf" H 8450 2650 50  0001 C CNN
	1    8450 2650
	1    0    0    -1  
$EndComp
$Comp
L Device:C C10
U 1 1 606850EB
P 8100 1850
F 0 "C10" H 8150 1950 50  0000 L CNN
F 1 "0.1uF" H 8150 1750 50  0000 L CNN
F 2 "Capacitor_SMD:C_0805_2012Metric" H 8138 1700 50  0001 C CNN
F 3 "~" H 8100 1850 50  0001 C CNN
	1    8100 1850
	1    0    0    -1  
$EndComp
$Comp
L power:GND #PWR034
U 1 1 606850F1
P 7800 2000
F 0 "#PWR034" H 7800 1750 50  0001 C CNN
F 1 "GND" H 7805 1827 50  0000 C CNN
F 2 "" H 7800 2000 50  0001 C CNN
F 3 "" H 7800 2000 50  0001 C CNN
	1    7800 2000
	1    0    0    -1  
$EndComp
$Comp
L power:GND #PWR040
U 1 1 606850F7
P 8450 3350
F 0 "#PWR040" H 8450 3100 50  0001 C CNN
F 1 "GND" H 8455 3177 50  0000 C CNN
F 2 "" H 8450 3350 50  0001 C CNN
F 3 "" H 8450 3350 50  0001 C CNN
	1    8450 3350
	1    0    0    -1  
$EndComp
Wire Wire Line
	7200 3150 7650 3150
Wire Wire Line
	7650 3150 7650 2250
Wire Wire Line
	7650 2250 8050 2250
Text Label 4050 2250 0    50   ~ 0
DA8
Text Label 4050 2350 0    50   ~ 0
DA9
Text Label 4050 2450 0    50   ~ 0
DA10
Text Label 4050 2550 0    50   ~ 0
DA11
Text Label 4050 2650 0    50   ~ 0
DA12
Text Label 4050 2750 0    50   ~ 0
DA13
Text Label 4050 2850 0    50   ~ 0
DA14
Text Label 4050 2950 0    50   ~ 0
DA15
Wire Wire Line
	3900 2250 4250 2250
Wire Wire Line
	3900 2350 4250 2350
Wire Wire Line
	3900 2450 4250 2450
Wire Wire Line
	3900 2550 4250 2550
Wire Wire Line
	3900 2650 4250 2650
Wire Wire Line
	3900 2750 4250 2750
Wire Wire Line
	3900 2850 4250 2850
Wire Wire Line
	3900 2950 4250 2950
Text Label 5700 2250 0    50   ~ 0
DA16
Text Label 5700 2350 0    50   ~ 0
DA17
Text Label 5700 2450 0    50   ~ 0
DA18
Text Label 5700 2550 0    50   ~ 0
DA19
Text Label 5700 2650 0    50   ~ 0
DA20
Text Label 5700 2750 0    50   ~ 0
DA21
Text Label 5700 2850 0    50   ~ 0
DA22
Text Label 5700 2950 0    50   ~ 0
DA23
Wire Wire Line
	5550 2250 5900 2250
Wire Wire Line
	5550 2350 5900 2350
Wire Wire Line
	5550 2450 5900 2450
Wire Wire Line
	5550 2550 5900 2550
Wire Wire Line
	5550 2650 5900 2650
Wire Wire Line
	5550 2750 5900 2750
Wire Wire Line
	5550 2850 5900 2850
Wire Wire Line
	5550 2950 5900 2950
Text Label 7350 2250 0    50   ~ 0
DA24
Text Label 7350 2350 0    50   ~ 0
DA25
Text Label 7350 2450 0    50   ~ 0
DA26
Text Label 7350 2550 0    50   ~ 0
DA27
Text Label 7350 2650 0    50   ~ 0
DA28
Text Label 7350 2750 0    50   ~ 0
DA29
Text Label 7350 2850 0    50   ~ 0
DA30
Text Label 7350 2950 0    50   ~ 0
DA31
Wire Wire Line
	7200 2250 7550 2250
Wire Wire Line
	7200 2350 7550 2350
Wire Wire Line
	7200 2450 7550 2450
Wire Wire Line
	7200 2550 7550 2550
Wire Wire Line
	7200 2650 7550 2650
Wire Wire Line
	7200 2750 7550 2750
Wire Wire Line
	7200 2850 7550 2850
Wire Wire Line
	7200 2950 7550 2950
Text Label 9000 2250 0    50   ~ 0
DA32
Text Label 9000 2350 0    50   ~ 0
DA33
Text Label 9000 2450 0    50   ~ 0
DA34
Text Label 9000 2550 0    50   ~ 0
DA35
Text Label 9000 2650 0    50   ~ 0
DA36
Text Label 9000 2750 0    50   ~ 0
DA37
Text Label 9000 2850 0    50   ~ 0
DA38
Text Label 9000 2950 0    50   ~ 0
DA39
Wire Wire Line
	8850 2250 9200 2250
Wire Wire Line
	8850 2350 9200 2350
Wire Wire Line
	8850 2450 9200 2450
Wire Wire Line
	8850 2550 9200 2550
Wire Wire Line
	8850 2650 9200 2650
Wire Wire Line
	8850 2750 9200 2750
Wire Wire Line
	8850 2850 9200 2850
Wire Wire Line
	8850 2950 9200 2950
$Comp
L Connector_Generic:Conn_02x15_Odd_Even J2
U 1 1 607095F2
P 4400 4950
F 0 "J2" H 4500 5750 50  0000 C CNN
F 1 "PLD-30" H 4450 4150 50  0000 C CNN
F 2 "Connector_PinHeader_2.54mm:PinHeader_2x15_P2.54mm_Vertical" H 4400 4950 50  0001 C CNN
F 3 "~" H 4400 4950 50  0001 C CNN
	1    4400 4950
	1    0    0    -1  
$EndComp
$Comp
L power:GND #PWR010
U 1 1 607512E9
P 3050 5650
F 0 "#PWR010" H 3050 5400 50  0001 C CNN
F 1 "GND" V 3055 5477 50  0000 C CNN
F 2 "" H 3050 5650 50  0001 C CNN
F 3 "" H 3050 5650 50  0001 C CNN
	1    3050 5650
	0    -1   -1   0   
$EndComp
$Comp
L power:GND #PWR07
U 1 1 60753E6B
P 2550 5650
F 0 "#PWR07" H 2550 5400 50  0001 C CNN
F 1 "GND" V 2555 5477 50  0000 C CNN
F 2 "" H 2550 5650 50  0001 C CNN
F 3 "" H 2550 5650 50  0001 C CNN
	1    2550 5650
	0    1    1    0   
$EndComp
$Comp
L power:+5V #PWR06
U 1 1 607577FB
P 2550 4250
F 0 "#PWR06" H 2550 4100 50  0001 C CNN
F 1 "+5V" H 2565 4423 50  0000 C CNN
F 2 "" H 2550 4250 50  0001 C CNN
F 3 "" H 2550 4250 50  0001 C CNN
	1    2550 4250
	1    0    0    -1  
$EndComp
$Comp
L Connector_Generic:Conn_02x15_Odd_Even J1
U 1 1 606F8C0B
P 2750 4950
F 0 "J1" H 2850 5750 50  0000 C CNN
F 1 "PBD-30" H 2800 4150 50  0000 C CNN
F 2 "Connector_PinSocket_2.54mm:PinSocket_2x15_P2.54mm_Vertical" H 2750 4950 50  0001 C CNN
F 3 "~" H 2750 4950 50  0001 C CNN
	1    2750 4950
	1    0    0    -1  
$EndComp
$Comp
L power:+5V #PWR09
U 1 1 6075A0B9
P 3050 4250
F 0 "#PWR09" H 3050 4100 50  0001 C CNN
F 1 "+5V" H 3065 4423 50  0000 C CNN
F 2 "" H 3050 4250 50  0001 C CNN
F 3 "" H 3050 4250 50  0001 C CNN
	1    3050 4250
	1    0    0    -1  
$EndComp
Text Label 3100 4450 0    50   ~ 0
DA0
Wire Wire Line
	3050 4350 3400 4350
Wire Wire Line
	3050 4450 3400 4450
Wire Wire Line
	3050 4550 3400 4550
Wire Wire Line
	3050 4650 3400 4650
Wire Wire Line
	3050 4750 3400 4750
Wire Wire Line
	3050 4850 3400 4850
Wire Wire Line
	3050 4950 3400 4950
Wire Wire Line
	3050 5050 3400 5050
Wire Wire Line
	3050 5150 3400 5150
Wire Wire Line
	3050 5250 3400 5250
Wire Wire Line
	3050 5350 3400 5350
Wire Wire Line
	3050 5450 3400 5450
Wire Wire Line
	3050 5550 3400 5550
Wire Wire Line
	2200 4350 2550 4350
Wire Wire Line
	2200 4450 2550 4450
Wire Wire Line
	2200 4550 2550 4550
Wire Wire Line
	2200 4650 2550 4650
Wire Wire Line
	2200 4750 2550 4750
Wire Wire Line
	2200 4850 2550 4850
Wire Wire Line
	2200 4950 2550 4950
Wire Wire Line
	2200 5050 2550 5050
Wire Wire Line
	2200 5150 2550 5150
Wire Wire Line
	2200 5250 2550 5250
Wire Wire Line
	2200 5350 2550 5350
Wire Wire Line
	2200 5450 2550 5450
Wire Wire Line
	2200 5550 2550 5550
Text Label 3100 4350 0    50   ~ 0
DATA
Text Label 2200 4450 0    50   ~ 0
CLK
Text Label 2200 4350 0    50   ~ 0
STROB
Text Label 2200 4550 0    50   ~ 0
DA1
Text Label 3100 4550 0    50   ~ 0
DA2
Text Label 2200 4650 0    50   ~ 0
DA3
Text Label 3100 4650 0    50   ~ 0
DA4
Text Label 2200 4750 0    50   ~ 0
DA5
Text Label 3100 4750 0    50   ~ 0
DA6
Text Label 2200 4850 0    50   ~ 0
DA7
Text Label 3100 4850 0    50   ~ 0
DA8
Text Label 2200 4950 0    50   ~ 0
DA9
Text Label 3100 4950 0    50   ~ 0
DA10
Text Label 2200 5050 0    50   ~ 0
DA11
Text Label 3100 5050 0    50   ~ 0
DA12
Text Label 2200 5150 0    50   ~ 0
DA13
Text Label 3100 5150 0    50   ~ 0
DA14
Text Label 2200 5250 0    50   ~ 0
DA15
Text Label 3100 5250 0    50   ~ 0
DA16
Text Label 2200 5350 0    50   ~ 0
DA17
Text Label 3100 5350 0    50   ~ 0
DA18
Text Label 2200 5450 0    50   ~ 0
DA19
$Comp
L power:+5V #PWR015
U 1 1 60801C6C
P 4200 4250
F 0 "#PWR015" H 4200 4100 50  0001 C CNN
F 1 "+5V" H 4215 4423 50  0000 C CNN
F 2 "" H 4200 4250 50  0001 C CNN
F 3 "" H 4200 4250 50  0001 C CNN
	1    4200 4250
	1    0    0    -1  
$EndComp
$Comp
L power:+5V #PWR018
U 1 1 60801C72
P 4700 4250
F 0 "#PWR018" H 4700 4100 50  0001 C CNN
F 1 "+5V" H 4715 4423 50  0000 C CNN
F 2 "" H 4700 4250 50  0001 C CNN
F 3 "" H 4700 4250 50  0001 C CNN
	1    4700 4250
	1    0    0    -1  
$EndComp
$Comp
L power:GND #PWR019
U 1 1 6080B2B9
P 4700 5650
F 0 "#PWR019" H 4700 5400 50  0001 C CNN
F 1 "GND" V 4705 5477 50  0000 C CNN
F 2 "" H 4700 5650 50  0001 C CNN
F 3 "" H 4700 5650 50  0001 C CNN
	1    4700 5650
	0    -1   -1   0   
$EndComp
$Comp
L power:GND #PWR016
U 1 1 6081464C
P 4200 5650
F 0 "#PWR016" H 4200 5400 50  0001 C CNN
F 1 "GND" V 4205 5477 50  0000 C CNN
F 2 "" H 4200 5650 50  0001 C CNN
F 3 "" H 4200 5650 50  0001 C CNN
	1    4200 5650
	0    1    1    0   
$EndComp
Text Label 3100 5450 0    50   ~ 0
DA20
Text Label 2200 5550 0    50   ~ 0
DA21
$Comp
L Connector_Generic:Conn_02x15_Odd_Even J3
U 1 1 60828723
P 7700 4950
F 0 "J3" H 7800 5750 50  0000 C CNN
F 1 "PLD-30" H 7750 4150 50  0000 C CNN
F 2 "Connector_PinHeader_2.54mm:PinHeader_2x15_P2.54mm_Vertical" H 7700 4950 50  0001 C CNN
F 3 "~" H 7700 4950 50  0001 C CNN
	1    7700 4950
	1    0    0    -1  
$EndComp
$Comp
L power:GND #PWR042
U 1 1 60828729
P 9650 5650
F 0 "#PWR042" H 9650 5400 50  0001 C CNN
F 1 "GND" V 9655 5477 50  0000 C CNN
F 2 "" H 9650 5650 50  0001 C CNN
F 3 "" H 9650 5650 50  0001 C CNN
	1    9650 5650
	0    -1   -1   0   
$EndComp
$Comp
L power:GND #PWR039
U 1 1 6082872F
P 9150 5650
F 0 "#PWR039" H 9150 5400 50  0001 C CNN
F 1 "GND" V 9155 5477 50  0000 C CNN
F 2 "" H 9150 5650 50  0001 C CNN
F 3 "" H 9150 5650 50  0001 C CNN
	1    9150 5650
	0    1    1    0   
$EndComp
$Comp
L Connector_Generic:Conn_02x15_Odd_Even J4
U 1 1 6082873B
P 9350 4950
F 0 "J4" H 9450 5750 50  0000 C CNN
F 1 "PBD-30" H 9400 4150 50  0000 C CNN
F 2 "Connector_PinSocket_2.54mm:PinSocket_2x15_P2.54mm_Vertical" H 9350 4950 50  0001 C CNN
F 3 "~" H 9350 4950 50  0001 C CNN
	1    9350 4950
	1    0    0    -1  
$EndComp
$Comp
L power:GND #PWR033
U 1 1 6082879E
P 8000 5650
F 0 "#PWR033" H 8000 5400 50  0001 C CNN
F 1 "GND" V 8005 5477 50  0000 C CNN
F 2 "" H 8000 5650 50  0001 C CNN
F 3 "" H 8000 5650 50  0001 C CNN
	1    8000 5650
	0    -1   -1   0   
$EndComp
$Comp
L power:GND #PWR030
U 1 1 608287A4
P 7500 5650
F 0 "#PWR030" H 7500 5400 50  0001 C CNN
F 1 "GND" V 7505 5477 50  0000 C CNN
F 2 "" H 7500 5650 50  0001 C CNN
F 3 "" H 7500 5650 50  0001 C CNN
	1    7500 5650
	0    1    1    0   
$EndComp
Text Label 3100 5550 0    50   ~ 0
DA22
Text Label 4750 4450 0    50   ~ 0
DA0
Wire Wire Line
	4700 4350 5050 4350
Wire Wire Line
	4700 4450 5050 4450
Wire Wire Line
	4700 4550 5050 4550
Wire Wire Line
	4700 4650 5050 4650
Wire Wire Line
	4700 4750 5050 4750
Wire Wire Line
	4700 4850 5050 4850
Wire Wire Line
	4700 4950 5050 4950
Wire Wire Line
	4700 5050 5050 5050
Wire Wire Line
	4700 5150 5050 5150
Wire Wire Line
	4700 5250 5050 5250
Wire Wire Line
	4700 5350 5050 5350
Wire Wire Line
	4700 5450 5050 5450
Wire Wire Line
	4700 5550 5050 5550
Text Label 3850 4350 0    50   ~ 0
STROB
Text Label 4750 4550 0    50   ~ 0
DA2
Text Label 4750 4650 0    50   ~ 0
DA4
Text Label 4750 4750 0    50   ~ 0
DA6
Text Label 4750 4850 0    50   ~ 0
DA8
Text Label 4750 4950 0    50   ~ 0
DA10
Text Label 4750 5050 0    50   ~ 0
DA12
Text Label 4750 5150 0    50   ~ 0
DA14
Text Label 4750 5250 0    50   ~ 0
DA16
Text Label 4750 5350 0    50   ~ 0
DA18
Text Label 4750 5450 0    50   ~ 0
DA20
Text Label 4750 5550 0    50   ~ 0
DA22
Wire Wire Line
	3850 4350 4200 4350
Wire Wire Line
	3850 4450 4200 4450
Wire Wire Line
	3850 4550 4200 4550
Wire Wire Line
	3850 4650 4200 4650
Wire Wire Line
	3850 4750 4200 4750
Wire Wire Line
	3850 4850 4200 4850
Wire Wire Line
	3850 4950 4200 4950
Wire Wire Line
	3850 5050 4200 5050
Wire Wire Line
	3850 5150 4200 5150
Wire Wire Line
	3850 5250 4200 5250
Wire Wire Line
	3850 5350 4200 5350
Wire Wire Line
	3850 5450 4200 5450
Wire Wire Line
	3850 5550 4200 5550
Text Label 4750 4350 0    50   ~ 0
DATA
Text Label 3850 4450 0    50   ~ 0
CLK
Text Label 3850 4550 0    50   ~ 0
DA1
Text Label 3850 4650 0    50   ~ 0
DA3
Text Label 3850 4750 0    50   ~ 0
DA5
Text Label 3850 4850 0    50   ~ 0
DA7
Text Label 3850 4950 0    50   ~ 0
DA9
Text Label 3850 5050 0    50   ~ 0
DA11
Text Label 3850 5150 0    50   ~ 0
DA13
Text Label 3850 5250 0    50   ~ 0
DA15
Text Label 3850 5350 0    50   ~ 0
DA17
Text Label 3850 5450 0    50   ~ 0
DA19
Text Label 3850 5550 0    50   ~ 0
DA21
Wire Wire Line
	7150 4750 7500 4750
Wire Wire Line
	7150 4850 7500 4850
Wire Wire Line
	7150 4950 7500 4950
Wire Wire Line
	7150 5050 7500 5050
Wire Wire Line
	7150 5150 7500 5150
Wire Wire Line
	7150 5250 7500 5250
Wire Wire Line
	7150 5350 7500 5350
Wire Wire Line
	7150 5450 7500 5450
Wire Wire Line
	7150 5550 7500 5550
Text Label 7150 5150 0    50   ~ 0
DA23
Text Label 7150 5250 0    50   ~ 0
DA25
Text Label 7150 5350 0    50   ~ 0
DA27
Text Label 7150 5450 0    50   ~ 0
DA29
Text Label 7150 5550 0    50   ~ 0
DA31
Text Label 7150 4750 0    50   ~ 0
DA33
Text Label 7150 4850 0    50   ~ 0
DA35
Text Label 7150 4950 0    50   ~ 0
DA37
Text Label 7150 5050 0    50   ~ 0
DA39
Wire Wire Line
	8000 4750 8350 4750
Wire Wire Line
	8000 4850 8350 4850
Wire Wire Line
	8000 4950 8350 4950
Wire Wire Line
	8000 5050 8350 5050
Wire Wire Line
	8000 5250 8350 5250
Wire Wire Line
	8000 5350 8350 5350
Wire Wire Line
	8000 5450 8350 5450
Wire Wire Line
	8000 5550 8350 5550
Text Label 8100 5250 0    50   ~ 0
DA24
Text Label 8100 5350 0    50   ~ 0
DA26
Text Label 8100 5450 0    50   ~ 0
DA28
Text Label 8100 5550 0    50   ~ 0
DA30
Text Label 8100 4750 0    50   ~ 0
DA32
Text Label 8100 4850 0    50   ~ 0
DA34
$Comp
L power:+5V #PWR011
U 1 1 60ADA158
P 3500 2050
F 0 "#PWR011" H 3500 1900 50  0001 C CNN
F 1 "+5V" H 3515 2223 50  0000 C CNN
F 2 "" H 3500 2050 50  0001 C CNN
F 3 "" H 3500 2050 50  0001 C CNN
	1    3500 2050
	1    0    0    -1  
$EndComp
$Comp
L power:+5V #PWR014
U 1 1 60AFFBE5
P 6800 2050
F 0 "#PWR014" H 6800 1900 50  0001 C CNN
F 1 "+5V" H 6815 2223 50  0000 C CNN
F 2 "" H 6800 2050 50  0001 C CNN
F 3 "" H 6800 2050 50  0001 C CNN
	1    6800 2050
	1    0    0    -1  
$EndComp
$Comp
L power:+5V #PWR025
U 1 1 60B2F8DB
P 9700 2550
F 0 "#PWR025" H 9700 2400 50  0001 C CNN
F 1 "+5V" H 9715 2723 50  0000 C CNN
F 2 "" H 9700 2550 50  0001 C CNN
F 3 "" H 9700 2550 50  0001 C CNN
	1    9700 2550
	0    -1   -1   0   
$EndComp
Text Label 9400 2450 0    50   ~ 0
CLK
Wire Wire Line
	9700 2450 9400 2450
Text Label 9400 2750 0    50   ~ 0
STROB
Wire Wire Line
	9700 2750 9400 2750
$Comp
L power:GND #PWR028
U 1 1 60B2F8E5
P 9700 2850
F 0 "#PWR028" H 9700 2600 50  0001 C CNN
F 1 "GND" H 9705 2677 50  0000 C CNN
F 2 "" H 9700 2850 50  0001 C CNN
F 3 "" H 9700 2850 50  0001 C CNN
	1    9700 2850
	0    1    1    0   
$EndComp
$Comp
L 74xx:74HC595 U6
U 1 1 60B2F8FC
P 10100 2650
F 0 "U6" H 10200 3300 50  0000 C CNN
F 1 "74HC595" H 10300 3200 50  0000 C CNN
F 2 "Package_SO:SOIC-16_3.9x9.9mm_P1.27mm" H 10100 2650 50  0001 C CNN
F 3 "http://www.ti.com/lit/ds/symlink/sn74hc595.pdf" H 10100 2650 50  0001 C CNN
	1    10100 2650
	1    0    0    -1  
$EndComp
$Comp
L power:GND #PWR044
U 1 1 60B2F90E
P 10100 3350
F 0 "#PWR044" H 10100 3100 50  0001 C CNN
F 1 "GND" H 10105 3177 50  0000 C CNN
F 2 "" H 10100 3350 50  0001 C CNN
F 3 "" H 10100 3350 50  0001 C CNN
	1    10100 3350
	1    0    0    -1  
$EndComp
Wire Wire Line
	8850 3150 9300 3150
Wire Wire Line
	9300 3150 9300 2250
Wire Wire Line
	9300 2250 9700 2250
Text Label 10650 2250 0    50   ~ 0
DA40
Text Label 10650 2350 0    50   ~ 0
DA41
Text Label 10650 2450 0    50   ~ 0
DA42
Text Label 10650 2550 0    50   ~ 0
DA43
Text Label 10650 2650 0    50   ~ 0
DA44
Text Label 10650 2750 0    50   ~ 0
DA45
Text Label 10650 2850 0    50   ~ 0
DA46
Text Label 10650 2950 0    50   ~ 0
DA47
Wire Wire Line
	10500 2250 10850 2250
Wire Wire Line
	10500 2350 10850 2350
Wire Wire Line
	10500 2450 10850 2450
Wire Wire Line
	10500 2550 10850 2550
Wire Wire Line
	10500 2650 10850 2650
Wire Wire Line
	10500 2750 10850 2750
Wire Wire Line
	10500 2850 10850 2850
Wire Wire Line
	10500 2950 10850 2950
$Comp
L power:+5V #PWR043
U 1 1 60B58D56
P 10100 2050
F 0 "#PWR043" H 10100 1900 50  0001 C CNN
F 1 "+5V" H 10115 2223 50  0000 C CNN
F 2 "" H 10100 2050 50  0001 C CNN
F 3 "" H 10100 2050 50  0001 C CNN
	1    10100 2050
	1    0    0    -1  
$EndComp
Wire Wire Line
	7150 4550 7500 4550
Wire Wire Line
	7150 4450 7500 4450
Wire Wire Line
	7150 4350 7500 4350
Wire Wire Line
	8000 4350 8350 4350
Wire Wire Line
	8000 4450 8350 4450
Wire Wire Line
	8000 4550 8350 4550
Text Label 8100 4550 0    50   ~ 0
DA46
Text Label 7150 4450 0    50   ~ 0
DA45
Text Label 8100 4450 0    50   ~ 0
DA44
Text Label 7150 4350 0    50   ~ 0
DA43
Text Label 8100 4350 0    50   ~ 0
DA42
Text Label 8100 4950 0    50   ~ 0
DA36
Text Label 8100 5050 0    50   ~ 0
DA38
Text Label 7150 4550 0    50   ~ 0
DA47
Wire Wire Line
	8000 4250 8350 4250
Wire Wire Line
	7150 4250 7500 4250
Text Label 8100 4250 0    50   ~ 0
DA40
Text Label 7150 4250 0    50   ~ 0
DA41
Wire Wire Line
	9650 4750 10000 4750
Wire Wire Line
	9650 4850 10000 4850
Wire Wire Line
	9650 4950 10000 4950
Wire Wire Line
	9650 5050 10000 5050
Wire Wire Line
	9650 5250 10000 5250
Wire Wire Line
	9650 5350 10000 5350
Wire Wire Line
	9650 5450 10000 5450
Wire Wire Line
	9650 5550 10000 5550
Text Label 9750 5250 0    50   ~ 0
DA24
Text Label 9750 5350 0    50   ~ 0
DA26
Text Label 9750 5450 0    50   ~ 0
DA28
Text Label 9750 5550 0    50   ~ 0
DA30
Text Label 9750 4750 0    50   ~ 0
DA32
Text Label 9750 4850 0    50   ~ 0
DA34
Wire Wire Line
	9650 4350 10000 4350
Wire Wire Line
	9650 4450 10000 4450
Wire Wire Line
	9650 4550 10000 4550
Text Label 9750 4550 0    50   ~ 0
DA46
Text Label 9750 4450 0    50   ~ 0
DA44
Text Label 9750 4350 0    50   ~ 0
DA42
Text Label 9750 4950 0    50   ~ 0
DA36
Text Label 9750 5050 0    50   ~ 0
DA38
Wire Wire Line
	9650 4250 10000 4250
Text Label 9750 4250 0    50   ~ 0
DA40
Wire Wire Line
	8800 4750 9150 4750
Wire Wire Line
	8800 4850 9150 4850
Wire Wire Line
	8800 4950 9150 4950
Wire Wire Line
	8800 5050 9150 5050
Wire Wire Line
	8800 5150 9150 5150
Wire Wire Line
	8800 5250 9150 5250
Wire Wire Line
	8800 5350 9150 5350
Wire Wire Line
	8800 5450 9150 5450
Wire Wire Line
	8800 5550 9150 5550
Text Label 8800 5150 0    50   ~ 0
DA23
Text Label 8800 5250 0    50   ~ 0
DA25
Text Label 8800 5350 0    50   ~ 0
DA27
Text Label 8800 5450 0    50   ~ 0
DA29
Text Label 8800 5550 0    50   ~ 0
DA31
Text Label 8800 4750 0    50   ~ 0
DA33
Text Label 8800 4850 0    50   ~ 0
DA35
Text Label 8800 4950 0    50   ~ 0
DA37
Text Label 8800 5050 0    50   ~ 0
DA39
Wire Wire Line
	8800 4550 9150 4550
Wire Wire Line
	8800 4450 9150 4450
Wire Wire Line
	8800 4350 9150 4350
Text Label 8800 4450 0    50   ~ 0
DA45
Text Label 8800 4350 0    50   ~ 0
DA43
Text Label 8800 4550 0    50   ~ 0
DA47
Wire Wire Line
	8800 4250 9150 4250
Text Label 8800 4250 0    50   ~ 0
DA41
NoConn ~ 9650 5150
NoConn ~ 9150 4650
NoConn ~ 8000 5150
NoConn ~ 7500 4650
NoConn ~ 8000 4650
NoConn ~ 9650 4650
$EndSCHEMATC
