%TF.GenerationSoftware,KiCad,Pcbnew,(5.1.9)-1*%
%TF.CreationDate,2021-02-10T20:44:14+04:00*%
%TF.ProjectId,zx-mini-pcb-debug-module-keyboard-v1,7a782d6d-696e-4692-9d70-63622d646562,rev?*%
%TF.SameCoordinates,Original*%
%TF.FileFunction,Soldermask,Top*%
%TF.FilePolarity,Negative*%
%FSLAX46Y46*%
G04 Gerber Fmt 4.6, Leading zero omitted, Abs format (unit mm)*
G04 Created by KiCad (PCBNEW (5.1.9)-1) date 2021-02-10 20:44:14*
%MOMM*%
%LPD*%
G01*
G04 APERTURE LIST*
%ADD10R,1.550000X1.300000*%
%ADD11O,1.700000X1.700000*%
%ADD12R,1.700000X1.700000*%
G04 APERTURE END LIST*
D10*
%TO.C,SW3*%
X151080000Y-112750000D03*
X151080000Y-108250000D03*
X143120000Y-108250000D03*
X143120000Y-112750000D03*
%TD*%
%TO.C,SW5*%
X153620000Y-95750000D03*
X153620000Y-91250000D03*
X161580000Y-91250000D03*
X161580000Y-95750000D03*
%TD*%
%TO.C,SW2*%
X151080000Y-95750000D03*
X151080000Y-91250000D03*
X143120000Y-91250000D03*
X143120000Y-95750000D03*
%TD*%
%TO.C,SW4*%
X153620000Y-87250000D03*
X153620000Y-82750000D03*
X161580000Y-82750000D03*
X161580000Y-87250000D03*
%TD*%
%TO.C,D1*%
G36*
G01*
X158365000Y-75643750D02*
X158365000Y-76156250D01*
G75*
G02*
X158146250Y-76375000I-218750J0D01*
G01*
X157708750Y-76375000D01*
G75*
G02*
X157490000Y-76156250I0J218750D01*
G01*
X157490000Y-75643750D01*
G75*
G02*
X157708750Y-75425000I218750J0D01*
G01*
X158146250Y-75425000D01*
G75*
G02*
X158365000Y-75643750I0J-218750D01*
G01*
G37*
G36*
G01*
X156790000Y-75643750D02*
X156790000Y-76156250D01*
G75*
G02*
X156571250Y-76375000I-218750J0D01*
G01*
X156133750Y-76375000D01*
G75*
G02*
X155915000Y-76156250I0J218750D01*
G01*
X155915000Y-75643750D01*
G75*
G02*
X156133750Y-75425000I218750J0D01*
G01*
X156571250Y-75425000D01*
G75*
G02*
X156790000Y-75643750I0J-218750D01*
G01*
G37*
%TD*%
%TO.C,R2*%
G36*
G01*
X157440000Y-78250002D02*
X157440000Y-77349998D01*
G75*
G02*
X157689998Y-77100000I249998J0D01*
G01*
X158215002Y-77100000D01*
G75*
G02*
X158465000Y-77349998I0J-249998D01*
G01*
X158465000Y-78250002D01*
G75*
G02*
X158215002Y-78500000I-249998J0D01*
G01*
X157689998Y-78500000D01*
G75*
G02*
X157440000Y-78250002I0J249998D01*
G01*
G37*
G36*
G01*
X155615000Y-78250002D02*
X155615000Y-77349998D01*
G75*
G02*
X155864998Y-77100000I249998J0D01*
G01*
X156390002Y-77100000D01*
G75*
G02*
X156640000Y-77349998I0J-249998D01*
G01*
X156640000Y-78250002D01*
G75*
G02*
X156390002Y-78500000I-249998J0D01*
G01*
X155864998Y-78500000D01*
G75*
G02*
X155615000Y-78250002I0J249998D01*
G01*
G37*
%TD*%
%TO.C,SW1*%
X143120000Y-79250000D03*
X143120000Y-74750000D03*
X151080000Y-74750000D03*
X151080000Y-79250000D03*
%TD*%
%TO.C,SW6*%
X153620000Y-104250000D03*
X153620000Y-99750000D03*
X161580000Y-99750000D03*
X161580000Y-104250000D03*
%TD*%
%TO.C,SW7*%
X153620000Y-112750000D03*
X153620000Y-108250000D03*
X161580000Y-108250000D03*
X161580000Y-112750000D03*
%TD*%
%TO.C,SW8*%
X172080000Y-79250000D03*
X172080000Y-74750000D03*
X164120000Y-74750000D03*
X164120000Y-79250000D03*
%TD*%
%TO.C,SW9*%
X172080000Y-95750000D03*
X172080000Y-91250000D03*
X164120000Y-91250000D03*
X164120000Y-95750000D03*
%TD*%
%TO.C,SW10*%
X172080000Y-112750000D03*
X172080000Y-108250000D03*
X164120000Y-108250000D03*
X164120000Y-112750000D03*
%TD*%
%TO.C,SW11*%
X132620000Y-79250000D03*
X132620000Y-74750000D03*
X140580000Y-74750000D03*
X140580000Y-79250000D03*
%TD*%
%TO.C,SW12*%
X140580000Y-95750000D03*
X140580000Y-91250000D03*
X132620000Y-91250000D03*
X132620000Y-95750000D03*
%TD*%
%TO.C,SW13*%
X132620000Y-112750000D03*
X132620000Y-108250000D03*
X140580000Y-108250000D03*
X140580000Y-112750000D03*
%TD*%
D11*
%TO.C,J1*%
X129640000Y-104960000D03*
X129640000Y-102420000D03*
X129640000Y-99880000D03*
X129640000Y-97340000D03*
X129640000Y-94800000D03*
X129640000Y-92260000D03*
X129640000Y-89720000D03*
X129640000Y-87180000D03*
X129640000Y-84640000D03*
D12*
X129640000Y-82100000D03*
%TD*%
%TO.C,J2*%
X175360000Y-82100000D03*
D11*
X175360000Y-84640000D03*
X175360000Y-87180000D03*
X175360000Y-89720000D03*
X175360000Y-92260000D03*
X175360000Y-94800000D03*
X175360000Y-97340000D03*
X175360000Y-99880000D03*
X175360000Y-102420000D03*
X175360000Y-104960000D03*
%TD*%
M02*
