EESchema Schematic File Version 4
EELAYER 30 0
EELAYER END
$Descr A4 11693 8268
encoding utf-8
Sheet 1 1
Title "zx-mini-pcb-debug-module-keyboard-v1"
Date ""
Rev "1"
Comp ""
Comment1 ""
Comment2 ""
Comment3 ""
Comment4 ""
$EndDescr
$Comp
L lib:TCA8418 D2
U 1 1 601185C4
P 4700 2650
F 0 "D2" H 5125 2775 50  0000 C CNN
F 1 "TCA8418" H 5125 2684 50  0000 C CNN
F 2 "Package_DFN_QFN:QFN-24-1EP_4x4mm_P0.5mm_EP2.6x2.6mm" H 4950 2750 50  0001 C CNN
F 3 "https://www.ti.com/lit/ds/symlink/tca8418.pdf?ts=1611413910720&ref_url=https%253A%252F%252Fwww.google.com%252F" H 4950 2750 50  0001 C CNN
	1    4700 2650
	1    0    0    -1  
$EndComp
$Comp
L Switch:SW_Push SW6
U 1 1 6011AED3
P 8100 4050
F 0 "SW6" H 8050 4250 50  0000 C CNN
F 1 "KLS7-TS6604" V 8150 4600 50  0001 C CNN
F 2 "Button_Switch_SMD:SW_SPST_PTS645" H 8100 4250 50  0001 C CNN
F 3 "~" H 8100 4250 50  0001 C CNN
	1    8100 4050
	1    0    0    -1  
$EndComp
$Comp
L Switch:SW_Push SW8
U 1 1 601244DA
P 8600 2550
F 0 "SW8" H 8550 2750 50  0000 C CNN
F 1 "KLS7-TS6604" V 8650 3100 50  0001 C CNN
F 2 "Button_Switch_SMD:SW_SPST_PTS645" H 8600 2750 50  0001 C CNN
F 3 "~" H 8600 2750 50  0001 C CNN
	1    8600 2550
	1    0    0    -1  
$EndComp
$Comp
L Switch:SW_Push SW4
U 1 1 6012C476
P 8100 3050
F 0 "SW4" H 8050 3250 50  0000 C CNN
F 1 "KLS7-TS6604" V 8150 3600 50  0001 C CNN
F 2 "Button_Switch_SMD:SW_SPST_PTS645" H 8100 3250 50  0001 C CNN
F 3 "~" H 8100 3250 50  0001 C CNN
	1    8100 3050
	1    0    0    -1  
$EndComp
$Comp
L Switch:SW_Push SW2
U 1 1 601343A9
P 7600 3550
F 0 "SW2" H 7550 3750 50  0000 C CNN
F 1 "KLS7-TS6604" V 7650 4100 50  0001 C CNN
F 2 "Button_Switch_SMD:SW_SPST_PTS645" H 7600 3750 50  0001 C CNN
F 3 "~" H 7600 3750 50  0001 C CNN
	1    7600 3550
	1    0    0    -1  
$EndComp
$Comp
L Switch:SW_Push SW5
U 1 1 6013AD4D
P 8100 3550
F 0 "SW5" H 8050 3750 50  0000 C CNN
F 1 "KLS7-TS6604" V 8150 4100 50  0001 C CNN
F 2 "Button_Switch_SMD:SW_SPST_PTS645" H 8100 3750 50  0001 C CNN
F 3 "~" H 8100 3750 50  0001 C CNN
	1    8100 3550
	1    0    0    -1  
$EndComp
$Comp
L Switch:SW_Push SW9
U 1 1 6014185F
P 8600 3550
F 0 "SW9" H 8550 3750 50  0000 C CNN
F 1 "KLS7-TS6604" V 8650 4100 50  0001 C CNN
F 2 "Button_Switch_SMD:SW_SPST_PTS645" H 8600 3750 50  0001 C CNN
F 3 "~" H 8600 3750 50  0001 C CNN
	1    8600 3550
	1    0    0    -1  
$EndComp
$Comp
L Switch:SW_Push SW1
U 1 1 6014AAD4
P 7600 2550
F 0 "SW1" H 7550 2750 50  0000 C CNN
F 1 "KLS7-TS6604" V 7650 3100 50  0001 C CNN
F 2 "Button_Switch_SMD:SW_SPST_PTS645" H 7600 2750 50  0001 C CNN
F 3 "~" H 7600 2750 50  0001 C CNN
	1    7600 2550
	1    0    0    -1  
$EndComp
$Comp
L Switch:SW_Push SW3
U 1 1 60152D89
P 7600 4550
F 0 "SW3" H 7550 4750 50  0000 C CNN
F 1 "KLS7-TS6604" V 7650 5100 50  0001 C CNN
F 2 "Button_Switch_SMD:SW_SPST_PTS645" H 7600 4750 50  0001 C CNN
F 3 "~" H 7600 4750 50  0001 C CNN
	1    7600 4550
	1    0    0    -1  
$EndComp
$Comp
L Switch:SW_Push SW7
U 1 1 601595CF
P 8100 4550
F 0 "SW7" H 8050 4750 50  0000 C CNN
F 1 "KLS7-TS6604" V 8150 5100 50  0001 C CNN
F 2 "Button_Switch_SMD:SW_SPST_PTS645" H 8100 4750 50  0001 C CNN
F 3 "~" H 8100 4750 50  0001 C CNN
	1    8100 4550
	1    0    0    -1  
$EndComp
$Comp
L Switch:SW_Push SW10
U 1 1 6015FE06
P 8600 4550
F 0 "SW10" H 8550 4750 50  0000 C CNN
F 1 "KLS7-TS6604" V 8650 5100 50  0001 C CNN
F 2 "Button_Switch_SMD:SW_SPST_PTS645" H 8600 4750 50  0001 C CNN
F 3 "~" H 8600 4750 50  0001 C CNN
	1    8600 4550
	1    0    0    -1  
$EndComp
$Comp
L Switch:SW_Push SW11
U 1 1 6016764C
P 9600 2550
F 0 "SW11" H 9550 2750 50  0000 C CNN
F 1 "KLS7-TS6604" V 9650 3100 50  0001 C CNN
F 2 "Button_Switch_SMD:SW_SPST_PTS645" H 9600 2750 50  0001 C CNN
F 3 "~" H 9600 2750 50  0001 C CNN
	1    9600 2550
	1    0    0    -1  
$EndComp
$Comp
L Switch:SW_Push SW12
U 1 1 6016E096
P 9600 3550
F 0 "SW12" H 9550 3750 50  0000 C CNN
F 1 "KLS7-TS6604" V 9650 4100 50  0001 C CNN
F 2 "Button_Switch_SMD:SW_SPST_PTS645" H 9600 3750 50  0001 C CNN
F 3 "~" H 9600 3750 50  0001 C CNN
	1    9600 3550
	1    0    0    -1  
$EndComp
$Comp
L Switch:SW_Push SW13
U 1 1 601749D0
P 9600 4550
F 0 "SW13" H 9550 4750 50  0000 C CNN
F 1 "KLS7-TS6604" V 9650 5100 50  0001 C CNN
F 2 "Button_Switch_SMD:SW_SPST_PTS645" H 9600 4750 50  0001 C CNN
F 3 "~" H 9600 4750 50  0001 C CNN
	1    9600 4550
	1    0    0    -1  
$EndComp
Text Notes 7500 2700 0    50   ~ 0
Return
Text Notes 8500 2700 0    50   ~ 0
Menu
Text Notes 8000 3700 0    50   ~ 0
Enter
Text Notes 7550 3700 0    50   ~ 0
Left
Text Notes 8500 3700 0    50   ~ 0
Right
Text Notes 8000 4200 0    50   ~ 0
Down
Text Notes 8050 3200 0    50   ~ 0
Up
Text Notes 7450 4700 0    50   ~ 0
Back
Text Notes 8400 4700 0    50   ~ 0
Forward
Text Notes 7900 4700 0    50   ~ 0
Stop/Start
Text Notes 9450 2800 0    197  ~ 0
+
Text Notes 9450 3800 0    197  ~ 0
-
Text Notes 9400 4700 0    50   ~ 0
Lock/Power
Wire Wire Line
	4100 4550 4400 4550
$Comp
L Device:C C2
U 1 1 601862CF
P 4400 4400
F 0 "C2" H 4450 4500 50  0000 L CNN
F 1 "0.1uF" H 4450 4300 50  0000 L CNN
F 2 "Capacitor_SMD:C_0805_2012Metric" H 4438 4250 50  0001 C CNN
F 3 "~" H 4400 4400 50  0001 C CNN
	1    4400 4400
	1    0    0    -1  
$EndComp
$Comp
L Device:C C1
U 1 1 601862D5
P 4100 4400
F 0 "C1" H 4150 4500 50  0000 L CNN
F 1 "1uF" H 4150 4300 50  0000 L CNN
F 2 "Capacitor_SMD:C_0805_2012Metric" H 4138 4250 50  0001 C CNN
F 3 "~" H 4100 4400 50  0001 C CNN
	1    4100 4400
	1    0    0    -1  
$EndComp
Connection ~ 4400 4550
Wire Wire Line
	4700 4550 4400 4550
Wire Wire Line
	4100 4250 4400 4250
Connection ~ 4400 4250
Wire Wire Line
	4400 4250 4700 4250
Wire Wire Line
	4000 4250 4100 4250
Connection ~ 4100 4250
Wire Wire Line
	4700 2750 4450 2750
Text Label 3950 2750 0    50   ~ 0
INT
$Comp
L Device:R R1
U 1 1 601B3129
P 4450 2500
F 0 "R1" H 4380 2454 50  0000 R CNN
F 1 "10k" H 4380 2545 50  0000 R CNN
F 2 "Resistor_SMD:R_0805_2012Metric" V 4380 2500 50  0001 C CNN
F 3 "~" H 4450 2500 50  0001 C CNN
	1    4450 2500
	1    0    0    -1  
$EndComp
Wire Wire Line
	4450 2650 4450 2750
Connection ~ 4450 2750
Wire Wire Line
	4450 2750 3850 2750
$Comp
L power:+3.3V #PWR07
U 1 1 601C2E48
P 4450 2350
F 0 "#PWR07" H 4450 2200 50  0001 C CNN
F 1 "+3.3V" V 4465 2478 50  0000 L CNN
F 2 "" H 4450 2350 50  0001 C CNN
F 3 "" H 4450 2350 50  0001 C CNN
	1    4450 2350
	1    0    0    -1  
$EndComp
Wire Wire Line
	4700 3100 3850 3100
Wire Wire Line
	4700 3200 3850 3200
Text Label 3950 3100 0    50   ~ 0
SDA
Text Label 3950 3200 0    50   ~ 0
SCL
$Comp
L power:+3.3V #PWR09
U 1 1 601EAF43
P 4700 3950
F 0 "#PWR09" H 4700 3800 50  0001 C CNN
F 1 "+3.3V" V 4715 4078 50  0000 L CNN
F 2 "" H 4700 3950 50  0001 C CNN
F 3 "" H 4700 3950 50  0001 C CNN
	1    4700 3950
	0    -1   -1   0   
$EndComp
Wire Wire Line
	7400 2550 7400 2750
Wire Wire Line
	7400 2750 7900 2750
Wire Wire Line
	9400 2750 9400 2550
Wire Wire Line
	8400 2550 8400 2750
Connection ~ 8400 2750
Wire Wire Line
	8400 2750 9400 2750
Wire Wire Line
	7800 2550 7800 3550
Connection ~ 7800 3550
Wire Wire Line
	8300 3050 8300 3550
Connection ~ 8300 3550
Wire Wire Line
	8300 3550 8300 4050
Connection ~ 8300 4050
Wire Wire Line
	8300 4050 8300 4550
Wire Wire Line
	8800 3550 8800 4550
Wire Wire Line
	7400 3550 7400 3750
Wire Wire Line
	7400 3750 7900 3750
Wire Wire Line
	9400 3750 9400 3550
Wire Wire Line
	7900 3550 7900 3750
Connection ~ 7900 3750
Wire Wire Line
	7900 3750 8400 3750
Wire Wire Line
	8400 3550 8400 3750
Connection ~ 8400 3750
Wire Wire Line
	8400 3750 9400 3750
Wire Wire Line
	8800 2550 8800 3550
Connection ~ 8800 3550
Wire Wire Line
	9800 2550 9800 3550
Connection ~ 9800 3550
Wire Wire Line
	9800 3550 9800 4550
Connection ~ 7400 3750
Connection ~ 7400 2750
Wire Wire Line
	7400 4550 7400 4750
Wire Wire Line
	7400 4750 7900 4750
Wire Wire Line
	9400 4750 9400 4550
Wire Wire Line
	7900 4550 7900 4750
Connection ~ 7900 4750
Wire Wire Line
	7900 4750 8400 4750
Wire Wire Line
	8400 4550 8400 4750
Connection ~ 8400 4750
Wire Wire Line
	8400 4750 9400 4750
Wire Wire Line
	6950 3650 6950 4950
Wire Wire Line
	6950 4950 7800 4950
Wire Wire Line
	7800 4950 7800 4550
Connection ~ 7800 4550
Wire Wire Line
	6850 3750 6850 5050
Wire Wire Line
	6850 5050 8300 5050
Wire Wire Line
	8300 5050 8300 4550
Connection ~ 8300 4550
Wire Wire Line
	6750 3850 6750 5150
Wire Wire Line
	6750 5150 8800 5150
Wire Wire Line
	8800 5150 8800 4550
Connection ~ 8800 4550
Wire Wire Line
	6650 3950 6650 5250
Wire Wire Line
	6650 5250 9800 5250
Wire Wire Line
	9800 5250 9800 4550
Connection ~ 9800 4550
$Comp
L Device:R R4
U 1 1 60371452
P 5650 4950
F 0 "R4" H 5550 5000 50  0000 R CNN
F 1 "10k" H 5550 4900 50  0000 R CNN
F 2 "Resistor_SMD:R_0805_2012Metric" V 5580 4950 50  0001 C CNN
F 3 "~" H 5650 4950 50  0001 C CNN
	1    5650 4950
	1    0    0    -1  
$EndComp
$Comp
L Device:R R8
U 1 1 6037CD1F
P 5950 4950
F 0 "R8" V 5850 4950 50  0000 R CNN
F 1 "10k" V 5850 5150 50  0000 R CNN
F 2 "Resistor_SMD:R_0805_2012Metric" V 5880 4950 50  0001 C CNN
F 3 "~" H 5950 4950 50  0001 C CNN
	1    5950 4950
	1    0    0    -1  
$EndComp
$Comp
L Device:R R11
U 1 1 6039FC81
P 6250 4950
F 0 "R11" V 6150 5000 50  0000 R CNN
F 1 "10k" V 6150 5200 50  0000 R CNN
F 2 "Resistor_SMD:R_0805_2012Metric" V 6180 4950 50  0001 C CNN
F 3 "~" H 6250 4950 50  0001 C CNN
	1    6250 4950
	1    0    0    -1  
$EndComp
$Comp
L Device:R R6
U 1 1 603AB249
P 5800 5300
F 0 "R6" V 5700 5250 50  0000 R CNN
F 1 "10k" V 5700 5450 50  0000 R CNN
F 2 "Resistor_SMD:R_0805_2012Metric" V 5730 5300 50  0001 C CNN
F 3 "~" H 5800 5300 50  0001 C CNN
	1    5800 5300
	1    0    0    -1  
$EndComp
$Comp
L Device:R R10
U 1 1 603B6694
P 6100 5300
F 0 "R10" V 6000 5250 50  0000 R CNN
F 1 "10k" V 6000 5450 50  0000 R CNN
F 2 "Resistor_SMD:R_0805_2012Metric" V 6030 5300 50  0001 C CNN
F 3 "~" H 6100 5300 50  0001 C CNN
	1    6100 5300
	1    0    0    -1  
$EndComp
$Comp
L Device:R R12
U 1 1 603C19CF
P 6400 5300
F 0 "R12" H 6600 5350 50  0000 R CNN
F 1 "10k" H 6600 5250 50  0000 R CNN
F 2 "Resistor_SMD:R_0805_2012Metric" V 6330 5300 50  0001 C CNN
F 3 "~" H 6400 5300 50  0001 C CNN
	1    6400 5300
	1    0    0    -1  
$EndComp
Wire Wire Line
	5650 4550 5550 4550
Wire Wire Line
	5550 3950 6650 3950
Wire Wire Line
	5550 3850 6750 3850
Wire Wire Line
	5550 3750 6850 3750
Wire Wire Line
	5550 3650 6950 3650
Wire Wire Line
	5550 2750 7400 2750
Wire Wire Line
	5650 4550 5650 4800
Wire Wire Line
	5550 4450 5800 4450
Wire Wire Line
	5800 4450 5800 5150
Wire Wire Line
	5550 4350 5950 4350
Wire Wire Line
	5950 4350 5950 4800
Wire Wire Line
	5550 4250 6100 4250
Wire Wire Line
	6100 4250 6100 5150
Wire Wire Line
	5550 4150 6250 4150
Wire Wire Line
	6250 4150 6250 4800
Wire Wire Line
	5550 4050 6400 4050
Wire Wire Line
	6400 4050 6400 5150
$Comp
L Device:R R3
U 1 1 6049F6B8
P 5650 2350
F 0 "R3" H 5580 2304 50  0000 R CNN
F 1 "10k" H 5580 2395 50  0000 R CNN
F 2 "Resistor_SMD:R_0805_2012Metric" V 5580 2350 50  0001 C CNN
F 3 "~" H 5650 2350 50  0001 C CNN
	1    5650 2350
	1    0    0    -1  
$EndComp
Wire Wire Line
	5550 3150 5650 3150
Wire Wire Line
	5650 3150 5650 2500
$Comp
L Device:R R5
U 1 1 604E61D6
P 5800 2050
F 0 "R5" V 5700 2050 50  0000 R CNN
F 1 "10k" V 5700 2250 50  0000 R CNN
F 2 "Resistor_SMD:R_0805_2012Metric" V 5730 2050 50  0001 C CNN
F 3 "~" H 5800 2050 50  0001 C CNN
	1    5800 2050
	1    0    0    -1  
$EndComp
$Comp
L Device:R R7
U 1 1 604F30E9
P 5950 2350
F 0 "R7" V 5850 2300 50  0000 R CNN
F 1 "10k" V 5850 2500 50  0000 R CNN
F 2 "Resistor_SMD:R_0805_2012Metric" V 5880 2350 50  0001 C CNN
F 3 "~" H 5950 2350 50  0001 C CNN
	1    5950 2350
	1    0    0    -1  
$EndComp
Wire Wire Line
	5550 3250 5800 3250
Wire Wire Line
	5800 3250 5800 2200
Wire Wire Line
	5550 3350 5950 3350
Wire Wire Line
	5950 3350 5950 2500
$Comp
L Device:R R9
U 1 1 6051C27E
P 6100 2050
F 0 "R9" H 6250 2100 50  0000 R CNN
F 1 "10k" H 6300 2000 50  0000 R CNN
F 2 "Resistor_SMD:R_0805_2012Metric" V 6030 2050 50  0001 C CNN
F 3 "~" H 6100 2050 50  0001 C CNN
	1    6100 2050
	1    0    0    -1  
$EndComp
Wire Wire Line
	5550 3450 6100 3450
Wire Wire Line
	6100 3450 6100 2200
Wire Wire Line
	5650 2200 5650 1800
Wire Wire Line
	5950 2200 5950 1800
Wire Wire Line
	5800 1900 5800 1800
Wire Wire Line
	6100 1900 6100 1800
Wire Wire Line
	5650 1800 5800 1800
Connection ~ 5800 1800
Wire Wire Line
	5800 1800 5950 1800
Connection ~ 5950 1800
Wire Wire Line
	5950 1800 6100 1800
Wire Wire Line
	5650 1800 5650 1700
Connection ~ 5650 1800
Wire Wire Line
	5650 5100 5650 5550
Wire Wire Line
	5650 5550 5800 5550
Wire Wire Line
	5800 5550 5800 5450
Wire Wire Line
	5800 5550 5950 5550
Wire Wire Line
	5950 5550 5950 5100
Connection ~ 5800 5550
Wire Wire Line
	5950 5550 6100 5550
Wire Wire Line
	6100 5550 6100 5450
Connection ~ 5950 5550
Wire Wire Line
	6100 5550 6250 5550
Wire Wire Line
	6250 5550 6250 5100
Connection ~ 6100 5550
Wire Wire Line
	6250 5550 6400 5550
Wire Wire Line
	6400 5550 6400 5450
Connection ~ 6250 5550
Wire Wire Line
	5650 5550 5650 5650
Connection ~ 5650 5550
$Comp
L power:+3.3V #PWR011
U 1 1 605FC31A
P 5650 5650
F 0 "#PWR011" H 5650 5500 50  0001 C CNN
F 1 "+3.3V" V 5665 5778 50  0000 L CNN
F 2 "" H 5650 5650 50  0001 C CNN
F 3 "" H 5650 5650 50  0001 C CNN
	1    5650 5650
	-1   0    0    1   
$EndComp
$Comp
L power:+3.3V #PWR010
U 1 1 6060C161
P 5650 1700
F 0 "#PWR010" H 5650 1550 50  0001 C CNN
F 1 "+3.3V" V 5665 1828 50  0000 L CNN
F 2 "" H 5650 1700 50  0001 C CNN
F 3 "" H 5650 1700 50  0001 C CNN
	1    5650 1700
	1    0    0    -1  
$EndComp
$Comp
L power:GND #PWR06
U 1 1 606F4DB6
P 4100 4550
F 0 "#PWR06" H 4100 4300 50  0001 C CNN
F 1 "GND" H 4105 4377 50  0000 C CNN
F 2 "" H 4100 4550 50  0001 C CNN
F 3 "" H 4100 4550 50  0001 C CNN
	1    4100 4550
	1    0    0    -1  
$EndComp
Connection ~ 4100 4550
$Comp
L power:+3.3V #PWR04
U 1 1 6078878D
P 4000 4250
F 0 "#PWR04" H 4000 4100 50  0001 C CNN
F 1 "+3.3V" V 4015 4378 50  0000 L CNN
F 2 "" H 4000 4250 50  0001 C CNN
F 3 "" H 4000 4250 50  0001 C CNN
	1    4000 4250
	0    -1   -1   0   
$EndComp
$Comp
L power:+3.3V #PWR02
U 1 1 60797400
P 1700 4350
F 0 "#PWR02" H 1700 4200 50  0001 C CNN
F 1 "+3.3V" V 1715 4478 50  0000 L CNN
F 2 "" H 1700 4350 50  0001 C CNN
F 3 "" H 1700 4350 50  0001 C CNN
	1    1700 4350
	1    0    0    -1  
$EndComp
$Comp
L power:GND #PWR05
U 1 1 606DB33A
P 4050 5350
F 0 "#PWR05" H 4050 5100 50  0001 C CNN
F 1 "GND" H 4055 5177 50  0000 C CNN
F 2 "" H 4050 5350 50  0001 C CNN
F 3 "" H 4050 5350 50  0001 C CNN
	1    4050 5350
	0    1    1    0   
$EndComp
$Comp
L Device:LED D1
U 1 1 5FD48CF2
P 4200 5350
F 0 "D1" H 4200 5200 50  0000 C CNN
F 1 "TO-1608BC-MRE" H 4200 5550 50  0001 C CNN
F 2 "LED_SMD:LED_0603_1608Metric" H 4200 5350 50  0001 C CNN
F 3 "https://www.oasistek.com/pdf/TO-1608BC-MRE_9201T098.pdf" H 4200 5350 50  0001 C CNN
	1    4200 5350
	1    0    0    1   
$EndComp
$Comp
L Device:R R2
U 1 1 5FD48CF8
P 4500 5350
F 0 "R2" V 4400 5400 50  0000 R CNN
F 1 "470" V 4600 5400 50  0000 R CNN
F 2 "Resistor_SMD:R_0805_2012Metric" V 4430 5350 50  0001 C CNN
F 3 "~" H 4500 5350 50  0001 C CNN
	1    4500 5350
	0    -1   1    0   
$EndComp
$Comp
L power:+3.3V #PWR08
U 1 1 5FD48CFE
P 4650 5350
F 0 "#PWR08" H 4650 5200 50  0001 C CNN
F 1 "+3.3V" V 4665 5478 50  0000 L CNN
F 2 "" H 4650 5350 50  0001 C CNN
F 3 "" H 4650 5350 50  0001 C CNN
	1    4650 5350
	0    1    1    0   
$EndComp
Connection ~ 1700 4400
Wire Wire Line
	1600 4400 1700 4400
Wire Wire Line
	1600 4500 1700 4500
Wire Wire Line
	1700 4500 1700 4400
$Comp
L Connector_Generic:Conn_01x10 J2
U 1 1 5FD37667
P 1400 4800
F 0 "J2" H 1400 5300 50  0000 C CNN
F 1 "PBS-10" H 1400 4200 50  0000 C CNN
F 2 "Connector_PinSocket_2.54mm:PinSocket_1x10_P2.54mm_Vertical" H 1400 4800 50  0001 C CNN
F 3 "~" H 1400 4800 50  0001 C CNN
	1    1400 4800
	-1   0    0    -1  
$EndComp
Wire Wire Line
	1600 4700 1700 4700
Wire Wire Line
	1600 4600 1700 4600
Wire Wire Line
	1700 4600 1700 4700
Connection ~ 1700 4700
$Comp
L power:GND #PWR03
U 1 1 607A71CD
P 1700 5350
F 0 "#PWR03" H 1700 5100 50  0001 C CNN
F 1 "GND" H 1705 5177 50  0000 C CNN
F 2 "" H 1700 5350 50  0001 C CNN
F 3 "" H 1700 5350 50  0001 C CNN
	1    1700 5350
	1    0    0    -1  
$EndComp
$Comp
L power:GND #PWR01
U 1 1 606CCF21
P 1700 3700
F 0 "#PWR01" H 1700 3450 50  0001 C CNN
F 1 "GND" H 1705 3527 50  0000 C CNN
F 2 "" H 1700 3700 50  0001 C CNN
F 3 "" H 1700 3700 50  0001 C CNN
	1    1700 3700
	1    0    0    -1  
$EndComp
$Comp
L Connector_Generic:Conn_01x10 J1
U 1 1 5FCD4A0D
P 1400 3150
F 0 "J1" H 1400 3650 50  0000 C CNN
F 1 "PBS-10" H 1350 2550 50  0000 C CNN
F 2 "Connector_PinSocket_2.54mm:PinSocket_1x10_P2.54mm_Vertical" H 1400 3150 50  0001 C CNN
F 3 "~" H 1400 3150 50  0001 C CNN
	1    1400 3150
	-1   0    0    -1  
$EndComp
Text Label 2000 2950 2    50   ~ 0
SCL
Wire Wire Line
	1600 2950 2200 2950
Text Label 2000 2850 2    50   ~ 0
SDA
Wire Wire Line
	1600 2850 2200 2850
Text Label 2000 2750 2    50   ~ 0
INT
Wire Wire Line
	1600 2750 2200 2750
Wire Wire Line
	1600 5300 1700 5300
Wire Wire Line
	1700 5300 1700 5200
Wire Wire Line
	1600 5200 1700 5200
Connection ~ 1700 5200
Wire Wire Line
	1700 5200 1700 5100
Wire Wire Line
	1600 5100 1700 5100
Connection ~ 1700 5100
Wire Wire Line
	1700 5100 1700 5000
Wire Wire Line
	1600 5000 1700 5000
Connection ~ 1700 5000
Wire Wire Line
	1700 5000 1700 4900
Wire Wire Line
	1600 4900 1700 4900
Connection ~ 1700 4900
Wire Wire Line
	1700 4900 1700 4800
Wire Wire Line
	1600 4800 1700 4800
Connection ~ 1700 4800
Wire Wire Line
	1700 4800 1700 4700
Wire Wire Line
	1600 3050 1700 3050
Wire Wire Line
	1600 3650 1700 3650
Wire Wire Line
	1700 3650 1700 3550
Wire Wire Line
	1600 3150 1700 3150
Connection ~ 1700 3150
Wire Wire Line
	1700 3150 1700 3050
Wire Wire Line
	1600 3250 1700 3250
Connection ~ 1700 3250
Wire Wire Line
	1700 3250 1700 3150
Wire Wire Line
	1600 3350 1700 3350
Connection ~ 1700 3350
Wire Wire Line
	1700 3350 1700 3250
Wire Wire Line
	1600 3450 1700 3450
Connection ~ 1700 3450
Wire Wire Line
	1700 3450 1700 3350
Wire Wire Line
	1600 3550 1700 3550
Connection ~ 1700 3550
Wire Wire Line
	1700 3550 1700 3450
Wire Wire Line
	1700 4400 1700 4350
Wire Wire Line
	1700 5300 1700 5350
Connection ~ 1700 5300
Wire Wire Line
	1700 3700 1700 3650
Connection ~ 1700 3650
Wire Wire Line
	7900 3050 7900 2750
Connection ~ 7900 2750
Wire Wire Line
	7900 2750 8400 2750
Wire Wire Line
	5550 2850 7250 2850
Wire Wire Line
	7250 3750 7400 3750
Wire Wire Line
	7150 2950 5550 2950
Wire Wire Line
	7800 3550 7800 4550
Wire Wire Line
	7150 2950 7150 4050
Wire Wire Line
	7150 4050 7900 4050
Wire Wire Line
	7250 2850 7250 3750
Wire Wire Line
	5550 3050 7050 3050
Wire Wire Line
	7050 3050 7050 4750
Wire Wire Line
	7050 4750 7400 4750
Connection ~ 7400 4750
$EndSCHEMATC
