EESchema Schematic File Version 4
EELAYER 30 0
EELAYER END
$Descr A4 11693 8268
encoding utf-8
Sheet 1 1
Title "zx-mini-pcb-debug-module-generator-v1"
Date ""
Rev "1"
Comp ""
Comment1 ""
Comment2 ""
Comment3 ""
Comment4 ""
$EndDescr
$Comp
L Oscillator:XO91 X1
U 1 1 606D9704
P 4250 3750
F 0 "X1" H 4300 4100 50  0000 L CNN
F 1 "SM77 50000" H 4300 4000 50  0000 L CNN
F 2 "Oscillator:Oscillator_SMD_EuroQuartz_XO91-4Pin_7.0x5.0mm" H 4950 3400 50  0001 C CNN
F 3 "" H 4150 3750 50  0001 C CNN
	1    4250 3750
	1    0    0    -1  
$EndComp
$Comp
L power:GND #PWR011
U 1 1 606DD83E
P 4250 4050
F 0 "#PWR011" H 4250 3800 50  0001 C CNN
F 1 "GND" H 4255 3877 50  0000 C CNN
F 2 "" H 4250 4050 50  0001 C CNN
F 3 "" H 4250 4050 50  0001 C CNN
	1    4250 4050
	1    0    0    -1  
$EndComp
$Comp
L power:+3.3V #PWR010
U 1 1 606EAC58
P 4250 3150
F 0 "#PWR010" H 4250 3000 50  0001 C CNN
F 1 "+3.3V" H 4265 3323 50  0000 C CNN
F 2 "" H 4250 3150 50  0001 C CNN
F 3 "" H 4250 3150 50  0001 C CNN
	1    4250 3150
	1    0    0    -1  
$EndComp
$Comp
L Device:C C2
U 1 1 606EC9B5
P 3650 3300
F 0 "C2" H 3700 3400 50  0000 L CNN
F 1 "0.1uF" H 3700 3200 50  0000 L CNN
F 2 "Capacitor_SMD:C_0805_2012Metric" H 3688 3150 50  0001 C CNN
F 3 "~" H 3650 3300 50  0001 C CNN
	1    3650 3300
	1    0    0    -1  
$EndComp
Wire Wire Line
	4250 3450 4250 3150
Connection ~ 4250 3150
$Comp
L power:GND #PWR08
U 1 1 6070103C
P 3650 3450
F 0 "#PWR08" H 3650 3200 50  0001 C CNN
F 1 "GND" H 3655 3277 50  0000 C CNN
F 2 "" H 3650 3450 50  0001 C CNN
F 3 "" H 3650 3450 50  0001 C CNN
	1    3650 3450
	1    0    0    -1  
$EndComp
$Comp
L Device:R R3
U 1 1 6072734F
P 4750 3750
F 0 "R3" V 4650 3800 50  0000 R CNN
F 1 "100" V 4550 3850 50  0000 R CNN
F 2 "Resistor_SMD:R_0805_2012Metric" V 4680 3750 50  0001 C CNN
F 3 "~" H 4750 3750 50  0001 C CNN
	1    4750 3750
	0    1    -1   0   
$EndComp
Wire Wire Line
	4550 3750 4600 3750
Wire Wire Line
	4900 3750 5400 3750
Wire Wire Line
	6000 2750 6000 1750
$Comp
L power:+3.3V #PWR019
U 1 1 60794E7F
P 6000 1700
F 0 "#PWR019" H 6000 1550 50  0001 C CNN
F 1 "+3.3V" H 6015 1873 50  0000 C CNN
F 2 "" H 6000 1700 50  0001 C CNN
F 3 "" H 6000 1700 50  0001 C CNN
	1    6000 1700
	1    0    0    -1  
$EndComp
$Comp
L power:GND #PWR021
U 1 1 607B8B1C
P 6350 2450
F 0 "#PWR021" H 6350 2200 50  0001 C CNN
F 1 "GND" H 6355 2277 50  0000 C CNN
F 2 "" H 6350 2450 50  0001 C CNN
F 3 "" H 6350 2450 50  0001 C CNN
	1    6350 2450
	1    0    0    -1  
$EndComp
$Comp
L Device:C C1
U 1 1 607E0DB3
P 3350 3300
F 0 "C1" H 3400 3400 50  0000 L CNN
F 1 "1uF" H 3400 3200 50  0000 L CNN
F 2 "Capacitor_SMD:C_0805_2012Metric" H 3388 3150 50  0001 C CNN
F 3 "~" H 3350 3300 50  0001 C CNN
	1    3350 3300
	1    0    0    -1  
$EndComp
Wire Wire Line
	3350 3150 3650 3150
Connection ~ 3650 3150
$Comp
L power:GND #PWR07
U 1 1 60800BF4
P 3350 3450
F 0 "#PWR07" H 3350 3200 50  0001 C CNN
F 1 "GND" H 3355 3277 50  0000 C CNN
F 2 "" H 3350 3450 50  0001 C CNN
F 3 "" H 3350 3450 50  0001 C CNN
	1    3350 3450
	1    0    0    -1  
$EndComp
$Comp
L Device:C C7
U 1 1 60809960
P 6750 2300
F 0 "C7" H 6850 2200 50  0000 L CNN
F 1 "0.01uF" H 6850 2400 50  0000 L CNN
F 2 "Capacitor_SMD:C_0805_2012Metric" H 6788 2150 50  0001 C CNN
F 3 "~" H 6750 2300 50  0001 C CNN
	1    6750 2300
	1    0    0    1   
$EndComp
$Comp
L power:GND #PWR032
U 1 1 609250F1
P 9050 2950
F 0 "#PWR032" H 9050 2700 50  0001 C CNN
F 1 "GND" H 9055 2777 50  0000 C CNN
F 2 "" H 9050 2950 50  0001 C CNN
F 3 "" H 9050 2950 50  0001 C CNN
	1    9050 2950
	1    0    0    -1  
$EndComp
$Comp
L Connector_Generic:Conn_01x06 J3
U 1 1 6093F1E0
P 2550 3100
F 0 "J3" H 2550 3400 50  0000 C CNN
F 1 "PLS-6" H 2550 2700 50  0000 C CNN
F 2 "Connector_PinHeader_2.54mm:PinHeader_1x06_P2.54mm_Vertical" H 2550 3100 50  0001 C CNN
F 3 "~" H 2550 3100 50  0001 C CNN
	1    2550 3100
	1    0    0    -1  
$EndComp
$Comp
L Connector_Generic:Conn_01x06 J1
U 1 1 6093F1E6
P 1650 3100
F 0 "J1" H 1650 3400 50  0000 C CNN
F 1 "PBS-6" H 1650 2700 50  0000 C CNN
F 2 "Connector_PinSocket_2.54mm:PinSocket_1x06_P2.54mm_Vertical" H 1650 3100 50  0001 C CNN
F 3 "~" H 1650 3100 50  0001 C CNN
	1    1650 3100
	-1   0    0    -1  
$EndComp
Wire Wire Line
	2350 2900 2100 2900
Wire Wire Line
	2350 3100 1850 3100
$Comp
L power:+3.3V #PWR01
U 1 1 6095E24D
P 2100 2900
F 0 "#PWR01" H 2100 2750 50  0001 C CNN
F 1 "+3.3V" H 2115 3073 50  0000 C CNN
F 2 "" H 2100 2900 50  0001 C CNN
F 3 "" H 2100 2900 50  0001 C CNN
	1    2100 2900
	1    0    0    -1  
$EndComp
Wire Wire Line
	1850 3000 2350 3000
Wire Wire Line
	1850 3200 2350 3200
Wire Wire Line
	2350 3400 2100 3400
$Comp
L power:GND #PWR02
U 1 1 60984E86
P 2100 3400
F 0 "#PWR02" H 2100 3150 50  0001 C CNN
F 1 "GND" H 2105 3227 50  0000 C CNN
F 2 "" H 2100 3400 50  0001 C CNN
F 3 "" H 2100 3400 50  0001 C CNN
	1    2100 3400
	1    0    0    -1  
$EndComp
Connection ~ 2100 3400
Wire Wire Line
	2100 3400 1850 3400
Text Label 2000 3200 0    50   ~ 0
SCLK
Text Label 2000 3300 0    50   ~ 0
SDATA
Text Label 2000 3100 0    50   ~ 0
FSYNC
Wire Wire Line
	2350 3950 2100 3950
Wire Wire Line
	1850 4350 2350 4350
$Comp
L power:GND #PWR04
U 1 1 609AD549
P 2100 4450
F 0 "#PWR04" H 2100 4200 50  0001 C CNN
F 1 "GND" H 2105 4277 50  0000 C CNN
F 2 "" H 2100 4450 50  0001 C CNN
F 3 "" H 2100 4450 50  0001 C CNN
	1    2100 4450
	1    0    0    -1  
$EndComp
Connection ~ 2100 4450
Text Label 2000 4350 0    50   ~ 0
FOUT
$Comp
L power:+5V #PWR03
U 1 1 609D9235
P 2100 3950
F 0 "#PWR03" H 2100 3800 50  0001 C CNN
F 1 "+5V" H 2150 4100 50  0000 C CNN
F 2 "" H 2100 3950 50  0001 C CNN
F 3 "" H 2100 3950 50  0001 C CNN
	1    2100 3950
	1    0    0    -1  
$EndComp
$Comp
L Device:R R1
U 1 1 609E5B0E
P 2100 5200
F 0 "R1" V 2000 5250 50  0000 R CNN
F 1 "470" V 2200 5250 50  0000 R CNN
F 2 "Resistor_SMD:R_0805_2012Metric" V 2030 5200 50  0001 C CNN
F 3 "~" H 2100 5200 50  0001 C CNN
	1    2100 5200
	1    0    0    1   
$EndComp
$Comp
L Device:LED D1
U 1 1 609E5B14
P 2100 5500
F 0 "D1" H 2100 5400 50  0000 C CNN
F 1 "TO-1608BC-MRE" H 2093 5336 50  0001 C CNN
F 2 "LED_SMD:LED_0603_1608Metric" H 2100 5500 50  0001 C CNN
F 3 "https://www.oasistek.com/pdf/TO-1608BC-MRE_9201T098.pdf" H 2100 5500 50  0001 C CNN
	1    2100 5500
	0    1    -1   0   
$EndComp
$Comp
L power:GND #PWR06
U 1 1 609E5B1A
P 2100 5650
F 0 "#PWR06" H 2100 5400 50  0001 C CNN
F 1 "GND" H 2105 5477 50  0000 C CNN
F 2 "" H 2100 5650 50  0001 C CNN
F 3 "" H 2100 5650 50  0001 C CNN
	1    2100 5650
	1    0    0    -1  
$EndComp
$Comp
L power:+3.3V #PWR05
U 1 1 609F4220
P 2100 5050
F 0 "#PWR05" H 2100 4900 50  0001 C CNN
F 1 "+3.3V" H 2115 5223 50  0000 C CNN
F 2 "" H 2100 5050 50  0001 C CNN
F 3 "" H 2100 5050 50  0001 C CNN
	1    2100 5050
	1    0    0    -1  
$EndComp
Connection ~ 2100 2900
Wire Wire Line
	2100 2900 1850 2900
Connection ~ 2100 3950
Wire Wire Line
	2100 3950 1850 3950
Wire Wire Line
	1850 4450 1900 4450
Wire Wire Line
	2100 4450 2300 4450
Connection ~ 1900 4450
Wire Wire Line
	1900 4450 2100 4450
Wire Wire Line
	1850 4250 1900 4250
Wire Wire Line
	1900 4250 1900 4450
Connection ~ 2300 4450
Wire Wire Line
	2300 4450 2350 4450
Wire Wire Line
	2350 4250 2300 4250
Wire Wire Line
	2300 4250 2300 4450
$Comp
L lib:LMV7239M5 D2
U 1 1 60730172
P 8550 3550
F 0 "D2" H 9000 3800 50  0000 L CNN
F 1 "LMV7239M5" H 9000 3700 50  0000 L CNN
F 2 "Package_TO_SOT_SMD:SOT-23-5" H 9050 4150 50  0001 C CNN
F 3 "" H 9050 4150 50  0001 C CNN
	1    8550 3550
	1    0    0    -1  
$EndComp
$Comp
L Device:C C10
U 1 1 607359E9
P 9050 2800
F 0 "C10" H 8800 2850 50  0000 L CNN
F 1 "0.1uF" H 8750 2750 50  0000 L CNN
F 2 "Capacitor_SMD:C_0805_2012Metric" H 9088 2650 50  0001 C CNN
F 3 "~" H 9050 2800 50  0001 C CNN
	1    9050 2800
	-1   0    0    -1  
$EndComp
$Comp
L power:GND #PWR031
U 1 1 60738A97
P 8850 3850
F 0 "#PWR031" H 8850 3600 50  0001 C CNN
F 1 "GND" H 8855 3677 50  0000 C CNN
F 2 "" H 8850 3850 50  0001 C CNN
F 3 "" H 8850 3850 50  0001 C CNN
	1    8850 3850
	1    0    0    -1  
$EndComp
Wire Wire Line
	8850 2650 9050 2650
$Comp
L power:+5V #PWR030
U 1 1 6073A94D
P 8850 2650
F 0 "#PWR030" H 8850 2500 50  0001 C CNN
F 1 "+5V" H 8900 2800 50  0000 C CNN
F 2 "" H 8850 2650 50  0001 C CNN
F 3 "" H 8850 2650 50  0001 C CNN
	1    8850 2650
	1    0    0    -1  
$EndComp
Connection ~ 8850 2650
$Comp
L Device:R R8
U 1 1 6073C4AF
P 8200 2950
F 0 "R8" H 8100 3000 50  0000 R CNN
F 1 "10k" H 8100 2900 50  0000 R CNN
F 2 "Resistor_SMD:R_0805_2012Metric" V 8130 2950 50  0001 C CNN
F 3 "~" H 8200 2950 50  0001 C CNN
	1    8200 2950
	-1   0    0    -1  
$EndComp
$Comp
L Device:R R9
U 1 1 6073EB24
P 8200 3350
F 0 "R9" H 8100 3400 50  0000 R CNN
F 1 "1k" H 8100 3300 50  0000 R CNN
F 2 "Resistor_SMD:R_0805_2012Metric" V 8130 3350 50  0001 C CNN
F 3 "~" H 8200 3350 50  0001 C CNN
	1    8200 3350
	-1   0    0    -1  
$EndComp
$Comp
L power:GND #PWR029
U 1 1 6073FC5F
P 8200 3500
F 0 "#PWR029" H 8200 3250 50  0001 C CNN
F 1 "GND" H 8205 3327 50  0000 C CNN
F 2 "" H 8200 3500 50  0001 C CNN
F 3 "" H 8200 3500 50  0001 C CNN
	1    8200 3500
	1    0    0    -1  
$EndComp
Wire Wire Line
	8200 3200 8200 3100
Wire Wire Line
	8550 3350 8500 3350
Wire Wire Line
	8500 3350 8500 3200
Wire Wire Line
	8500 3200 8200 3200
Connection ~ 8200 3200
$Comp
L Device:R R11
U 1 1 60745D66
P 9750 3550
F 0 "R11" V 9850 3600 50  0000 R CNN
F 1 "1" V 9650 3550 50  0000 R CNN
F 2 "Resistor_SMD:R_0805_2012Metric" V 9680 3550 50  0001 C CNN
F 3 "~" H 9750 3550 50  0001 C CNN
	1    9750 3550
	0    1    -1   0   
$EndComp
Wire Wire Line
	9250 3550 9500 3550
Text Label 9950 3550 0    50   ~ 0
FOUT
Wire Wire Line
	9900 3550 10200 3550
Wire Wire Line
	8200 2650 8200 2800
Wire Wire Line
	8850 2650 8850 3250
$Comp
L Device:R R10
U 1 1 60754B09
P 9500 3400
F 0 "R10" H 9450 3550 50  0000 R CNN
F 1 "30.1k" H 9450 3450 50  0000 R CNN
F 2 "Resistor_SMD:R_0805_2012Metric" V 9430 3400 50  0001 C CNN
F 3 "~" H 9500 3400 50  0001 C CNN
	1    9500 3400
	-1   0    0    -1  
$EndComp
Connection ~ 9500 3550
Wire Wire Line
	9500 3550 9600 3550
Wire Wire Line
	9500 3250 9500 3200
Wire Wire Line
	9500 3200 8500 3200
Connection ~ 8500 3200
$Comp
L Device:C C5
U 1 1 60761F50
P 5600 2450
F 0 "C5" H 5350 2500 50  0000 L CNN
F 1 "0.1uF" H 5300 2400 50  0000 L CNN
F 2 "Capacitor_SMD:C_0805_2012Metric" H 5638 2300 50  0001 C CNN
F 3 "~" H 5600 2450 50  0001 C CNN
	1    5600 2450
	1    0    0    1   
$EndComp
Text Label 5000 3150 0    50   ~ 0
FSYNC
Text Label 5000 3050 0    50   ~ 0
SDATA
Text Label 5000 2950 0    50   ~ 0
SCLK
Wire Wire Line
	5400 3150 4950 3150
Wire Wire Line
	5400 3050 4950 3050
Wire Wire Line
	5400 2950 4950 2950
$Comp
L power:GND #PWR015
U 1 1 6076BA4E
P 5300 3250
F 0 "#PWR015" H 5300 3000 50  0001 C CNN
F 1 "GND" V 5300 3050 50  0000 C CNN
F 2 "" H 5300 3250 50  0001 C CNN
F 3 "" H 5300 3250 50  0001 C CNN
	1    5300 3250
	0    1    1    0   
$EndComp
Wire Wire Line
	5400 3650 5300 3650
Wire Wire Line
	5300 3650 5300 3550
Wire Wire Line
	5400 3550 5300 3550
Wire Wire Line
	5400 3250 5300 3250
$Comp
L power:GND #PWR018
U 1 1 60773891
P 5600 2600
F 0 "#PWR018" H 5600 2350 50  0001 C CNN
F 1 "GND" H 5605 2427 50  0000 C CNN
F 2 "" H 5600 2600 50  0001 C CNN
F 3 "" H 5600 2600 50  0001 C CNN
	1    5600 2600
	1    0    0    -1  
$EndComp
Wire Wire Line
	5900 2750 5900 2300
Wire Wire Line
	5900 2300 5600 2300
$Comp
L power:GND #PWR020
U 1 1 60777B70
P 6000 4050
F 0 "#PWR020" H 6000 3800 50  0001 C CNN
F 1 "GND" H 6005 3877 50  0000 C CNN
F 2 "" H 6000 4050 50  0001 C CNN
F 3 "" H 6000 4050 50  0001 C CNN
	1    6000 4050
	1    0    0    -1  
$EndComp
Wire Wire Line
	6000 4050 6100 4050
Wire Wire Line
	6100 2750 6100 2150
$Comp
L Device:R R5
U 1 1 60790F80
P 6800 3350
F 0 "R5" V 6900 3350 50  0000 R CNN
F 1 "6.8k" V 6700 3400 50  0000 R CNN
F 2 "Resistor_SMD:R_0805_2012Metric" V 6730 3350 50  0001 C CNN
F 3 "~" H 6800 3350 50  0001 C CNN
	1    6800 3350
	0    1    -1   0   
$EndComp
$Comp
L power:GND #PWR023
U 1 1 60796C74
P 6950 3350
F 0 "#PWR023" H 6950 3100 50  0001 C CNN
F 1 "GND" V 6950 3150 50  0000 C CNN
F 2 "" H 6950 3350 50  0001 C CNN
F 3 "" H 6950 3350 50  0001 C CNN
	1    6950 3350
	0    -1   -1   0   
$EndComp
$Comp
L Device:C C8
U 1 1 6079D281
P 7450 3150
F 0 "C8" V 7600 3100 50  0000 L CNN
F 1 "0.01uF" V 7300 3100 50  0000 L CNN
F 2 "Capacitor_SMD:C_0805_2012Metric" H 7488 3000 50  0001 C CNN
F 3 "~" H 7450 3150 50  0001 C CNN
	1    7450 3150
	0    1    -1   0   
$EndComp
$Comp
L power:GND #PWR026
U 1 1 607AB980
P 7600 3150
F 0 "#PWR026" H 7600 2900 50  0001 C CNN
F 1 "GND" V 7600 2950 50  0000 C CNN
F 2 "" H 7600 3150 50  0001 C CNN
F 3 "" H 7600 3150 50  0001 C CNN
	1    7600 3150
	0    -1   -1   0   
$EndComp
NoConn ~ 6600 3450
$Comp
L power:GND #PWR022
U 1 1 607B1187
P 6600 3850
F 0 "#PWR022" H 6600 3600 50  0001 C CNN
F 1 "GND" V 6600 3650 50  0000 C CNN
F 2 "" H 6600 3850 50  0001 C CNN
F 3 "" H 6600 3850 50  0001 C CNN
	1    6600 3850
	0    -1   -1   0   
$EndComp
$Comp
L Device:R R7
U 1 1 607B4AFB
P 7350 4000
F 0 "R7" H 7550 3950 50  0000 R CNN
F 1 "200" H 7600 4050 50  0000 R CNN
F 2 "Resistor_SMD:R_0805_2012Metric" V 7280 4000 50  0001 C CNN
F 3 "~" H 7350 4000 50  0001 C CNN
	1    7350 4000
	1    0    0    1   
$EndComp
$Comp
L power:GND #PWR025
U 1 1 607B6C2E
P 7350 4150
F 0 "#PWR025" H 7350 3900 50  0001 C CNN
F 1 "GND" H 7350 4000 50  0000 C CNN
F 2 "" H 7350 4150 50  0001 C CNN
F 3 "" H 7350 4150 50  0001 C CNN
	1    7350 4150
	1    0    0    -1  
$EndComp
$Comp
L Device:C C9
U 1 1 607B8BC4
P 7750 4000
F 0 "C9" H 7900 3950 50  0000 L CNN
F 1 "20pF" H 7900 4050 50  0000 L CNN
F 2 "Capacitor_SMD:C_0805_2012Metric" H 7788 3850 50  0001 C CNN
F 3 "~" H 7750 4000 50  0001 C CNN
	1    7750 4000
	1    0    0    1   
$EndComp
$Comp
L power:GND #PWR027
U 1 1 607BAA85
P 7750 4150
F 0 "#PWR027" H 7750 3900 50  0001 C CNN
F 1 "GND" H 7750 4000 50  0000 C CNN
F 2 "" H 7750 4150 50  0001 C CNN
F 3 "" H 7750 4150 50  0001 C CNN
	1    7750 4150
	1    0    0    -1  
$EndComp
$Comp
L Device:R R6
U 1 1 607C2BF2
P 7000 4000
F 0 "R6" H 7200 3950 50  0000 R CNN
F 1 "200" H 7250 4050 50  0000 R CNN
F 2 "Resistor_SMD:R_0805_2012Metric" V 6930 4000 50  0001 C CNN
F 3 "~" H 7000 4000 50  0001 C CNN
	1    7000 4000
	1    0    0    1   
$EndComp
$Comp
L power:GND #PWR024
U 1 1 607C2BF8
P 7000 4150
F 0 "#PWR024" H 7000 3900 50  0001 C CNN
F 1 "GND" H 7000 4000 50  0000 C CNN
F 2 "" H 7000 4150 50  0001 C CNN
F 3 "" H 7000 4150 50  0001 C CNN
	1    7000 4150
	1    0    0    -1  
$EndComp
Wire Wire Line
	6600 3750 7000 3750
Wire Wire Line
	7000 3850 7000 3750
Connection ~ 7000 3750
Wire Wire Line
	7000 3750 8550 3750
Wire Wire Line
	6600 3650 7350 3650
Wire Wire Line
	7750 3650 7750 3850
Wire Wire Line
	7350 3850 7350 3650
Connection ~ 7350 3650
Wire Wire Line
	7350 3650 7750 3650
Wire Wire Line
	6650 3350 6650 3250
Wire Wire Line
	6650 3250 6600 3250
Wire Wire Line
	6600 3150 7300 3150
$Comp
L 74xGxx:SN74LVC1G14DBV U1
U 1 1 607F94F2
P 4250 5150
F 0 "U1" H 4350 5350 50  0000 L CNN
F 1 "SN74LVC1G14DBV" H 4350 5050 50  0000 L CNN
F 2 "Package_TO_SOT_SMD:SOT-23-5" H 4250 4900 50  0001 C CNN
F 3 "http://www.ti.com/lit/ds/symlink/sn74lvc1g14.pdf" H 4250 5150 50  0001 C CNN
	1    4250 5150
	1    0    0    -1  
$EndComp
$Comp
L power:GND #PWR016
U 1 1 607FB22B
P 5300 3550
F 0 "#PWR016" H 5300 3300 50  0001 C CNN
F 1 "GND" V 5300 3350 50  0000 C CNN
F 2 "" H 5300 3550 50  0001 C CNN
F 3 "" H 5300 3550 50  0001 C CNN
	1    5300 3550
	0    1    1    0   
$EndComp
Connection ~ 5300 3550
$Comp
L Device:C C3
U 1 1 607FF5C0
P 4550 4850
F 0 "C3" V 4800 4850 50  0000 L CNN
F 1 "0.1uF" V 4700 4750 50  0000 L CNN
F 2 "Capacitor_SMD:C_0805_2012Metric" H 4588 4700 50  0001 C CNN
F 3 "~" H 4550 4850 50  0001 C CNN
	1    4550 4850
	0    -1   -1   0   
$EndComp
Wire Wire Line
	4250 4950 4250 4850
Wire Wire Line
	4250 4850 4400 4850
$Comp
L power:GND #PWR014
U 1 1 60804BB1
P 4700 4850
F 0 "#PWR014" H 4700 4600 50  0001 C CNN
F 1 "GND" V 4700 4650 50  0000 C CNN
F 2 "" H 4700 4850 50  0001 C CNN
F 3 "" H 4700 4850 50  0001 C CNN
	1    4700 4850
	0    -1   -1   0   
$EndComp
$Comp
L power:+3.3V #PWR012
U 1 1 608093C9
P 4250 4700
F 0 "#PWR012" H 4250 4550 50  0001 C CNN
F 1 "+3.3V" H 4265 4873 50  0000 C CNN
F 2 "" H 4250 4700 50  0001 C CNN
F 3 "" H 4250 4700 50  0001 C CNN
	1    4250 4700
	1    0    0    -1  
$EndComp
Wire Wire Line
	4250 4850 4250 4700
Connection ~ 4250 4850
Wire Wire Line
	4550 5150 5000 5150
Wire Wire Line
	5000 5150 5000 3450
Wire Wire Line
	5000 3450 5400 3450
Wire Wire Line
	1850 4050 2100 4050
Wire Wire Line
	4050 5150 3550 5150
Wire Wire Line
	3650 3150 4250 3150
$Comp
L Device:R R2
U 1 1 60813E79
P 3750 3950
F 0 "R2" H 3650 4000 50  0000 R CNN
F 1 "10k" H 3650 3900 50  0000 R CNN
F 2 "Resistor_SMD:R_0805_2012Metric" V 3680 3950 50  0001 C CNN
F 3 "~" H 3750 3950 50  0001 C CNN
	1    3750 3950
	-1   0    0    -1  
$EndComp
Wire Wire Line
	3750 3800 3750 3750
Wire Wire Line
	3750 3750 3950 3750
$Comp
L power:GND #PWR09
U 1 1 60817991
P 3750 4100
F 0 "#PWR09" H 3750 3850 50  0001 C CNN
F 1 "GND" H 3755 3927 50  0000 C CNN
F 2 "" H 3750 4100 50  0001 C CNN
F 3 "" H 3750 4100 50  0001 C CNN
	1    3750 4100
	1    0    0    -1  
$EndComp
Wire Wire Line
	3550 5150 3550 3750
Wire Wire Line
	3550 3750 3750 3750
Connection ~ 3750 3750
Connection ~ 3550 3750
Wire Wire Line
	3550 3750 3050 3750
Text Label 3050 3750 0    50   ~ 0
EN
$Comp
L power:GND #PWR013
U 1 1 60827E5D
P 4250 5350
F 0 "#PWR013" H 4250 5100 50  0001 C CNN
F 1 "GND" H 4255 5177 50  0000 C CNN
F 2 "" H 4250 5350 50  0001 C CNN
F 3 "" H 4250 5350 50  0001 C CNN
	1    4250 5350
	1    0    0    -1  
$EndComp
Connection ~ 6000 4050
$Comp
L Interface:AD9834 U2
U 1 1 606F43FD
P 6000 3450
F 0 "U2" H 6250 4100 50  0000 C CNN
F 1 "AD9834" H 6350 2900 50  0000 C CNN
F 2 "Package_SO:TSSOP-20_4.4x6.5mm_P0.65mm" H 6000 2750 50  0001 C CNN
F 3 "https://www.analog.com/static/imported-files/data_sheets/AD9834.pdf" H 3000 3450 50  0001 C CNN
	1    6000 3450
	1    0    0    -1  
$EndComp
Wire Wire Line
	2100 4050 2100 3950
Connection ~ 2100 4050
Wire Wire Line
	2100 4050 2350 4050
Wire Wire Line
	1850 3300 2350 3300
Text Label 2000 3000 0    50   ~ 0
EN
$Comp
L Connector_Generic:Conn_01x06 J2
U 1 1 6083A617
P 1650 4150
F 0 "J2" H 1650 4450 50  0000 C CNN
F 1 "PBS-6" H 1650 3750 50  0000 C CNN
F 2 "Connector_PinSocket_2.54mm:PinSocket_1x06_P2.54mm_Vertical" H 1650 4150 50  0001 C CNN
F 3 "~" H 1650 4150 50  0001 C CNN
	1    1650 4150
	-1   0    0    -1  
$EndComp
$Comp
L Connector_Generic:Conn_01x06 J4
U 1 1 6083CC8A
P 2550 4150
F 0 "J4" H 2550 4450 50  0000 C CNN
F 1 "PLS-6" H 2550 3750 50  0000 C CNN
F 2 "Connector_PinHeader_2.54mm:PinHeader_1x06_P2.54mm_Vertical" H 2550 4150 50  0001 C CNN
F 3 "~" H 2550 4150 50  0001 C CNN
	1    2550 4150
	1    0    0    -1  
$EndComp
Wire Wire Line
	1850 4150 2100 4150
Wire Wire Line
	2100 4050 2100 4150
Connection ~ 2100 4150
Wire Wire Line
	2100 4150 2350 4150
$Comp
L power:+3.3V #PWR028
U 1 1 6085B5CF
P 8200 2650
F 0 "#PWR028" H 8200 2500 50  0001 C CNN
F 1 "+3.3V" H 8200 2800 50  0000 C CNN
F 2 "" H 8200 2650 50  0001 C CNN
F 3 "" H 8200 2650 50  0001 C CNN
	1    8200 2650
	1    0    0    -1  
$EndComp
$Comp
L Device:R R4
U 1 1 6089C392
P 6200 1750
F 0 "R4" V 6300 1750 50  0000 R CNN
F 1 "1" V 6100 1800 50  0000 R CNN
F 2 "Resistor_SMD:R_0805_2012Metric" V 6130 1750 50  0001 C CNN
F 3 "~" H 6200 1750 50  0001 C CNN
	1    6200 1750
	0    1    -1   0   
$EndComp
$Comp
L Device:C C4
U 1 1 608A3E14
P 5600 1900
F 0 "C4" H 5650 2000 50  0000 L CNN
F 1 "0.1uF" H 5650 1800 50  0000 L CNN
F 2 "Capacitor_SMD:C_0805_2012Metric" H 5638 1750 50  0001 C CNN
F 3 "~" H 5600 1900 50  0001 C CNN
	1    5600 1900
	1    0    0    -1  
$EndComp
$Comp
L power:GND #PWR017
U 1 1 608AB221
P 5600 2050
F 0 "#PWR017" H 5600 1800 50  0001 C CNN
F 1 "GND" H 5605 1877 50  0000 C CNN
F 2 "" H 5600 2050 50  0001 C CNN
F 3 "" H 5600 2050 50  0001 C CNN
	1    5600 2050
	1    0    0    -1  
$EndComp
Wire Wire Line
	5600 1750 6000 1750
Connection ~ 6000 1750
Wire Wire Line
	6000 1750 6000 1700
Wire Wire Line
	6000 1750 6050 1750
Wire Wire Line
	6350 1750 6350 2150
Wire Wire Line
	6100 2150 6350 2150
Connection ~ 6350 2150
$Comp
L Device:C C6
U 1 1 607762F2
P 6350 2300
F 0 "C6" H 6400 2400 50  0000 L CNN
F 1 "0.1uF" H 6400 2200 50  0000 L CNN
F 2 "Capacitor_SMD:C_0805_2012Metric" H 6388 2150 50  0001 C CNN
F 3 "~" H 6350 2300 50  0001 C CNN
	1    6350 2300
	1    0    0    -1  
$EndComp
Wire Wire Line
	6350 2150 6750 2150
Wire Wire Line
	6600 3050 6750 3050
Wire Wire Line
	6750 3050 6750 2450
$EndSCHEMATC
