%TF.GenerationSoftware,KiCad,Pcbnew,(5.1.8)-1*%
%TF.CreationDate,2020-12-15T21:09:37+04:00*%
%TF.ProjectId,zx-mini-pcb-debug-module-cpu-v1,7a782d6d-696e-4692-9d70-63622d646562,rev?*%
%TF.SameCoordinates,Original*%
%TF.FileFunction,Soldermask,Bot*%
%TF.FilePolarity,Negative*%
%FSLAX46Y46*%
G04 Gerber Fmt 4.6, Leading zero omitted, Abs format (unit mm)*
G04 Created by KiCad (PCBNEW (5.1.8)-1) date 2020-12-15 21:09:37*
%MOMM*%
%LPD*%
G01*
G04 APERTURE LIST*
%ADD10R,1.700000X1.700000*%
%ADD11O,1.700000X1.700000*%
%ADD12C,1.700000*%
%ADD13O,1.600000X1.600000*%
%ADD14R,1.600000X1.600000*%
%ADD15C,1.000000*%
G04 APERTURE END LIST*
%TO.C,C10*%
G36*
G01*
X134130000Y-100600000D02*
X135080000Y-100600000D01*
G75*
G02*
X135330000Y-100850000I0J-250000D01*
G01*
X135330000Y-101350000D01*
G75*
G02*
X135080000Y-101600000I-250000J0D01*
G01*
X134130000Y-101600000D01*
G75*
G02*
X133880000Y-101350000I0J250000D01*
G01*
X133880000Y-100850000D01*
G75*
G02*
X134130000Y-100600000I250000J0D01*
G01*
G37*
G36*
G01*
X134130000Y-102500000D02*
X135080000Y-102500000D01*
G75*
G02*
X135330000Y-102750000I0J-250000D01*
G01*
X135330000Y-103250000D01*
G75*
G02*
X135080000Y-103500000I-250000J0D01*
G01*
X134130000Y-103500000D01*
G75*
G02*
X133880000Y-103250000I0J250000D01*
G01*
X133880000Y-102750000D01*
G75*
G02*
X134130000Y-102500000I250000J0D01*
G01*
G37*
%TD*%
%TO.C,C11*%
G36*
G01*
X128830000Y-102500000D02*
X129780000Y-102500000D01*
G75*
G02*
X130030000Y-102750000I0J-250000D01*
G01*
X130030000Y-103250000D01*
G75*
G02*
X129780000Y-103500000I-250000J0D01*
G01*
X128830000Y-103500000D01*
G75*
G02*
X128580000Y-103250000I0J250000D01*
G01*
X128580000Y-102750000D01*
G75*
G02*
X128830000Y-102500000I250000J0D01*
G01*
G37*
G36*
G01*
X128830000Y-100600000D02*
X129780000Y-100600000D01*
G75*
G02*
X130030000Y-100850000I0J-250000D01*
G01*
X130030000Y-101350000D01*
G75*
G02*
X129780000Y-101600000I-250000J0D01*
G01*
X128830000Y-101600000D01*
G75*
G02*
X128580000Y-101350000I0J250000D01*
G01*
X128580000Y-100850000D01*
G75*
G02*
X128830000Y-100600000I250000J0D01*
G01*
G37*
%TD*%
D10*
%TO.C,J1*%
X102355000Y-82550000D03*
D11*
X102355000Y-85090000D03*
X102355000Y-87630000D03*
X102355000Y-90170000D03*
X102355000Y-92710000D03*
X102355000Y-95250000D03*
X102355000Y-97790000D03*
X102355000Y-100330000D03*
X102355000Y-102870000D03*
X102355000Y-105410000D03*
X102355000Y-107950000D03*
X102355000Y-110490000D03*
X102355000Y-113030000D03*
X102355000Y-115570000D03*
X102355000Y-118110000D03*
X102355000Y-120650000D03*
%TD*%
%TO.C,J2*%
X154305000Y-120650000D03*
X154305000Y-118110000D03*
X154305000Y-115570000D03*
X154305000Y-113030000D03*
X154305000Y-110490000D03*
X154305000Y-107950000D03*
X154305000Y-105410000D03*
X154305000Y-102870000D03*
X154305000Y-100330000D03*
X154305000Y-97790000D03*
X154305000Y-95250000D03*
X154305000Y-92710000D03*
X154305000Y-90170000D03*
X154305000Y-87630000D03*
X154305000Y-85090000D03*
D10*
X154305000Y-82550000D03*
%TD*%
%TO.C,J3*%
G36*
G01*
X124550000Y-87800000D02*
X123350000Y-87800000D01*
G75*
G02*
X123100000Y-87550000I0J250000D01*
G01*
X123100000Y-86350000D01*
G75*
G02*
X123350000Y-86100000I250000J0D01*
G01*
X124550000Y-86100000D01*
G75*
G02*
X124800000Y-86350000I0J-250000D01*
G01*
X124800000Y-87550000D01*
G75*
G02*
X124550000Y-87800000I-250000J0D01*
G01*
G37*
D12*
X126490000Y-86950000D03*
X129030000Y-86950000D03*
X131570000Y-86950000D03*
X134110000Y-86950000D03*
X123950000Y-84410000D03*
X126490000Y-84410000D03*
X129030000Y-84410000D03*
X131570000Y-84410000D03*
X134110000Y-84410000D03*
%TD*%
D11*
%TO.C,J4*%
X104895000Y-120650000D03*
X104895000Y-118110000D03*
X104895000Y-115570000D03*
X104895000Y-113030000D03*
X104895000Y-110490000D03*
X104895000Y-107950000D03*
X104895000Y-105410000D03*
X104895000Y-102870000D03*
X104895000Y-100330000D03*
X104895000Y-97790000D03*
X104895000Y-95250000D03*
X104895000Y-92710000D03*
X104895000Y-90170000D03*
X104895000Y-87630000D03*
X104895000Y-85090000D03*
D10*
X104895000Y-82550000D03*
%TD*%
%TO.C,J5*%
X151765000Y-82550000D03*
D11*
X151765000Y-85090000D03*
X151765000Y-87630000D03*
X151765000Y-90170000D03*
X151765000Y-92710000D03*
X151765000Y-95250000D03*
X151765000Y-97790000D03*
X151765000Y-100330000D03*
X151765000Y-102870000D03*
X151765000Y-105410000D03*
X151765000Y-107950000D03*
X151765000Y-110490000D03*
X151765000Y-113030000D03*
X151765000Y-115570000D03*
X151765000Y-118110000D03*
X151765000Y-120650000D03*
%TD*%
D10*
%TO.C,J6*%
X144272000Y-100330000D03*
D11*
X144272000Y-102870000D03*
X144272000Y-105410000D03*
X144272000Y-107950000D03*
X144272000Y-110490000D03*
%TD*%
D10*
%TO.C,J8*%
X144272000Y-92710000D03*
D11*
X144272000Y-95250000D03*
X144272000Y-97790000D03*
%TD*%
D13*
%TO.C,SW1*%
X111355000Y-82030000D03*
X113895000Y-89650000D03*
X113895000Y-82030000D03*
D14*
X111355000Y-89650000D03*
%TD*%
%TO.C,SW2*%
X132115000Y-121050000D03*
D13*
X134655000Y-113430000D03*
X134655000Y-121050000D03*
X132115000Y-113430000D03*
%TD*%
D14*
%TO.C,SW3*%
X140655000Y-121050000D03*
D13*
X143195000Y-113430000D03*
X143195000Y-121050000D03*
X140655000Y-113430000D03*
%TD*%
%TO.C,SW4*%
X112805000Y-113430000D03*
D14*
X112805000Y-121050000D03*
%TD*%
%TO.C,SW6*%
X144155000Y-89650000D03*
D13*
X144155000Y-82030000D03*
%TD*%
D10*
%TO.C,J7*%
X110490000Y-92750000D03*
D11*
X110490000Y-95290000D03*
X110490000Y-97830000D03*
%TD*%
D15*
%TO.C,Y1*%
X133245000Y-97600000D03*
X130705000Y-97600000D03*
%TD*%
M02*
