EESchema Schematic File Version 4
EELAYER 30 0
EELAYER END
$Descr A4 11693 8268
encoding utf-8
Sheet 1 1
Title "zx-mini-pcb-debug-module-cpu-v1"
Date ""
Rev "1"
Comp ""
Comment1 ""
Comment2 ""
Comment3 ""
Comment4 ""
$EndDescr
$Comp
L lib:STM32L010K8 D6
U 1 1 5FC5D32C
P 7950 1200
F 0 "D6" H 8575 1425 50  0000 C CNN
F 1 "STM32L010K8" H 8575 1334 50  0000 C CNN
F 2 "Package_QFP:LQFP-32_7x7mm_P0.8mm" H 8600 -1200 50  0001 C CNN
F 3 "https://www.st.com/resource/en/datasheet/stm32l010k8.pdf" H 8200 1400 50  0001 C CNN
	1    7950 1200
	1    0    0    -1  
$EndComp
$Comp
L power:GNDD #PWR0101
U 1 1 5FC69633
P 10000 3600
F 0 "#PWR0101" H 10000 3350 50  0001 C CNN
F 1 "GNDD" V 10004 3490 50  0000 R CNN
F 2 "" H 10000 3600 50  0001 C CNN
F 3 "" H 10000 3600 50  0001 C CNN
	1    10000 3600
	0    -1   -1   0   
$EndComp
Wire Wire Line
	10000 3300 10000 3600
$Comp
L Device:C C7
U 1 1 5FC6B7D4
P 7750 2950
F 0 "C7" H 7800 3050 50  0000 L CNN
F 1 "0.1uF" H 7800 2850 50  0000 L CNN
F 2 "Capacitor_SMD:C_0805_2012Metric" H 7788 2800 50  0001 C CNN
F 3 "~" H 7750 2950 50  0001 C CNN
	1    7750 2950
	1    0    0    -1  
$EndComp
$Comp
L Device:C C5
U 1 1 5FC6EFC9
P 7450 2950
F 0 "C5" H 7500 3050 50  0000 L CNN
F 1 "0.1uF" H 7500 2850 50  0000 L CNN
F 2 "Capacitor_SMD:C_0805_2012Metric" H 7488 2800 50  0001 C CNN
F 3 "~" H 7450 2950 50  0001 C CNN
	1    7450 2950
	1    0    0    -1  
$EndComp
Wire Wire Line
	7950 2800 7900 2800
Wire Wire Line
	7950 2900 7900 2900
Wire Wire Line
	7900 2900 7900 2800
Wire Wire Line
	7150 3100 7450 3100
Connection ~ 7450 3100
Wire Wire Line
	7450 3100 7750 3100
Wire Wire Line
	7150 2800 7450 2800
Connection ~ 7450 2800
Wire Wire Line
	7450 2800 7750 2800
$Comp
L Device:CP C4
U 1 1 5FC7C17B
P 7150 2950
F 0 "C4" H 7200 3050 50  0000 L CNN
F 1 "10uF" H 7200 2850 50  0000 L CNN
F 2 "Capacitor_Tantalum_SMD:CP_EIA-3216-18_Kemet-A" H 7188 2800 50  0001 C CNN
F 3 "~" H 7150 2950 50  0001 C CNN
	1    7150 2950
	1    0    0    -1  
$EndComp
Wire Wire Line
	7450 3600 7750 3600
Connection ~ 7450 3600
Connection ~ 7450 3300
Wire Wire Line
	7450 3300 7750 3300
Wire Wire Line
	7750 3300 7950 3300
Connection ~ 7750 3300
$Comp
L Device:C C8
U 1 1 5FC734EF
P 7750 3450
F 0 "C8" H 7800 3550 50  0000 L CNN
F 1 "1uF" H 7800 3350 50  0000 L CNN
F 2 "Capacitor_SMD:C_0805_2012Metric" H 7788 3300 50  0001 C CNN
F 3 "~" H 7750 3450 50  0001 C CNN
	1    7750 3450
	1    0    0    -1  
$EndComp
$Comp
L Device:L L1
U 1 1 5FC70851
P 7300 3300
F 0 "L1" V 7250 3300 50  0000 C CNN
F 1 "LQM21DN470N" V 7150 3550 50  0000 C CNN
F 2 "Inductor_SMD:L_0805_2012Metric" H 7300 3300 50  0001 C CNN
F 3 "https://www.murata.com/en-eu/api/pdfdownloadapi?cate=cgInductors&partno=LQM21DN470M70%23" H 7300 3300 50  0001 C CNN
	1    7300 3300
	0    -1   -1   0   
$EndComp
$Comp
L Device:C C6
U 1 1 5FC6A518
P 7450 3450
F 0 "C6" H 7500 3550 50  0000 L CNN
F 1 "0.1uF" H 7500 3350 50  0000 L CNN
F 2 "Capacitor_SMD:C_0805_2012Metric" H 7488 3300 50  0001 C CNN
F 3 "~" H 7450 3450 50  0001 C CNN
	1    7450 3450
	1    0    0    -1  
$EndComp
Wire Wire Line
	7750 2800 7900 2800
Connection ~ 7750 2800
Connection ~ 7900 2800
$Comp
L power:GNDD #PWR0102
U 1 1 5FC95F23
P 7450 3600
F 0 "#PWR0102" H 7450 3350 50  0001 C CNN
F 1 "GNDD" H 7454 3445 50  0000 C CNN
F 2 "" H 7450 3600 50  0001 C CNN
F 3 "" H 7450 3600 50  0001 C CNN
	1    7450 3600
	1    0    0    -1  
$EndComp
Wire Wire Line
	7950 3600 7900 3600
Connection ~ 7750 3600
Wire Wire Line
	7950 3700 7900 3700
Wire Wire Line
	7900 3700 7900 3600
Connection ~ 7900 3600
Wire Wire Line
	7900 3600 7750 3600
$Comp
L power:GNDD #PWR0103
U 1 1 5FC9BA88
P 7450 3100
F 0 "#PWR0103" H 7450 2850 50  0001 C CNN
F 1 "GNDD" H 7454 2945 50  0000 C CNN
F 2 "" H 7450 3100 50  0001 C CNN
F 3 "" H 7450 3100 50  0001 C CNN
	1    7450 3100
	1    0    0    -1  
$EndComp
$Comp
L power:+3.3V #PWR0104
U 1 1 5FC9C7A7
P 7050 2800
F 0 "#PWR0104" H 7050 2650 50  0001 C CNN
F 1 "+3.3V" V 7065 2928 50  0000 L CNN
F 2 "" H 7050 2800 50  0001 C CNN
F 3 "" H 7050 2800 50  0001 C CNN
	1    7050 2800
	0    -1   -1   0   
$EndComp
Connection ~ 7150 2800
$Comp
L power:+3.3V #PWR0105
U 1 1 5FC9EF5A
P 7050 3300
F 0 "#PWR0105" H 7050 3150 50  0001 C CNN
F 1 "+3.3V" V 7065 3428 50  0000 L CNN
F 2 "" H 7050 3300 50  0001 C CNN
F 3 "" H 7050 3300 50  0001 C CNN
	1    7050 3300
	0    -1   -1   0   
$EndComp
Wire Wire Line
	7050 2800 7150 2800
Wire Wire Line
	7050 3300 7150 3300
Text Label 7750 3300 0    50   ~ 0
VCCA
Connection ~ 10000 3600
$Comp
L Device:C C9
U 1 1 5FCAB87B
P 9350 2800
F 0 "C9" H 9400 2900 50  0000 L CNN
F 1 "0.1uF" H 9400 2700 50  0000 L CNN
F 2 "Capacitor_SMD:C_0805_2012Metric" H 9388 2650 50  0001 C CNN
F 3 "~" H 9350 2800 50  0001 C CNN
	1    9350 2800
	1    0    0    -1  
$EndComp
Connection ~ 9350 2650
$Comp
L power:GNDD #PWR0106
U 1 1 5FCACAA4
P 9350 3050
F 0 "#PWR0106" H 9350 2800 50  0001 C CNN
F 1 "GNDD" H 9354 2895 50  0000 C CNN
F 2 "" H 9350 3050 50  0001 C CNN
F 3 "" H 9350 3050 50  0001 C CNN
	1    9350 3050
	1    0    0    -1  
$EndComp
$Comp
L Device:R R10
U 1 1 5FCB4860
P 9350 2200
F 0 "R10" H 9280 2154 50  0000 R CNN
F 1 "4,7k" H 9280 2245 50  0000 R CNN
F 2 "Resistor_SMD:R_0805_2012Metric" V 9280 2200 50  0001 C CNN
F 3 "~" H 9350 2200 50  0001 C CNN
	1    9350 2200
	-1   0    0    1   
$EndComp
Wire Wire Line
	9350 2000 9350 2050
Wire Wire Line
	9200 2000 9350 2000
$Comp
L power:GNDD #PWR0107
U 1 1 5FCB7B0D
P 9350 2350
F 0 "#PWR0107" H 9350 2100 50  0001 C CNN
F 1 "GNDD" H 9354 2195 50  0000 C CNN
F 2 "" H 9350 2350 50  0001 C CNN
F 3 "" H 9350 2350 50  0001 C CNN
	1    9350 2350
	1    0    0    -1  
$EndComp
$Comp
L power:+3.3V #PWR0108
U 1 1 5FCBC893
P 10050 2000
F 0 "#PWR0108" H 10050 1850 50  0001 C CNN
F 1 "+3.3V" V 10065 2128 50  0000 L CNN
F 2 "" H 10050 2000 50  0001 C CNN
F 3 "" H 10050 2000 50  0001 C CNN
	1    10050 2000
	0    1    1    0   
$EndComp
Wire Wire Line
	7950 1200 7100 1200
Text Label 7200 1200 0    50   ~ 0
ADC_IN0_L
Wire Wire Line
	7950 1300 7100 1300
Text Label 7200 1300 0    50   ~ 0
ADC_IN1_L
Wire Wire Line
	7950 1400 7100 1400
Text Label 7200 1400 0    50   ~ 0
USART2_TX
Wire Wire Line
	7950 1500 7100 1500
Text Label 7200 1500 0    50   ~ 0
USART2_RX
Wire Wire Line
	7950 1600 7100 1600
Text Label 7200 1600 0    50   ~ 0
ADC_IN4_L
Wire Wire Line
	7950 1700 7100 1700
Text Label 7200 1700 0    50   ~ 0
PA5
Wire Wire Line
	7950 1800 7100 1800
Text Label 7200 1800 0    50   ~ 0
PA6
Wire Wire Line
	7950 1900 7100 1900
Text Label 7200 1900 0    50   ~ 0
PA7
Wire Wire Line
	7950 2000 7100 2000
Text Label 7200 2000 0    50   ~ 0
PA8
Wire Wire Line
	7950 2100 7100 2100
Text Label 7200 2100 0    50   ~ 0
PA9
Wire Wire Line
	7950 2200 7100 2200
Text Label 7200 2200 0    50   ~ 0
PA10
Wire Wire Line
	7950 2300 7100 2300
Text Label 7200 2300 0    50   ~ 0
PA11
Wire Wire Line
	7950 2400 7100 2400
Text Label 7200 2400 0    50   ~ 0
PA12
Wire Wire Line
	7950 2500 7100 2500
Text Label 7200 2500 0    50   ~ 0
SWDIO
Wire Wire Line
	7950 2600 7100 2600
Text Label 7200 2600 0    50   ~ 0
SWCLK
Text Label 7200 2700 0    50   ~ 0
SPI1_NSS
Text Label 9950 1400 2    50   ~ 0
SPI1_SCK
Text Label 9950 1500 2    50   ~ 0
SPI1_MISO
Wire Wire Line
	9200 1600 10050 1600
Text Label 9950 1600 2    50   ~ 0
SPI1_MOSI
Text Label 9950 1700 2    50   ~ 0
I2C_SCL
Text Label 9950 1800 2    50   ~ 0
I2C_SDA
Wire Wire Line
	9200 1200 10050 1200
Text Label 9950 1200 2    50   ~ 0
PB0
Wire Wire Line
	9200 1300 10050 1300
Text Label 9950 1300 2    50   ~ 0
PB1
$Comp
L power:+3.3V #PWR0109
U 1 1 5FCF22E1
P 1550 1200
F 0 "#PWR0109" H 1550 1050 50  0001 C CNN
F 1 "+3.3V" H 1450 1350 50  0000 L CNN
F 2 "" H 1550 1200 50  0001 C CNN
F 3 "" H 1550 1200 50  0001 C CNN
	1    1550 1200
	1    0    0    -1  
$EndComp
$Comp
L power:GNDD #PWR0110
U 1 1 5FCF569E
P 1550 2700
F 0 "#PWR0110" H 1550 2450 50  0001 C CNN
F 1 "GNDD" H 1650 2550 50  0000 R CNN
F 2 "" H 1550 2700 50  0001 C CNN
F 3 "" H 1550 2700 50  0001 C CNN
	1    1550 2700
	1    0    0    -1  
$EndComp
Wire Wire Line
	1250 2600 1250 2700
Wire Wire Line
	1250 1300 1250 1200
Wire Wire Line
	1250 1400 1850 1400
Text Label 1700 1400 2    50   ~ 0
ADC_IN0
Wire Wire Line
	1250 1500 1850 1500
Text Label 1700 1500 2    50   ~ 0
ADC_IN1
Wire Wire Line
	1250 1600 1850 1600
Text Label 1800 1600 2    50   ~ 0
USART2_TX
Wire Wire Line
	1250 1700 1850 1700
Text Label 1800 1700 2    50   ~ 0
USART2_RX
Wire Wire Line
	1250 1800 1850 1800
Text Label 1700 1800 2    50   ~ 0
ADC_IN4
Wire Wire Line
	1250 1900 1850 1900
Text Label 1550 1900 2    50   ~ 0
PA5
Wire Wire Line
	1250 2000 1850 2000
Text Label 1550 2000 2    50   ~ 0
PA6
Wire Wire Line
	1250 2100 1850 2100
Text Label 1550 2100 2    50   ~ 0
PA7
Wire Wire Line
	1250 2200 1850 2200
Text Label 1550 2200 2    50   ~ 0
PB0
Wire Wire Line
	1250 2300 1850 2300
Text Label 1550 2300 2    50   ~ 0
PB1
Wire Wire Line
	1250 2400 1850 2400
Text Label 1550 2400 2    50   ~ 0
PA8
Wire Wire Line
	1250 2500 1850 2500
Text Label 1550 2500 2    50   ~ 0
PA9
$Comp
L Connector_Generic:Conn_01x16 J2
U 1 1 5FD37667
P 1050 4200
F 0 "J2" H 1050 5000 50  0000 C CNN
F 1 "PBS-16" H 1000 3300 50  0000 C CNN
F 2 "Connector_PinSocket_2.54mm:PinSocket_1x16_P2.54mm_Vertical" H 1050 4200 50  0001 C CNN
F 3 "~" H 1050 4200 50  0001 C CNN
	1    1050 4200
	-1   0    0    -1  
$EndComp
$Comp
L power:+3.3V #PWR0111
U 1 1 5FD3766D
P 1550 3500
F 0 "#PWR0111" H 1550 3350 50  0001 C CNN
F 1 "+3.3V" H 1450 3650 50  0000 L CNN
F 2 "" H 1550 3500 50  0001 C CNN
F 3 "" H 1550 3500 50  0001 C CNN
	1    1550 3500
	1    0    0    -1  
$EndComp
$Comp
L power:GNDD #PWR0112
U 1 1 5FD37673
P 1550 5000
F 0 "#PWR0112" H 1550 4750 50  0001 C CNN
F 1 "GNDD" H 1650 4850 50  0000 R CNN
F 2 "" H 1550 5000 50  0001 C CNN
F 3 "" H 1550 5000 50  0001 C CNN
	1    1550 5000
	1    0    0    -1  
$EndComp
Wire Wire Line
	1250 4900 1250 5000
Wire Wire Line
	1250 3600 1250 3500
Wire Wire Line
	1250 3900 1850 3900
Wire Wire Line
	1250 4000 1850 4000
Wire Wire Line
	1250 4200 1850 4200
Wire Wire Line
	1250 4300 1850 4300
Wire Wire Line
	1250 4400 1850 4400
Wire Wire Line
	1250 4500 1850 4500
Wire Wire Line
	1250 4600 1850 4600
Wire Wire Line
	1250 4700 1850 4700
Wire Wire Line
	1250 4800 1850 4800
Text Label 1400 4800 0    50   ~ 0
PA10
Text Label 1400 4700 0    50   ~ 0
PA11
Text Label 1400 4600 0    50   ~ 0
PA12
Text Label 1400 4500 0    50   ~ 0
SPI1_NSS
Text Label 1750 4400 2    50   ~ 0
SPI1_SCK
Text Label 1800 4300 2    50   ~ 0
SPI1_MISO
Text Label 1800 4200 2    50   ~ 0
SPI1_MOSI
Text Label 1700 4000 2    50   ~ 0
I2C_SCL
Text Label 1700 3900 2    50   ~ 0
I2C_SDA
Text Label 9400 2650 0    50   ~ 0
RESET
Wire Wire Line
	1900 6300 2450 6300
Wire Wire Line
	1900 6500 2450 6500
Wire Wire Line
	1900 6600 2450 6600
$Comp
L power:GNDD #PWR0113
U 1 1 5FD9882F
P 1900 7300
F 0 "#PWR0113" H 1900 7050 50  0001 C CNN
F 1 "GNDD" V 1904 7190 50  0000 R CNN
F 2 "" H 1900 7300 50  0001 C CNN
F 3 "" H 1900 7300 50  0001 C CNN
	1    1900 7300
	0    -1   -1   0   
$EndComp
Text Label 2200 6300 0    50   ~ 0
RESET
Text Label 2200 6600 0    50   ~ 0
SWDIO
Text Label 2200 6500 0    50   ~ 0
SWCLK
$Comp
L power:+3.3V #PWR0114
U 1 1 5FDB1AD2
P 1900 6100
F 0 "#PWR0114" H 1900 5950 50  0001 C CNN
F 1 "+3.3V" V 1915 6228 50  0000 L CNN
F 2 "" H 1900 6100 50  0001 C CNN
F 3 "" H 1900 6100 50  0001 C CNN
	1    1900 6100
	0    1    1    0   
$EndComp
$Comp
L lib:JTAG_ARM_10_PINS J3
U 1 1 5FDC5729
P 1900 6100
F 0 "J3" H 1250 6300 50  0000 C CNN
F 1 "IDC-10" H 1450 6200 50  0000 C CNN
F 2 "Connector_IDC:IDC-Header_2x05_P2.54mm_Vertical" H 1900 6100 50  0001 C CNN
F 3 "" H 1900 6100 50  0001 C CNN
	1    1900 6100
	1    0    0    -1  
$EndComp
Wire Wire Line
	1900 6900 2400 6900
Wire Wire Line
	1900 6800 2400 6800
Text Label 3300 6900 0    50   ~ 0
USART2_RX
Text Label 3300 6800 0    50   ~ 0
USART2_TX
$Comp
L Switch:SW_DIP_x02 SW1
U 1 1 5FDE78EC
P 2700 6900
F 0 "SW1" H 2700 7250 50  0000 C CNN
F 1 "DS1040-02RN" H 2700 7150 50  0000 C CNN
F 2 "Button_Switch_THT:SW_DIP_SPSTx02_Slide_9.78x7.26mm_W7.62mm_P2.54mm" H 2700 6900 50  0001 C CNN
F 3 "~" H 2700 6900 50  0001 C CNN
	1    2700 6900
	-1   0    0    -1  
$EndComp
Wire Wire Line
	1900 7100 1900 7200
Connection ~ 1900 7300
Connection ~ 1900 7200
Wire Wire Line
	1900 7200 1900 7300
Wire Wire Line
	9200 1800 10050 1800
Wire Wire Line
	9200 1700 10050 1700
Wire Wire Line
	9200 1500 10050 1500
Wire Wire Line
	9200 1400 10050 1400
Wire Wire Line
	7100 2700 7950 2700
$Comp
L Device:R R11
U 1 1 5FC56F3D
P 9950 2650
F 0 "R11" H 9880 2604 50  0000 R CNN
F 1 "10k" H 9880 2695 50  0000 R CNN
F 2 "Resistor_SMD:R_0805_2012Metric" V 9880 2650 50  0001 C CNN
F 3 "~" H 9950 2650 50  0001 C CNN
	1    9950 2650
	0    1    1    0   
$EndComp
Wire Wire Line
	9350 2950 9350 3050
$Comp
L power:+3.3V #PWR0115
U 1 1 5FC81D86
P 10100 2650
F 0 "#PWR0115" H 10100 2500 50  0001 C CNN
F 1 "+3.3V" V 10115 2778 50  0000 L CNN
F 2 "" H 10100 2650 50  0001 C CNN
F 3 "" H 10100 2650 50  0001 C CNN
	1    10100 2650
	0    1    1    0   
$EndComp
Connection ~ 1250 5000
Connection ~ 1250 3500
$Comp
L Connector_Generic:Conn_01x16 J5
U 1 1 5FE25E17
P 2050 4200
F 0 "J5" H 2050 5000 50  0000 C CNN
F 1 "PLS-16" H 2050 3300 50  0000 C CNN
F 2 "Connector_PinHeader_2.54mm:PinHeader_1x16_P2.54mm_Vertical" H 2050 4200 50  0001 C CNN
F 3 "~" H 2050 4200 50  0001 C CNN
	1    2050 4200
	1    0    0    -1  
$EndComp
Wire Wire Line
	1850 3600 1850 3500
Connection ~ 1850 3500
Wire Wire Line
	1250 3500 1550 3500
Connection ~ 1550 3500
Wire Wire Line
	1550 3500 1850 3500
Wire Wire Line
	1250 5000 1550 5000
Wire Wire Line
	1850 4900 1850 5000
Connection ~ 1850 5000
Connection ~ 1550 5000
Wire Wire Line
	1550 5000 1850 5000
Wire Wire Line
	1250 2700 1550 2700
Wire Wire Line
	1850 2600 1850 2700
Wire Wire Line
	1250 1200 1550 1200
Wire Wire Line
	1850 1300 1850 1200
Connection ~ 1550 1200
Wire Wire Line
	1550 1200 1850 1200
Connection ~ 1550 2700
Wire Wire Line
	1550 2700 1850 2700
$Comp
L Diode:BZX384-xxx D3
U 1 1 5FEC4549
P 5050 1350
F 0 "D3" V 5004 1430 50  0000 L CNN
F 1 "BZX384-B3V6" V 5095 1430 50  0000 L CNN
F 2 "Diode_SMD:D_SOD-323" H 5050 1175 50  0001 C CNN
F 3 "https://assets.nexperia.com/documents/data-sheet/BZX384_SERIES.pdf" H 5050 1350 50  0001 C CNN
	1    5050 1350
	0    1    1    0   
$EndComp
$Comp
L Device:R R1
U 1 1 5FEC6784
P 4800 1200
F 0 "R1" V 4900 1200 50  0000 R CNN
F 1 "220" V 4730 1245 50  0000 R CNN
F 2 "Resistor_SMD:R_0805_2012Metric" V 4730 1200 50  0001 C CNN
F 3 "~" H 4800 1200 50  0001 C CNN
	1    4800 1200
	0    -1   1    0   
$EndComp
$Comp
L Device:C C1
U 1 1 5FECF45D
P 5800 1350
F 0 "C1" H 5850 1450 50  0000 L CNN
F 1 "0.01uF" H 5850 1250 50  0000 L CNN
F 2 "Capacitor_SMD:C_0805_2012Metric" H 5838 1200 50  0001 C CNN
F 3 "~" H 5800 1350 50  0001 C CNN
	1    5800 1350
	1    0    0    -1  
$EndComp
Wire Wire Line
	4950 1200 5050 1200
Connection ~ 5050 1200
Wire Wire Line
	5050 1200 5800 1200
$Comp
L power:GNDD #PWR0116
U 1 1 5FD50047
P 4750 5450
F 0 "#PWR0116" H 4750 5200 50  0001 C CNN
F 1 "GNDD" V 4754 5340 50  0000 R CNN
F 2 "" H 4750 5450 50  0001 C CNN
F 3 "" H 4750 5450 50  0001 C CNN
	1    4750 5450
	0    1    1    0   
$EndComp
$Comp
L power:+3.3V #PWR0117
U 1 1 5FD48CFE
P 5350 5450
F 0 "#PWR0117" H 5350 5300 50  0001 C CNN
F 1 "+3.3V" V 5365 5578 50  0000 L CNN
F 2 "" H 5350 5450 50  0001 C CNN
F 3 "" H 5350 5450 50  0001 C CNN
	1    5350 5450
	0    1    1    0   
$EndComp
$Comp
L Device:R R9
U 1 1 5FD48CF8
P 5200 5450
F 0 "R9" V 5100 5500 50  0000 R CNN
F 1 "470" V 5300 5500 50  0000 R CNN
F 2 "Resistor_SMD:R_0805_2012Metric" V 5130 5450 50  0001 C CNN
F 3 "~" H 5200 5450 50  0001 C CNN
	1    5200 5450
	0    -1   1    0   
$EndComp
$Comp
L Device:LED D2
U 1 1 5FD48CF2
P 4900 5450
F 0 "D2" H 4893 5195 50  0000 C CNN
F 1 "TO-1608BC-MRE" H 4893 5286 50  0000 C CNN
F 2 "LED_SMD:LED_0603_1608Metric" H 4900 5450 50  0001 C CNN
F 3 "https://www.oasistek.com/pdf/TO-1608BC-MRE_9201T098.pdf" H 4900 5450 50  0001 C CNN
	1    4900 5450
	1    0    0    1   
$EndComp
Connection ~ 5950 4350
Wire Wire Line
	4750 5000 4450 5000
$Comp
L power:+3.3V #PWR0118
U 1 1 5FD2474E
P 5950 5000
F 0 "#PWR0118" H 5950 4850 50  0001 C CNN
F 1 "+3.3V" V 5965 5128 50  0000 L CNN
F 2 "" H 5950 5000 50  0001 C CNN
F 3 "" H 5950 5000 50  0001 C CNN
	1    5950 5000
	1    0    0    -1  
$EndComp
$Comp
L Device:R R8
U 1 1 5FD00C36
P 5200 5000
F 0 "R8" V 5100 5050 50  0000 R CNN
F 1 "470" V 5300 5050 50  0000 R CNN
F 2 "Resistor_SMD:R_0805_2012Metric" V 5130 5000 50  0001 C CNN
F 3 "~" H 5200 5000 50  0001 C CNN
	1    5200 5000
	0    -1   1    0   
$EndComp
$Comp
L Device:LED D1
U 1 1 5FCFEC4B
P 4900 5000
F 0 "D1" H 4893 4745 50  0000 C CNN
F 1 "TO-1608BC-PG" H 4800 4850 50  0000 C CNN
F 2 "LED_SMD:LED_0603_1608Metric" H 4900 5000 50  0001 C CNN
F 3 "https://www.oasistek.com/pdf/TO-1608BC-PG_9201T057.pdf" H 4900 5000 50  0001 C CNN
	1    4900 5000
	1    0    0    1   
$EndComp
$Comp
L Switch:SW_DIP_x01 SW4
U 1 1 5FCFE440
P 5650 5000
F 0 "SW4" H 5650 5267 50  0000 C CNN
F 1 "DS1040-01RN" H 5650 5176 50  0000 C CNN
F 2 "Button_Switch_THT:SW_DIP_SPSTx01_Slide_9.78x4.72mm_W7.62mm_P2.54mm" H 5650 5000 50  0001 C CNN
F 3 "~" H 5650 5000 50  0001 C CNN
	1    5650 5000
	-1   0    0    -1  
$EndComp
Text Label 4500 3700 0    50   ~ 0
SPI1_NSS
Text Label 4900 3800 2    50   ~ 0
SPI1_MISO
Wire Wire Line
	4450 3800 5000 3800
Wire Wire Line
	5000 3700 4450 3700
Connection ~ 5950 3700
$Comp
L power:+3.3V #PWR0119
U 1 1 5FCDF9DB
P 5950 3700
F 0 "#PWR0119" H 5950 3550 50  0001 C CNN
F 1 "+3.3V" V 5965 3828 50  0000 L CNN
F 2 "" H 5950 3700 50  0001 C CNN
F 3 "" H 5950 3700 50  0001 C CNN
	1    5950 3700
	1    0    0    -1  
$EndComp
Wire Wire Line
	5950 3800 5950 3700
Wire Wire Line
	5300 3800 5350 3800
Wire Wire Line
	5300 3700 5350 3700
$Comp
L Switch:SW_DIP_x02 SW2
U 1 1 5FCDF9D2
P 5650 3800
F 0 "SW2" H 5650 4150 50  0000 C CNN
F 1 "DS1040-02RN" H 5650 4050 50  0000 C CNN
F 2 "Button_Switch_THT:SW_DIP_SPSTx02_Slide_9.78x7.26mm_W7.62mm_P2.54mm" H 5650 3800 50  0001 C CNN
F 3 "~" H 5650 3800 50  0001 C CNN
	1    5650 3800
	-1   0    0    -1  
$EndComp
$Comp
L Device:R R5
U 1 1 5FCDF9CC
P 5150 3800
F 0 "R5" H 5080 3754 50  0000 R CNN
F 1 "4,7k" H 5080 3845 50  0000 R CNN
F 2 "Resistor_SMD:R_0805_2012Metric" V 5080 3800 50  0001 C CNN
F 3 "~" H 5150 3800 50  0001 C CNN
	1    5150 3800
	0    -1   -1   0   
$EndComp
$Comp
L Device:R R4
U 1 1 5FCDF9C6
P 5150 3700
F 0 "R4" H 5080 3654 50  0000 R CNN
F 1 "4,7k" H 5080 3745 50  0000 R CNN
F 2 "Resistor_SMD:R_0805_2012Metric" V 5080 3700 50  0001 C CNN
F 3 "~" H 5150 3700 50  0001 C CNN
	1    5150 3700
	0    -1   1    0   
$EndComp
Wire Wire Line
	4450 4450 5000 4450
Text Label 4800 4450 2    50   ~ 0
I2C_SDA
Text Label 4800 4350 2    50   ~ 0
I2C_SCL
Wire Wire Line
	5000 4350 4450 4350
$Comp
L power:+3.3V #PWR0120
U 1 1 5FCB49C5
P 5950 4350
F 0 "#PWR0120" H 5950 4200 50  0001 C CNN
F 1 "+3.3V" V 5965 4478 50  0000 L CNN
F 2 "" H 5950 4350 50  0001 C CNN
F 3 "" H 5950 4350 50  0001 C CNN
	1    5950 4350
	1    0    0    -1  
$EndComp
Wire Wire Line
	5950 4450 5950 4350
Wire Wire Line
	5300 4450 5350 4450
Wire Wire Line
	5300 4350 5350 4350
$Comp
L Switch:SW_DIP_x02 SW3
U 1 1 5FCA13E3
P 5650 4450
F 0 "SW3" H 5650 4800 50  0000 C CNN
F 1 "DS1040-02RN" H 5650 4700 50  0000 C CNN
F 2 "Button_Switch_THT:SW_DIP_SPSTx02_Slide_9.78x7.26mm_W7.62mm_P2.54mm" H 5650 4450 50  0001 C CNN
F 3 "~" H 5650 4450 50  0001 C CNN
	1    5650 4450
	-1   0    0    -1  
$EndComp
$Comp
L Device:R R7
U 1 1 5FCD1B08
P 5150 4450
F 0 "R7" H 5080 4404 50  0000 R CNN
F 1 "4,7k" H 5080 4495 50  0000 R CNN
F 2 "Resistor_SMD:R_0805_2012Metric" V 5080 4450 50  0001 C CNN
F 3 "~" H 5150 4450 50  0001 C CNN
	1    5150 4450
	0    -1   -1   0   
$EndComp
$Comp
L Device:R R6
U 1 1 5FCBB05F
P 5150 4350
F 0 "R6" H 5080 4304 50  0000 R CNN
F 1 "4,7k" H 5080 4395 50  0000 R CNN
F 2 "Resistor_SMD:R_0805_2012Metric" V 5080 4350 50  0001 C CNN
F 3 "~" H 5150 4350 50  0001 C CNN
	1    5150 4350
	0    -1   1    0   
$EndComp
Wire Wire Line
	3000 6800 3750 6800
Wire Wire Line
	3000 6900 3750 6900
Wire Wire Line
	4650 1200 4150 1200
$Comp
L power:GNDD #PWR0121
U 1 1 5FF5B36E
P 5050 1500
F 0 "#PWR0121" H 5050 1250 50  0001 C CNN
F 1 "GNDD" H 5150 1350 50  0000 R CNN
F 2 "" H 5050 1500 50  0001 C CNN
F 3 "" H 5050 1500 50  0001 C CNN
	1    5050 1500
	1    0    0    -1  
$EndComp
$Comp
L power:GNDD #PWR0122
U 1 1 5FF621AF
P 5800 1500
F 0 "#PWR0122" H 5800 1250 50  0001 C CNN
F 1 "GNDD" H 5900 1350 50  0000 R CNN
F 2 "" H 5800 1500 50  0001 C CNN
F 3 "" H 5800 1500 50  0001 C CNN
	1    5800 1500
	1    0    0    -1  
$EndComp
Text Label 4500 1200 2    50   ~ 0
ADC_IN0
Wire Wire Line
	5800 1200 6300 1200
Connection ~ 5800 1200
Text Label 5900 1200 0    50   ~ 0
ADC_IN0_L
$Comp
L Diode:BZX384-xxx D4
U 1 1 5FF96C22
P 5050 2050
F 0 "D4" V 5004 2130 50  0000 L CNN
F 1 "BZX384-B3V6" V 5095 2130 50  0000 L CNN
F 2 "Diode_SMD:D_SOD-323" H 5050 1875 50  0001 C CNN
F 3 "https://assets.nexperia.com/documents/data-sheet/BZX384_SERIES.pdf" H 5050 2050 50  0001 C CNN
	1    5050 2050
	0    1    1    0   
$EndComp
$Comp
L Device:R R2
U 1 1 5FF96C28
P 4800 1900
F 0 "R2" V 4900 1900 50  0000 R CNN
F 1 "220" V 4730 1945 50  0000 R CNN
F 2 "Resistor_SMD:R_0805_2012Metric" V 4730 1900 50  0001 C CNN
F 3 "~" H 4800 1900 50  0001 C CNN
	1    4800 1900
	0    -1   1    0   
$EndComp
$Comp
L Device:C C2
U 1 1 5FF96C2E
P 5800 2050
F 0 "C2" H 5850 2150 50  0000 L CNN
F 1 "0.01uF" H 5850 1950 50  0000 L CNN
F 2 "Capacitor_SMD:C_0805_2012Metric" H 5838 1900 50  0001 C CNN
F 3 "~" H 5800 2050 50  0001 C CNN
	1    5800 2050
	1    0    0    -1  
$EndComp
Wire Wire Line
	4950 1900 5050 1900
Connection ~ 5050 1900
Wire Wire Line
	5050 1900 5800 1900
Wire Wire Line
	4650 1900 4150 1900
$Comp
L power:GNDD #PWR0123
U 1 1 5FF96C38
P 5050 2200
F 0 "#PWR0123" H 5050 1950 50  0001 C CNN
F 1 "GNDD" H 5150 2050 50  0000 R CNN
F 2 "" H 5050 2200 50  0001 C CNN
F 3 "" H 5050 2200 50  0001 C CNN
	1    5050 2200
	1    0    0    -1  
$EndComp
$Comp
L power:GNDD #PWR0124
U 1 1 5FF96C3E
P 5800 2200
F 0 "#PWR0124" H 5800 1950 50  0001 C CNN
F 1 "GNDD" H 5900 2050 50  0000 R CNN
F 2 "" H 5800 2200 50  0001 C CNN
F 3 "" H 5800 2200 50  0001 C CNN
	1    5800 2200
	1    0    0    -1  
$EndComp
Wire Wire Line
	5800 1900 6300 1900
Connection ~ 5800 1900
$Comp
L Diode:BZX384-xxx D5
U 1 1 5FF9F5F6
P 5050 2700
F 0 "D5" V 5004 2780 50  0000 L CNN
F 1 "BZX384-B3V6" V 5095 2780 50  0000 L CNN
F 2 "Diode_SMD:D_SOD-323" H 5050 2525 50  0001 C CNN
F 3 "https://assets.nexperia.com/documents/data-sheet/BZX384_SERIES.pdf" H 5050 2700 50  0001 C CNN
	1    5050 2700
	0    1    1    0   
$EndComp
$Comp
L Device:R R3
U 1 1 5FF9F5FC
P 4800 2550
F 0 "R3" V 4900 2550 50  0000 R CNN
F 1 "220" V 4730 2595 50  0000 R CNN
F 2 "Resistor_SMD:R_0805_2012Metric" V 4730 2550 50  0001 C CNN
F 3 "~" H 4800 2550 50  0001 C CNN
	1    4800 2550
	0    -1   1    0   
$EndComp
$Comp
L Device:C C3
U 1 1 5FF9F602
P 5800 2700
F 0 "C3" H 5850 2800 50  0000 L CNN
F 1 "0.01uF" H 5850 2600 50  0000 L CNN
F 2 "Capacitor_SMD:C_0805_2012Metric" H 5838 2550 50  0001 C CNN
F 3 "~" H 5800 2700 50  0001 C CNN
	1    5800 2700
	1    0    0    -1  
$EndComp
Wire Wire Line
	4950 2550 5050 2550
Connection ~ 5050 2550
Wire Wire Line
	5050 2550 5800 2550
Wire Wire Line
	4650 2550 4150 2550
$Comp
L power:GNDD #PWR0125
U 1 1 5FF9F60C
P 5050 2850
F 0 "#PWR0125" H 5050 2600 50  0001 C CNN
F 1 "GNDD" H 5150 2700 50  0000 R CNN
F 2 "" H 5050 2850 50  0001 C CNN
F 3 "" H 5050 2850 50  0001 C CNN
	1    5050 2850
	1    0    0    -1  
$EndComp
$Comp
L power:GNDD #PWR0126
U 1 1 5FF9F612
P 5800 2850
F 0 "#PWR0126" H 5800 2600 50  0001 C CNN
F 1 "GNDD" H 5900 2700 50  0000 R CNN
F 2 "" H 5800 2850 50  0001 C CNN
F 3 "" H 5800 2850 50  0001 C CNN
	1    5800 2850
	1    0    0    -1  
$EndComp
Wire Wire Line
	5800 2550 6300 2550
Connection ~ 5800 2550
Text Label 5900 1900 0    50   ~ 0
ADC_IN1_L
Text Label 5900 2550 0    50   ~ 0
ADC_IN4_L
Text Label 4500 1900 2    50   ~ 0
ADC_IN1
Text Label 4500 2550 2    50   ~ 0
ADC_IN4
Wire Wire Line
	9200 2650 9350 2650
$Comp
L Connector_Generic:Conn_01x03 J7
U 1 1 5FC7107D
P 2700 2050
F 0 "J7" H 2650 2250 50  0000 C CNN
F 1 "PLS-3" H 2700 1850 50  0000 C CNN
F 2 "Connector_PinHeader_2.54mm:PinHeader_1x03_P2.54mm_Vertical" H 2700 2050 50  0001 C CNN
F 3 "~" H 2700 2050 50  0001 C CNN
	1    2700 2050
	-1   0    0    -1  
$EndComp
$Comp
L Connector_Generic:Conn_01x05 J6
U 1 1 5FC83493
P 2700 1400
F 0 "J6" H 2700 1700 50  0000 C CNN
F 1 "PLS-5" H 2700 1100 50  0000 C CNN
F 2 "Connector_PinHeader_2.54mm:PinHeader_1x05_P2.54mm_Vertical" H 2700 1400 50  0001 C CNN
F 3 "~" H 2700 1400 50  0001 C CNN
	1    2700 1400
	-1   0    0    -1  
$EndComp
Wire Wire Line
	2900 1200 3450 1200
$Comp
L power:GNDD #PWR0127
U 1 1 5FC95418
P 2900 1600
F 0 "#PWR0127" H 2900 1350 50  0001 C CNN
F 1 "GNDD" V 2904 1490 50  0000 R CNN
F 2 "" H 2900 1600 50  0001 C CNN
F 3 "" H 2900 1600 50  0001 C CNN
	1    2900 1600
	0    -1   -1   0   
$EndComp
Text Label 2950 1500 0    50   ~ 0
SPI1_NSS
Wire Wire Line
	2900 1300 3450 1300
Wire Wire Line
	2900 1400 3450 1400
Wire Wire Line
	2900 1500 3450 1500
Text Label 3300 1400 2    50   ~ 0
SPI1_SCK
Text Label 3350 1300 2    50   ~ 0
SPI1_MISO
Text Label 3350 1200 2    50   ~ 0
SPI1_MOSI
Wire Wire Line
	2900 1950 3450 1950
Wire Wire Line
	2900 2050 3450 2050
$Comp
L power:GNDD #PWR0128
U 1 1 5FCF57A1
P 2900 2150
F 0 "#PWR0128" H 2900 1900 50  0001 C CNN
F 1 "GNDD" V 2904 2040 50  0000 R CNN
F 2 "" H 2900 2150 50  0001 C CNN
F 3 "" H 2900 2150 50  0001 C CNN
	1    2900 2150
	0    -1   -1   0   
$EndComp
Text Label 3400 1950 2    50   ~ 0
USART2_TX
Text Label 3400 2050 2    50   ~ 0
USART2_RX
$Comp
L Connector_Generic:Conn_01x03 J8
U 1 1 5FD10C31
P 2700 2600
F 0 "J8" H 2650 2800 50  0000 C CNN
F 1 "PLS-3" H 2700 2400 50  0000 C CNN
F 2 "Connector_PinHeader_2.54mm:PinHeader_1x03_P2.54mm_Vertical" H 2700 2600 50  0001 C CNN
F 3 "~" H 2700 2600 50  0001 C CNN
	1    2700 2600
	-1   0    0    -1  
$EndComp
Wire Wire Line
	2900 2500 3450 2500
Wire Wire Line
	2900 2600 3450 2600
$Comp
L power:GNDD #PWR0129
U 1 1 5FD10C39
P 2900 2700
F 0 "#PWR0129" H 2900 2450 50  0001 C CNN
F 1 "GNDD" V 2904 2590 50  0000 R CNN
F 2 "" H 2900 2700 50  0001 C CNN
F 3 "" H 2900 2700 50  0001 C CNN
	1    2900 2700
	0    -1   -1   0   
$EndComp
Text Label 3300 2600 2    50   ~ 0
I2C_SCL
Text Label 3300 2500 2    50   ~ 0
I2C_SDA
Connection ~ 9350 3050
Wire Wire Line
	9650 3050 9350 3050
$Comp
L Device:C C11
U 1 1 5FC607E7
P 9850 3600
F 0 "C11" V 9700 3600 50  0000 C CNN
F 1 "22p" V 9600 3600 50  0000 C CNN
F 2 "Capacitor_SMD:C_0805_2012Metric" H 9888 3450 50  0001 C CNN
F 3 "~" H 9850 3600 50  0001 C CNN
	1    9850 3600
	0    -1   -1   0   
$EndComp
$Comp
L Device:C C10
U 1 1 5FC5F4D0
P 9850 3300
F 0 "C10" V 10102 3300 50  0000 C CNN
F 1 "22p" V 10011 3300 50  0000 C CNN
F 2 "Capacitor_SMD:C_0805_2012Metric" H 9888 3150 50  0001 C CNN
F 3 "~" H 9850 3300 50  0001 C CNN
	1    9850 3300
	0    -1   -1   0   
$EndComp
$Comp
L Switch:SW_DIP_x01 SW6
U 1 1 5FD3E72D
P 9750 2000
F 0 "SW6" H 10000 2100 50  0000 C CNN
F 1 "DS1040-01RN" H 9650 1850 50  0000 C CNN
F 2 "Button_Switch_THT:SW_DIP_SPSTx01_Slide_9.78x4.72mm_W7.62mm_P2.54mm" H 9750 2000 50  0001 C CNN
F 3 "~" H 9750 2000 50  0001 C CNN
	1    9750 2000
	-1   0    0    -1  
$EndComp
Wire Wire Line
	9650 2650 9800 2650
Wire Wire Line
	9350 2650 9650 2650
Connection ~ 9650 2650
$Comp
L Switch:SW_Push SW5
U 1 1 5FCA7371
P 9650 2850
F 0 "SW5" V 9600 3050 50  0000 C CNN
F 1 "1437566-3 (FSMSM)" V 9700 3400 50  0000 C CNN
F 2 "Button_Switch_SMD:SW_SPST_FSMSM" H 9650 3050 50  0001 C CNN
F 3 "~" H 9650 3050 50  0001 C CNN
	1    9650 2850
	0    1    1    0   
$EndComp
Wire Wire Line
	9450 2000 9350 2000
Connection ~ 9350 2000
Connection ~ 1850 1200
Connection ~ 1850 2700
Connection ~ 1250 2700
Connection ~ 1250 1200
$Comp
L Connector_Generic:Conn_01x16 J4
U 1 1 5FE66CC7
P 2050 1900
F 0 "J4" H 2050 2700 50  0000 C CNN
F 1 "PLS-16" H 2000 1000 50  0000 C CNN
F 2 "Connector_PinHeader_2.54mm:PinHeader_1x16_P2.54mm_Vertical" H 2050 1900 50  0001 C CNN
F 3 "~" H 2050 1900 50  0001 C CNN
	1    2050 1900
	1    0    0    -1  
$EndComp
$Comp
L Connector_Generic:Conn_01x16 J1
U 1 1 5FCD4A0D
P 1050 1900
F 0 "J1" H 1050 2700 50  0000 C CNN
F 1 "PBS-16" H 1000 1000 50  0000 C CNN
F 2 "Connector_PinSocket_2.54mm:PinSocket_1x16_P2.54mm_Vertical" H 1050 1900 50  0001 C CNN
F 3 "~" H 1050 1900 50  0001 C CNN
	1    1050 1900
	-1   0    0    -1  
$EndComp
NoConn ~ 1900 6700
Connection ~ 9350 3600
Wire Wire Line
	9350 3600 9700 3600
Wire Wire Line
	9200 3600 9350 3600
Connection ~ 9350 3300
Wire Wire Line
	9350 3300 9700 3300
Wire Wire Line
	9200 3300 9350 3300
$Comp
L Device:Crystal Y1
U 1 1 5FC56C2E
P 9350 3450
F 0 "Y1" V 9450 3300 50  0000 R CNN
F 1 "32.768kHz" V 9350 3300 50  0000 R CNN
F 2 "Crystal:Crystal_AT310_D3.0mm_L10.0mm_Horizontal" H 9350 3450 50  0001 C CNN
F 3 "~" H 9350 3450 50  0001 C CNN
	1    9350 3450
	0    -1   1    0   
$EndComp
Text Label 4650 5000 2    50   ~ 0
PA9
$EndSCHEMATC
