EESchema Schematic File Version 4
EELAYER 30 0
EELAYER END
$Descr A4 11693 8268
encoding utf-8
Sheet 1 1
Title "zx-mini-pcb-debug-module-battery-v1.1"
Date ""
Rev "1.1"
Comp ""
Comment1 ""
Comment2 ""
Comment3 ""
Comment4 ""
$EndDescr
$Comp
L Connector_Generic:Conn_01x02 J11
U 1 1 5FDE950F
P 7100 3500
F 0 "J11" H 7050 3600 50  0000 L CNN
F 1 "PLS-2" H 7150 3300 50  0001 L CNN
F 2 "Connector_PinHeader_2.54mm:PinHeader_1x02_P2.54mm_Vertical" H 7000 3950 50  0001 C CNN
F 3 "" H 7000 3950 50  0001 C CNN
	1    7100 3500
	1    0    0    -1  
$EndComp
$Comp
L lib:TPS79933 U2
U 1 1 5FDE9FF9
P 9150 1500
F 0 "U2" H 9150 1842 50  0000 C CNN
F 1 "TPS79933" H 9150 1751 50  0000 C CNN
F 2 "Package_TO_SOT_SMD:SOT-23-5" H 9100 1950 50  0001 C CNN
F 3 "https://www.ti.com/lit/ds/symlink/tps799.pdf?ts=1608376643812&ref_url=https%253A%252F%252Fwww.ti.com%252Fproduct%252FTPS799" H 9100 2400 50  0001 C CNN
	1    9150 1500
	1    0    0    -1  
$EndComp
$Comp
L Device:C C1
U 1 1 5FE2E047
P 4800 1550
F 0 "C1" H 4850 1650 50  0000 L CNN
F 1 "1uF" H 4850 1450 50  0000 L CNN
F 2 "Capacitor_SMD:C_0805_2012Metric" H 4838 1400 50  0001 C CNN
F 3 "~" H 4800 1550 50  0001 C CNN
	1    4800 1550
	1    0    0    -1  
$EndComp
$Comp
L Device:C C2
U 1 1 5FE36399
P 4800 2050
F 0 "C2" H 4850 2150 50  0000 L CNN
F 1 "10uF" H 4850 1950 50  0000 L CNN
F 2 "Capacitor_SMD:C_0805_2012Metric" H 4838 1900 50  0001 C CNN
F 3 "~" H 4800 2050 50  0001 C CNN
	1    4800 2050
	1    0    0    -1  
$EndComp
Wire Wire Line
	6300 4150 6300 4250
Wire Wire Line
	6300 4050 6300 4150
Connection ~ 6300 4150
$Comp
L Device:C C3
U 1 1 5FEAEA17
P 6300 3100
F 0 "C3" H 6350 3200 50  0000 L CNN
F 1 "4.7uF" H 6400 3100 50  0000 L CNN
F 2 "Capacitor_SMD:C_0805_2012Metric" H 6338 2950 50  0001 C CNN
F 3 "~" H 6300 3100 50  0001 C CNN
	1    6300 3100
	1    0    0    -1  
$EndComp
$Comp
L Device:R R10
U 1 1 5FEE368C
P 6650 3200
F 0 "R10" V 6550 3300 50  0000 R CNN
F 1 "5.23k" V 6750 3300 50  0000 R CNN
F 2 "Resistor_SMD:R_0805_2012Metric" V 6580 3200 50  0001 C CNN
F 3 "~" H 6650 3200 50  0001 C CNN
	1    6650 3200
	1    0    0    1   
$EndComp
$Comp
L Device:R R11
U 1 1 5FEECBDC
P 6650 3650
F 0 "R11" V 6550 3700 50  0000 R CNN
F 1 "30.1k" V 6750 3750 50  0000 R CNN
F 2 "Resistor_SMD:R_0805_2012Metric" V 6580 3650 50  0001 C CNN
F 3 "~" H 6650 3650 50  0001 C CNN
	1    6650 3650
	1    0    0    1   
$EndComp
Connection ~ 6650 3500
Wire Wire Line
	6650 3500 6900 3500
Wire Wire Line
	6900 3800 6900 3600
Text Notes 7250 3600 0    50   ~ 0
Thermistor\n103AT-2\n
$Comp
L Switch:SW_Push SW1
U 1 1 5FF90ED9
P 6950 2950
F 0 "SW1" V 6850 3100 50  0000 C CNN
F 1 "1437566-3 (FSMSM)" V 7000 3500 50  0001 C CNN
F 2 "Button_Switch_SMD:SW_SPST_FSMSM" H 6950 3150 50  0001 C CNN
F 3 "~" H 6950 3150 50  0001 C CNN
	1    6950 2950
	0    1    1    0   
$EndComp
$Comp
L Device:R R9
U 1 1 5FFDDCA1
P 6500 2750
F 0 "R9" V 6700 2800 50  0000 R CNN
F 1 "4.7k" V 6600 2850 50  0000 R CNN
F 2 "Resistor_SMD:R_0805_2012Metric" V 6430 2750 50  0001 C CNN
F 3 "~" H 6500 2750 50  0001 C CNN
	1    6500 2750
	0    1    -1   0   
$EndComp
$Comp
L Device:L_Core_Iron L1
U 1 1 5FFF314D
P 6550 1400
F 0 "L1" V 6775 1400 50  0000 C CNN
F 1 "1uH" V 6684 1400 50  0000 C CNN
F 2 "lib:L_Vishay_IHLP-2020" H 6550 1400 50  0001 C CNN
F 3 "https://www.vishay.com/docs/34261/ihlp2020bz11.pdf" H 6550 1400 50  0001 C CNN
F 4 "IHLP2020BZER1R0M11" V 6550 1400 50  0001 C CNN "Part Number"
	1    6550 1400
	0    -1   -1   0   
$EndComp
$Comp
L Device:C C4
U 1 1 5FFF84FE
P 6400 1650
F 0 "C4" H 6450 1750 50  0000 L CNN
F 1 "0.047uF" H 6450 1550 50  0000 L CNN
F 2 "Capacitor_SMD:C_0805_2012Metric" H 6438 1500 50  0001 C CNN
F 3 "~" H 6400 1650 50  0001 C CNN
	1    6400 1650
	1    0    0    -1  
$EndComp
Wire Wire Line
	6400 1500 6400 1400
Connection ~ 6400 1400
Wire Wire Line
	6250 1500 6250 1400
Connection ~ 6250 1400
Wire Wire Line
	6250 1400 6400 1400
$Comp
L Device:C C5
U 1 1 600407F8
P 6950 1550
F 0 "C5" H 7000 1650 50  0000 L CNN
F 1 "10uF" H 7000 1450 50  0000 L CNN
F 2 "Capacitor_SMD:C_0805_2012Metric" H 6988 1400 50  0001 C CNN
F 3 "~" H 6950 1550 50  0001 C CNN
F 4 "GRM21BR71A106KE51L" H 6950 1550 50  0001 C CNN "Part Number"
	1    6950 1550
	1    0    0    -1  
$EndComp
$Comp
L Device:C C7
U 1 1 6004ACD5
P 7300 1550
F 0 "C7" H 7350 1650 50  0000 L CNN
F 1 "10uF" H 7350 1450 50  0000 L CNN
F 2 "Capacitor_SMD:C_0805_2012Metric" H 7338 1400 50  0001 C CNN
F 3 "~" H 7300 1550 50  0001 C CNN
F 4 "GRM21BR71A106KE51L" H 7300 1550 50  0001 C CNN "Part Number"
	1    7300 1550
	1    0    0    -1  
$EndComp
Connection ~ 6950 1400
Wire Wire Line
	6950 1400 7300 1400
$Comp
L power:GND #PWR018
U 1 1 6007979C
P 4800 1700
F 0 "#PWR018" H 4800 1450 50  0001 C CNN
F 1 "GND" H 4800 1550 50  0000 C CNN
F 2 "" H 4800 1700 50  0001 C CNN
F 3 "" H 4800 1700 50  0001 C CNN
	1    4800 1700
	1    0    0    -1  
$EndComp
$Comp
L power:GND #PWR022
U 1 1 600919D6
P 6650 3800
F 0 "#PWR022" H 6650 3550 50  0001 C CNN
F 1 "GND" H 6655 3627 50  0000 C CNN
F 2 "" H 6650 3800 50  0001 C CNN
F 3 "" H 6650 3800 50  0001 C CNN
	1    6650 3800
	1    0    0    -1  
$EndComp
$Comp
L power:GND #PWR023
U 1 1 6009C137
P 6900 3800
F 0 "#PWR023" H 6900 3550 50  0001 C CNN
F 1 "GND" H 6905 3627 50  0000 C CNN
F 2 "" H 6900 3800 50  0001 C CNN
F 3 "" H 6900 3800 50  0001 C CNN
	1    6900 3800
	1    0    0    -1  
$EndComp
$Comp
L power:GND #PWR020
U 1 1 600A6CE6
P 6300 3250
F 0 "#PWR020" H 6300 3000 50  0001 C CNN
F 1 "GND" H 6305 3077 50  0000 C CNN
F 2 "" H 6300 3250 50  0001 C CNN
F 3 "" H 6300 3250 50  0001 C CNN
	1    6300 3250
	1    0    0    -1  
$EndComp
$Comp
L power:GND #PWR026
U 1 1 600B157E
P 6950 3150
F 0 "#PWR026" H 6950 2900 50  0001 C CNN
F 1 "GND" H 6950 3000 50  0000 C CNN
F 2 "" H 6950 3150 50  0001 C CNN
F 3 "" H 6950 3150 50  0001 C CNN
	1    6950 3150
	1    0    0    -1  
$EndComp
$Comp
L power:GND #PWR028
U 1 1 600BC131
P 7300 1700
F 0 "#PWR028" H 7300 1450 50  0001 C CNN
F 1 "GND" H 7305 1527 50  0000 C CNN
F 2 "" H 7300 1700 50  0001 C CNN
F 3 "" H 7300 1700 50  0001 C CNN
	1    7300 1700
	1    0    0    -1  
$EndComp
$Comp
L power:GND #PWR024
U 1 1 600D1FAA
P 6950 1700
F 0 "#PWR024" H 6950 1450 50  0001 C CNN
F 1 "GND" H 6955 1527 50  0000 C CNN
F 2 "" H 6950 1700 50  0001 C CNN
F 3 "" H 6950 1700 50  0001 C CNN
	1    6950 1700
	1    0    0    -1  
$EndComp
$Comp
L Device:C C6
U 1 1 600F3745
P 6950 2300
F 0 "C6" H 7000 2400 50  0000 L CNN
F 1 "10uF" H 7000 2200 50  0000 L CNN
F 2 "Capacitor_SMD:C_0805_2012Metric" H 6988 2150 50  0001 C CNN
F 3 "~" H 6950 2300 50  0001 C CNN
F 4 "GRM21BR71A106KE51L" H 6950 2300 50  0001 C CNN "Part Number"
	1    6950 2300
	1    0    0    -1  
$EndComp
$Comp
L power:GND #PWR025
U 1 1 60109B06
P 6950 2450
F 0 "#PWR025" H 6950 2200 50  0001 C CNN
F 1 "GND" H 6950 2300 50  0000 C CNN
F 2 "" H 6950 2450 50  0001 C CNN
F 3 "" H 6950 2450 50  0001 C CNN
	1    6950 2450
	1    0    0    -1  
$EndComp
$Comp
L lib:MOLEX_22272021 J12
U 1 1 6010C8F5
P 7250 2150
F 0 "J12" H 7450 2250 50  0000 L CNN
F 1 "MOLEX_22272021" H 7300 1950 50  0001 L CNN
F 2 "lib:Molex_22272021_AE-6410-2_1x02-2.54mm" H 7150 2600 50  0001 C CNN
F 3 "https://www.molex.com/pdm_docs/sd/022272021_sd.pdf" H 7150 2600 50  0001 C CNN
	1    7250 2150
	1    0    0    -1  
$EndComp
Connection ~ 6950 2150
$Comp
L power:GND #PWR027
U 1 1 60123131
P 7250 2450
F 0 "#PWR027" H 7250 2200 50  0001 C CNN
F 1 "GND" H 7250 2300 50  0000 C CNN
F 2 "" H 7250 2450 50  0001 C CNN
F 3 "" H 7250 2450 50  0001 C CNN
	1    7250 2450
	1    0    0    -1  
$EndComp
Wire Wire Line
	7250 2450 7250 2250
Text Notes 7700 2250 0    50   ~ 0
Battery
Wire Wire Line
	6700 1400 6950 1400
Wire Wire Line
	6700 1950 6700 1400
Connection ~ 6700 1400
Wire Wire Line
	6250 2050 6250 1950
Connection ~ 6250 1950
Wire Wire Line
	6250 1950 6700 1950
Wire Wire Line
	6250 2250 6250 2150
Connection ~ 6250 2150
Wire Wire Line
	6300 2950 6650 2950
Connection ~ 6300 2950
Wire Wire Line
	6650 2950 6650 3050
Wire Wire Line
	6650 3500 6650 3350
Wire Wire Line
	6950 2750 6650 2750
$Comp
L power:GND #PWR021
U 1 1 602A7C03
P 6300 4350
F 0 "#PWR021" H 6300 4100 50  0001 C CNN
F 1 "GND" H 6305 4177 50  0000 C CNN
F 2 "" H 6300 4350 50  0001 C CNN
F 3 "" H 6300 4350 50  0001 C CNN
	1    6300 4350
	1    0    0    -1  
$EndComp
Wire Wire Line
	6300 4350 6300 4250
Connection ~ 6300 4250
Wire Wire Line
	6200 4250 6300 4250
NoConn ~ 5100 4250
Wire Wire Line
	6200 2950 6300 2950
Wire Wire Line
	6200 1800 6400 1800
Wire Wire Line
	6200 1500 6250 1500
Wire Wire Line
	6200 1400 6250 1400
Wire Wire Line
	6200 4150 6300 4150
Wire Wire Line
	6200 4050 6300 4050
Wire Wire Line
	6200 2050 6250 2050
Wire Wire Line
	6200 1950 6250 1950
Wire Wire Line
	6200 2250 6250 2250
Wire Wire Line
	6200 2150 6250 2150
Wire Wire Line
	6350 2750 6200 2750
Wire Wire Line
	6200 3500 6650 3500
Text Label 6350 1950 0    50   ~ 0
SYS
Wire Wire Line
	5100 1900 4800 1900
Wire Wire Line
	5100 1400 4800 1400
$Comp
L power:GND #PWR017
U 1 1 604A3118
P 4750 2700
F 0 "#PWR017" H 4750 2450 50  0001 C CNN
F 1 "GND" V 4755 2572 50  0000 R CNN
F 2 "" H 4750 2700 50  0001 C CNN
F 3 "" H 4750 2700 50  0001 C CNN
	1    4750 2700
	0    1    1    0   
$EndComp
Text Notes 4400 2850 0    50   ~ 0
ILIM=0.39A\n
$Comp
L Device:LED D2
U 1 1 60319BEB
P 4500 3000
F 0 "D2" H 4500 2900 50  0000 C CNN
F 1 "TO-1608BC-PG" H 4600 2850 50  0001 C CNN
F 2 "LED_SMD:LED_0603_1608Metric" H 4500 3000 50  0001 C CNN
F 3 "https://www.oasistek.com/pdf/TO-1608BC-PG_9201T057.pdf" H 4500 3000 50  0001 C CNN
	1    4500 3000
	-1   0    0    1   
$EndComp
$Comp
L Device:LED D3
U 1 1 6040BE74
P 4500 3300
F 0 "D3" H 4500 3200 50  0000 C CNN
F 1 "TO-1608BC-PG" H 4600 3150 50  0001 C CNN
F 2 "LED_SMD:LED_0603_1608Metric" H 4500 3300 50  0001 C CNN
F 3 "https://www.oasistek.com/pdf/TO-1608BC-PG_9201T057.pdf" H 4500 3300 50  0001 C CNN
	1    4500 3300
	-1   0    0    1   
$EndComp
Text Label 4200 3000 0    50   ~ 0
SYS
Wire Wire Line
	4150 3000 4350 3000
Connection ~ 4350 3000
Wire Wire Line
	4350 3300 4350 3000
Wire Wire Line
	5050 3300 5100 3300
Wire Wire Line
	5100 3000 5050 3000
Wire Wire Line
	4650 3300 4750 3300
$Comp
L Device:R R8
U 1 1 6040BE7A
P 4900 3300
F 0 "R8" V 4800 3350 50  0000 R CNN
F 1 "470" V 5000 3350 50  0000 R CNN
F 2 "Resistor_SMD:R_0805_2012Metric" V 4830 3300 50  0001 C CNN
F 3 "~" H 4900 3300 50  0001 C CNN
	1    4900 3300
	0    -1   1    0   
$EndComp
Wire Wire Line
	4650 3000 4750 3000
$Comp
L Device:R R7
U 1 1 60341192
P 4900 3000
F 0 "R7" V 4800 3050 50  0000 R CNN
F 1 "470" V 5000 3050 50  0000 R CNN
F 2 "Resistor_SMD:R_0805_2012Metric" V 4830 3000 50  0001 C CNN
F 3 "~" H 4900 3000 50  0001 C CNN
	1    4900 3000
	0    -1   1    0   
$EndComp
$Comp
L Device:R R6
U 1 1 6028FA62
P 4900 2700
F 0 "R6" V 4800 2750 50  0000 R CNN
F 1 "1k" V 5000 2750 50  0000 R CNN
F 2 "Resistor_SMD:R_0805_2012Metric" V 4830 2700 50  0001 C CNN
F 3 "~" H 4900 2700 50  0001 C CNN
	1    4900 2700
	0    -1   1    0   
$EndComp
Wire Wire Line
	5050 2700 5100 2700
$Comp
L lib:BQ25896 U1
U 1 1 5FDE867B
P 5100 1400
F 0 "U1" H 5650 1625 50  0000 C CNN
F 1 "BQ25896" H 5650 1534 50  0000 C CNN
F 2 "lib:WQFN-24-1EP_4x4mm_P0.5mm_EP2.7x2.7mm" H 5200 1500 50  0001 C CNN
F 3 "https://www.ti.com/lit/ds/symlink/bq25896.pdf?ts=1608194272574&ref_url=https%253A%252F%252Fwww.google.com%252F" H 5200 1500 50  0001 C CNN
	1    5100 1400
	1    0    0    -1  
$EndComp
Wire Wire Line
	5100 3600 4600 3600
Wire Wire Line
	5100 3500 4600 3500
Wire Wire Line
	5100 3700 4600 3700
$Comp
L power:GND #PWR019
U 1 1 6007B54E
P 4800 2200
F 0 "#PWR019" H 4800 1950 50  0001 C CNN
F 1 "GND" H 4950 2150 50  0000 C CNN
F 2 "" H 4800 2200 50  0001 C CNN
F 3 "" H 4800 2200 50  0001 C CNN
	1    4800 2200
	1    0    0    -1  
$EndComp
Text Label 4700 3600 0    50   ~ 0
SLC
Text Label 4700 3500 0    50   ~ 0
SDA
Text Label 4700 2400 0    50   ~ 0
PSEL
$Comp
L Connector_Generic:Conn_01x03 J8
U 1 1 604EFF04
P 4150 2400
F 0 "J8" H 4100 2600 50  0000 C CNN
F 1 "PLS-3" H 4150 2200 50  0000 C CNN
F 2 "Connector_PinHeader_2.54mm:PinHeader_1x03_P2.54mm_Vertical" H 4150 2400 50  0001 C CNN
F 3 "~" H 4150 2400 50  0001 C CNN
	1    4150 2400
	-1   0    0    -1  
$EndComp
Wire Wire Line
	4350 2400 5100 2400
$Comp
L power:GND #PWR014
U 1 1 60509DF9
P 4350 2500
F 0 "#PWR014" H 4350 2250 50  0001 C CNN
F 1 "GND" V 4350 2300 50  0000 C CNN
F 2 "" H 4350 2500 50  0001 C CNN
F 3 "" H 4350 2500 50  0001 C CNN
	1    4350 2500
	0    -1   -1   0   
$EndComp
Text Label 6500 2950 0    50   ~ 0
REGN
Text Label 4350 1850 0    50   ~ 0
REGN
$Comp
L Device:R R2
U 1 1 6052FDAC
P 4350 2050
F 0 "R2" V 4250 2100 50  0000 R CNN
F 1 "10k" V 4450 2100 50  0000 R CNN
F 2 "Resistor_SMD:R_0805_2012Metric" V 4280 2050 50  0001 C CNN
F 3 "~" H 4350 2050 50  0001 C CNN
	1    4350 2050
	1    0    0    1   
$EndComp
Wire Wire Line
	4350 2300 4350 2200
Wire Wire Line
	4350 1900 4350 1850
Text Notes 3450 2500 0    50   ~ 0
High - 500mA\nLow - 3.25A
$Comp
L Connector_Generic:Conn_01x03 J9
U 1 1 6055C4DA
P 4150 4400
F 0 "J9" H 4100 4600 50  0000 C CNN
F 1 "PLS-3" H 4150 4200 50  0000 C CNN
F 2 "Connector_PinHeader_2.54mm:PinHeader_1x03_P2.54mm_Vertical" H 4150 4400 50  0001 C CNN
F 3 "~" H 4150 4400 50  0001 C CNN
	1    4150 4400
	-1   0    0    -1  
$EndComp
$Comp
L Connector_Generic:Conn_01x03 J10
U 1 1 605690BC
P 4150 5100
F 0 "J10" H 4100 5300 50  0000 C CNN
F 1 "PLS-3" H 4150 4900 50  0000 C CNN
F 2 "Connector_PinHeader_2.54mm:PinHeader_1x03_P2.54mm_Vertical" H 4150 5100 50  0001 C CNN
F 3 "~" H 4150 5100 50  0001 C CNN
	1    4150 5100
	-1   0    0    -1  
$EndComp
$Comp
L power:GND #PWR015
U 1 1 60576169
P 4350 4500
F 0 "#PWR015" H 4350 4250 50  0001 C CNN
F 1 "GND" V 4350 4300 50  0000 C CNN
F 2 "" H 4350 4500 50  0001 C CNN
F 3 "" H 4350 4500 50  0001 C CNN
	1    4350 4500
	0    -1   -1   0   
$EndComp
$Comp
L power:GND #PWR016
U 1 1 60582B70
P 4350 5200
F 0 "#PWR016" H 4350 4950 50  0001 C CNN
F 1 "GND" V 4350 5000 50  0000 C CNN
F 2 "" H 4350 5200 50  0001 C CNN
F 3 "" H 4350 5200 50  0001 C CNN
	1    4350 5200
	0    -1   -1   0   
$EndComp
Text Label 4350 4000 0    50   ~ 0
REGN
$Comp
L Device:R R3
U 1 1 60590FE4
P 4350 4150
F 0 "R3" V 4250 4200 50  0000 R CNN
F 1 "10k" V 4450 4200 50  0000 R CNN
F 2 "Resistor_SMD:R_0805_2012Metric" V 4280 4150 50  0001 C CNN
F 3 "~" H 4350 4150 50  0001 C CNN
	1    4350 4150
	1    0    0    1   
$EndComp
$Comp
L Device:R R5
U 1 1 605D08A0
P 4450 3700
F 0 "R5" V 4350 3750 50  0000 R CNN
F 1 "10k" V 4550 3750 50  0000 R CNN
F 2 "Resistor_SMD:R_0805_2012Metric" V 4380 3700 50  0001 C CNN
F 3 "~" H 4450 3700 50  0001 C CNN
	1    4450 3700
	0    1    -1   0   
$EndComp
$Comp
L power:+3.3V #PWR013
U 1 1 605DD581
P 4300 3700
F 0 "#PWR013" H 4300 3550 50  0001 C CNN
F 1 "+3.3V" V 4315 3828 50  0000 L CNN
F 2 "" H 4300 3700 50  0001 C CNN
F 3 "" H 4300 3700 50  0001 C CNN
	1    4300 3700
	0    -1   -1   0   
$EndComp
Wire Wire Line
	4350 1850 4550 1850
Wire Wire Line
	4350 4000 4550 4000
Text Label 4350 4700 0    50   ~ 0
REGN
$Comp
L Device:R R4
U 1 1 60618689
P 4350 4850
F 0 "R4" V 4250 4900 50  0000 R CNN
F 1 "10k" V 4450 4900 50  0000 R CNN
F 2 "Resistor_SMD:R_0805_2012Metric" V 4280 4850 50  0001 C CNN
F 3 "~" H 4350 4850 50  0001 C CNN
	1    4350 4850
	1    0    0    1   
$EndComp
Wire Wire Line
	4350 4700 4550 4700
Wire Wire Line
	4350 4400 4650 4400
Wire Wire Line
	4650 4400 4650 3800
Wire Wire Line
	4650 3800 5100 3800
Wire Wire Line
	4350 5100 4750 5100
Wire Wire Line
	4750 5100 4750 3900
Wire Wire Line
	4750 3900 5100 3900
Text Notes 3600 4500 0    50   ~ 0
Boost mode\nenable
Text Notes 3500 5150 0    50   ~ 0
Active low \nCharge Enable
Wire Wire Line
	8850 1400 8750 1400
Wire Wire Line
	8850 1500 8750 1500
Wire Wire Line
	8750 1500 8750 1400
Connection ~ 8750 1400
Wire Wire Line
	8750 1400 8500 1400
$Comp
L power:GND #PWR030
U 1 1 606DD2A2
P 9150 1800
F 0 "#PWR030" H 9150 1550 50  0001 C CNN
F 1 "GND" H 9155 1627 50  0000 C CNN
F 2 "" H 9150 1800 50  0001 C CNN
F 3 "" H 9150 1800 50  0001 C CNN
	1    9150 1800
	1    0    0    -1  
$EndComp
$Comp
L Device:C C8
U 1 1 606EC899
P 8500 1650
F 0 "C8" H 8550 1750 50  0000 L CNN
F 1 "10uF" H 8550 1550 50  0000 L CNN
F 2 "Capacitor_SMD:C_0805_2012Metric" H 8538 1500 50  0001 C CNN
F 3 "~" H 8500 1650 50  0001 C CNN
F 4 "GRM21BR71A106KE51L" H 8500 1650 50  0001 C CNN "Part Number"
	1    8500 1650
	1    0    0    -1  
$EndComp
$Comp
L power:GND #PWR029
U 1 1 606FB100
P 8500 1800
F 0 "#PWR029" H 8500 1550 50  0001 C CNN
F 1 "GND" H 8505 1627 50  0000 C CNN
F 2 "" H 8500 1800 50  0001 C CNN
F 3 "" H 8500 1800 50  0001 C CNN
	1    8500 1800
	1    0    0    -1  
$EndComp
$Comp
L Device:C C10
U 1 1 6070A162
P 10050 1650
F 0 "C10" H 10100 1750 50  0000 L CNN
F 1 "10uF" H 10100 1550 50  0000 L CNN
F 2 "Capacitor_SMD:C_0805_2012Metric" H 10088 1500 50  0001 C CNN
F 3 "~" H 10050 1650 50  0001 C CNN
F 4 "GRM21BR71A106KE51L" H 10050 1650 50  0001 C CNN "Part Number"
	1    10050 1650
	1    0    0    -1  
$EndComp
$Comp
L power:GND #PWR033
U 1 1 6070A168
P 10050 1800
F 0 "#PWR033" H 10050 1550 50  0001 C CNN
F 1 "GND" H 10055 1627 50  0000 C CNN
F 2 "" H 10050 1800 50  0001 C CNN
F 3 "" H 10050 1800 50  0001 C CNN
	1    10050 1800
	1    0    0    -1  
$EndComp
$Comp
L Device:C C9
U 1 1 6072ABCC
P 9700 1650
F 0 "C9" H 9750 1750 50  0000 L CNN
F 1 "0.1uF" H 9750 1550 50  0000 L CNN
F 2 "Capacitor_SMD:C_0805_2012Metric" H 9738 1500 50  0001 C CNN
F 3 "~" H 9700 1650 50  0001 C CNN
F 4 "" H 9700 1650 50  0001 C CNN "Part Number"
	1    9700 1650
	1    0    0    -1  
$EndComp
$Comp
L power:GND #PWR031
U 1 1 6072ABD2
P 9700 1800
F 0 "#PWR031" H 9700 1550 50  0001 C CNN
F 1 "GND" H 9705 1627 50  0000 C CNN
F 2 "" H 9700 1800 50  0001 C CNN
F 3 "" H 9700 1800 50  0001 C CNN
	1    9700 1800
	1    0    0    -1  
$EndComp
Wire Wire Line
	8500 1500 8500 1400
Wire Wire Line
	9450 1500 9700 1500
Wire Wire Line
	10050 1400 10050 1500
Wire Wire Line
	9450 1400 10050 1400
$Comp
L power:+3.3V #PWR032
U 1 1 607A6D9F
P 10050 1400
F 0 "#PWR032" H 10050 1250 50  0001 C CNN
F 1 "+3.3V" H 10065 1573 50  0000 C CNN
F 2 "" H 10050 1400 50  0001 C CNN
F 3 "" H 10050 1400 50  0001 C CNN
	1    10050 1400
	1    0    0    -1  
$EndComp
Connection ~ 10050 1400
$Comp
L Device:R R1
U 1 1 607AC187
P 3850 1550
F 0 "R1" V 3750 1600 50  0000 R CNN
F 1 "470" V 3950 1600 50  0000 R CNN
F 2 "Resistor_SMD:R_0805_2012Metric" V 3780 1550 50  0001 C CNN
F 3 "~" H 3850 1550 50  0001 C CNN
	1    3850 1550
	1    0    0    1   
$EndComp
$Comp
L Device:LED D1
U 1 1 607AC18D
P 3850 1850
F 0 "D1" H 3850 1750 50  0000 C CNN
F 1 "TO-1608BC-MRE" H 3843 1686 50  0001 C CNN
F 2 "LED_SMD:LED_0603_1608Metric" H 3850 1850 50  0001 C CNN
F 3 "https://www.oasistek.com/pdf/TO-1608BC-MRE_9201T098.pdf" H 3850 1850 50  0001 C CNN
	1    3850 1850
	0    1    -1   0   
$EndComp
Wire Wire Line
	4800 1400 3850 1400
Connection ~ 4800 1400
$Comp
L power:GND #PWR012
U 1 1 607DAFBC
P 3850 2000
F 0 "#PWR012" H 3850 1750 50  0001 C CNN
F 1 "GND" H 3855 1827 50  0000 C CNN
F 2 "" H 3850 2000 50  0001 C CNN
F 3 "" H 3850 2000 50  0001 C CNN
	1    3850 2000
	1    0    0    -1  
$EndComp
$Comp
L Device:R R12
U 1 1 607EF082
P 10550 1550
F 0 "R12" V 10450 1600 50  0000 R CNN
F 1 "470" V 10650 1600 50  0000 R CNN
F 2 "Resistor_SMD:R_0805_2012Metric" V 10480 1550 50  0001 C CNN
F 3 "~" H 10550 1550 50  0001 C CNN
	1    10550 1550
	1    0    0    1   
$EndComp
$Comp
L Device:LED D4
U 1 1 607EF088
P 10550 1850
F 0 "D4" H 10550 1700 50  0000 C CNN
F 1 "TO-1608BC-MRE" H 10543 1686 50  0001 C CNN
F 2 "LED_SMD:LED_0603_1608Metric" H 10550 1850 50  0001 C CNN
F 3 "https://www.oasistek.com/pdf/TO-1608BC-MRE_9201T098.pdf" H 10550 1850 50  0001 C CNN
	1    10550 1850
	0    1    -1   0   
$EndComp
$Comp
L power:GND #PWR034
U 1 1 607EF08F
P 10550 2000
F 0 "#PWR034" H 10550 1750 50  0001 C CNN
F 1 "GND" H 10555 1827 50  0000 C CNN
F 2 "" H 10550 2000 50  0001 C CNN
F 3 "" H 10550 2000 50  0001 C CNN
	1    10550 2000
	1    0    0    -1  
$EndComp
Wire Wire Line
	10050 1400 10550 1400
Wire Wire Line
	1350 1400 1950 1400
Wire Wire Line
	1350 1500 1950 1500
$Comp
L Connector_Generic:Conn_01x03 J3
U 1 1 6086848B
P 2150 1500
F 0 "J3" H 2150 1700 50  0000 C CNN
F 1 "PLS-3" H 2150 1300 50  0000 C CNN
F 2 "Connector_PinHeader_2.54mm:PinHeader_1x03_P2.54mm_Vertical" H 2150 1500 50  0001 C CNN
F 3 "~" H 2150 1500 50  0001 C CNN
	1    2150 1500
	1    0    0    -1  
$EndComp
$Comp
L Connector_Generic:Conn_01x03 J1
U 1 1 60868491
P 1150 1500
F 0 "J1" H 1150 1700 50  0000 C CNN
F 1 "PBS-3" H 1100 1300 50  0000 C CNN
F 2 "Connector_PinSocket_2.54mm:PinSocket_1x03_P2.54mm_Vertical" H 1150 1500 50  0001 C CNN
F 3 "~" H 1150 1500 50  0001 C CNN
	1    1150 1500
	-1   0    0    -1  
$EndComp
Text Label 6750 2150 0    50   ~ 0
BAT
Text Label 3450 1400 0    50   ~ 0
VBUS
$Comp
L Connector_Generic:Conn_01x02 J5
U 1 1 6091C02D
P 2750 1400
F 0 "J5" H 2750 1500 50  0000 C CNN
F 1 "PLS-2" H 2750 1200 50  0000 C CNN
F 2 "Connector_PinHeader_2.54mm:PinHeader_1x02_P2.54mm_Vertical" H 2750 1400 50  0001 C CNN
F 3 "~" H 2750 1400 50  0001 C CNN
	1    2750 1400
	-1   0    0    -1  
$EndComp
$Comp
L power:GND #PWR08
U 1 1 60935D34
P 2950 1500
F 0 "#PWR08" H 2950 1250 50  0001 C CNN
F 1 "GND" V 2950 1300 50  0000 C CNN
F 2 "" H 2950 1500 50  0001 C CNN
F 3 "" H 2950 1500 50  0001 C CNN
	1    2950 1500
	0    -1   -1   0   
$EndComp
$Comp
L Connector_Generic:Conn_01x02 J7
U 1 1 6096586B
P 2750 2750
F 0 "J7" H 2750 2850 50  0000 C CNN
F 1 "PLS-2" H 2700 2550 50  0000 C CNN
F 2 "Connector_PinHeader_2.54mm:PinHeader_1x02_P2.54mm_Vertical" H 2750 2750 50  0001 C CNN
F 3 "~" H 2750 2750 50  0001 C CNN
	1    2750 2750
	-1   0    0    -1  
$EndComp
Wire Wire Line
	2950 2750 3450 2750
$Comp
L power:GND #PWR011
U 1 1 60965872
P 2950 2850
F 0 "#PWR011" H 2950 2600 50  0001 C CNN
F 1 "GND" V 2950 2650 50  0000 C CNN
F 2 "" H 2950 2850 50  0001 C CNN
F 3 "" H 2950 2850 50  0001 C CNN
	1    2950 2850
	0    -1   -1   0   
$EndComp
Text Label 3150 2750 0    50   ~ 0
BAT
$Comp
L Connector_Generic:Conn_01x02 J6
U 1 1 609945CF
P 2750 2350
F 0 "J6" H 2750 2450 50  0000 C CNN
F 1 "PLS-2" H 2750 2150 50  0000 C CNN
F 2 "Connector_PinHeader_2.54mm:PinHeader_1x02_P2.54mm_Vertical" H 2750 2350 50  0001 C CNN
F 3 "~" H 2750 2350 50  0001 C CNN
	1    2750 2350
	-1   0    0    -1  
$EndComp
$Comp
L power:GND #PWR010
U 1 1 609945D6
P 2950 2450
F 0 "#PWR010" H 2950 2200 50  0001 C CNN
F 1 "GND" V 2950 2250 50  0000 C CNN
F 2 "" H 2950 2450 50  0001 C CNN
F 3 "" H 2950 2450 50  0001 C CNN
	1    2950 2450
	0    -1   -1   0   
$EndComp
$Comp
L power:+3.3V #PWR09
U 1 1 609AC66E
P 2950 2350
F 0 "#PWR09" H 2950 2200 50  0001 C CNN
F 1 "+3.3V" V 2950 2600 50  0000 C CNN
F 2 "" H 2950 2350 50  0001 C CNN
F 3 "" H 2950 2350 50  0001 C CNN
	1    2950 2350
	0    1    1    0   
$EndComp
Text Label 1600 1400 0    50   ~ 0
SLC
Wire Wire Line
	2950 1400 3850 1400
Connection ~ 3850 1400
Wire Wire Line
	6950 2150 7250 2150
Wire Wire Line
	6250 2150 6950 2150
Text Label 1600 1500 0    50   ~ 0
SDA
$Comp
L power:GND #PWR01
U 1 1 5FDFD492
P 1350 1600
F 0 "#PWR01" H 1350 1350 50  0001 C CNN
F 1 "GND" V 1350 1400 50  0000 C CNN
F 2 "" H 1350 1600 50  0001 C CNN
F 3 "" H 1350 1600 50  0001 C CNN
	1    1350 1600
	0    -1   -1   0   
$EndComp
$Comp
L power:GND #PWR05
U 1 1 5FE02821
P 1950 1600
F 0 "#PWR05" H 1950 1350 50  0001 C CNN
F 1 "GND" V 1950 1400 50  0000 C CNN
F 2 "" H 1950 1600 50  0001 C CNN
F 3 "" H 1950 1600 50  0001 C CNN
	1    1950 1600
	0    1    1    0   
$EndComp
$Comp
L power:+3.3V #PWR0101
U 1 1 5FF45228
P 1650 3050
F 0 "#PWR0101" H 1650 2900 50  0001 C CNN
F 1 "+3.3V" H 1800 3150 50  0000 C CNN
F 2 "" H 1650 3050 50  0001 C CNN
F 3 "" H 1650 3050 50  0001 C CNN
	1    1650 3050
	1    0    0    -1  
$EndComp
$Comp
L power:GND #PWR0102
U 1 1 5FF4BAAA
P 1950 2850
F 0 "#PWR0102" H 1950 2600 50  0001 C CNN
F 1 "GND" V 1950 2650 50  0000 C CNN
F 2 "" H 1950 2850 50  0001 C CNN
F 3 "" H 1950 2850 50  0001 C CNN
	1    1950 2850
	0    1    1    0   
$EndComp
$Comp
L power:GND #PWR0103
U 1 1 5FF491C2
P 1350 2850
F 0 "#PWR0103" H 1350 2600 50  0001 C CNN
F 1 "GND" V 1350 2650 50  0000 C CNN
F 2 "" H 1350 2850 50  0001 C CNN
F 3 "" H 1350 2850 50  0001 C CNN
	1    1350 2850
	0    -1   -1   0   
$EndComp
Text Label 1600 2350 0    50   ~ 0
VBUS
$Comp
L Connector_Generic:Conn_01x09 J4
U 1 1 6086846F
P 2150 2750
F 0 "J4" H 2150 3250 50  0000 C CNN
F 1 "PLS-9" H 2150 2250 50  0000 C CNN
F 2 "Connector_PinHeader_2.54mm:PinHeader_1x09_P2.54mm_Vertical" H 2150 2750 50  0001 C CNN
F 3 "~" H 2150 2750 50  0001 C CNN
	1    2150 2750
	1    0    0    -1  
$EndComp
$Comp
L Connector_Generic:Conn_01x09 J2
U 1 1 60868447
P 1150 2750
F 0 "J2" H 1150 3250 50  0000 C CNN
F 1 "PBS-9" H 1100 2250 50  0000 C CNN
F 2 "Connector_PinSocket_2.54mm:PinSocket_1x09_P2.54mm_Vertical" H 1150 2750 50  0001 C CNN
F 3 "~" H 1150 2750 50  0001 C CNN
	1    1150 2750
	-1   0    0    -1  
$EndComp
Wire Wire Line
	1350 2450 1350 2350
Connection ~ 1350 2350
Wire Wire Line
	1350 2350 1950 2350
Wire Wire Line
	1950 2450 1950 2350
Connection ~ 1950 2350
Wire Wire Line
	1350 2650 1950 2650
Wire Wire Line
	1350 3050 1650 3050
Connection ~ 1650 3050
Wire Wire Line
	1650 3050 1950 3050
Wire Wire Line
	1350 2950 1350 3050
Connection ~ 1350 3050
Wire Wire Line
	1950 2950 1950 3050
Connection ~ 1950 3050
$Comp
L power:GND #PWR0104
U 1 1 5FFC8245
P 1950 3150
F 0 "#PWR0104" H 1950 2900 50  0001 C CNN
F 1 "GND" V 1950 2950 50  0000 C CNN
F 2 "" H 1950 3150 50  0001 C CNN
F 3 "" H 1950 3150 50  0001 C CNN
	1    1950 3150
	0    1    1    0   
$EndComp
$Comp
L power:GND #PWR0105
U 1 1 5FFCBD62
P 1350 3150
F 0 "#PWR0105" H 1350 2900 50  0001 C CNN
F 1 "GND" V 1350 2950 50  0000 C CNN
F 2 "" H 1350 3150 50  0001 C CNN
F 3 "" H 1350 3150 50  0001 C CNN
	1    1350 3150
	0    -1   -1   0   
$EndComp
$Comp
L power:GND #PWR0106
U 1 1 5FFDD391
P 1350 2550
F 0 "#PWR0106" H 1350 2300 50  0001 C CNN
F 1 "GND" V 1350 2350 50  0000 C CNN
F 2 "" H 1350 2550 50  0001 C CNN
F 3 "" H 1350 2550 50  0001 C CNN
	1    1350 2550
	0    -1   -1   0   
$EndComp
$Comp
L power:GND #PWR0107
U 1 1 5FFE00F6
P 1950 2550
F 0 "#PWR0107" H 1950 2300 50  0001 C CNN
F 1 "GND" V 1950 2350 50  0000 C CNN
F 2 "" H 1950 2550 50  0001 C CNN
F 3 "" H 1950 2550 50  0001 C CNN
	1    1950 2550
	0    1    1    0   
$EndComp
Wire Wire Line
	7300 1400 7800 1400
Connection ~ 7300 1400
Wire Wire Line
	6950 2150 6950 2000
Wire Wire Line
	6950 2000 8000 2000
Wire Wire Line
	8500 1400 7900 1400
Connection ~ 8500 1400
Wire Wire Line
	8000 2000 8000 1350
Wire Wire Line
	7900 1400 7900 1350
Wire Wire Line
	7800 1400 7800 1350
$Comp
L Connector_Generic:Conn_01x03 J13
U 1 1 5FFF5DC8
P 7900 1150
F 0 "J13" H 7850 1350 50  0000 C CNN
F 1 "PLS-3" H 7900 950 50  0000 C CNN
F 2 "Connector_PinHeader_2.54mm:PinHeader_1x03_P2.54mm_Vertical" H 7900 1150 50  0001 C CNN
F 3 "~" H 7900 1150 50  0001 C CNN
	1    7900 1150
	0    -1   -1   0   
$EndComp
Text Label 8150 1400 0    50   ~ 0
VOUT
Text Label 1600 2650 0    50   ~ 0
VOUT
Wire Wire Line
	1350 2750 1950 2750
Text Label 1600 2750 0    50   ~ 0
BAT
$EndSCHEMATC
