%TF.GenerationSoftware,KiCad,Pcbnew,(5.1.9)-1*%
%TF.CreationDate,2021-03-15T20:54:00+04:00*%
%TF.ProjectId,zx-mini-pcb-debug-module-battery-v1,7a782d6d-696e-4692-9d70-63622d646562,rev?*%
%TF.SameCoordinates,Original*%
%TF.FileFunction,Legend,Top*%
%TF.FilePolarity,Positive*%
%FSLAX46Y46*%
G04 Gerber Fmt 4.6, Leading zero omitted, Abs format (unit mm)*
G04 Created by KiCad (PCBNEW (5.1.9)-1) date 2021-03-15 20:54:00*
%MOMM*%
%LPD*%
G01*
G04 APERTURE LIST*
%ADD10C,0.150000*%
%ADD11C,0.250000*%
%ADD12C,0.120000*%
G04 APERTURE END LIST*
D10*
X154261904Y-104910000D02*
X154166666Y-104862380D01*
X154023809Y-104862380D01*
X153880952Y-104910000D01*
X153785714Y-105005238D01*
X153738095Y-105100476D01*
X153690476Y-105290952D01*
X153690476Y-105433809D01*
X153738095Y-105624285D01*
X153785714Y-105719523D01*
X153880952Y-105814761D01*
X154023809Y-105862380D01*
X154119047Y-105862380D01*
X154261904Y-105814761D01*
X154309523Y-105767142D01*
X154309523Y-105433809D01*
X154119047Y-105433809D01*
X153666666Y-102362380D02*
X154285714Y-102362380D01*
X153952380Y-102743333D01*
X154095238Y-102743333D01*
X154190476Y-102790952D01*
X154238095Y-102838571D01*
X154285714Y-102933809D01*
X154285714Y-103171904D01*
X154238095Y-103267142D01*
X154190476Y-103314761D01*
X154095238Y-103362380D01*
X153809523Y-103362380D01*
X153714285Y-103314761D01*
X153666666Y-103267142D01*
X153666666Y-99762380D02*
X154285714Y-99762380D01*
X153952380Y-100143333D01*
X154095238Y-100143333D01*
X154190476Y-100190952D01*
X154238095Y-100238571D01*
X154285714Y-100333809D01*
X154285714Y-100571904D01*
X154238095Y-100667142D01*
X154190476Y-100714761D01*
X154095238Y-100762380D01*
X153809523Y-100762380D01*
X153714285Y-100714761D01*
X153666666Y-100667142D01*
X154261904Y-97310000D02*
X154166666Y-97262380D01*
X154023809Y-97262380D01*
X153880952Y-97310000D01*
X153785714Y-97405238D01*
X153738095Y-97500476D01*
X153690476Y-97690952D01*
X153690476Y-97833809D01*
X153738095Y-98024285D01*
X153785714Y-98119523D01*
X153880952Y-98214761D01*
X154023809Y-98262380D01*
X154119047Y-98262380D01*
X154261904Y-98214761D01*
X154309523Y-98167142D01*
X154309523Y-97833809D01*
X154119047Y-97833809D01*
X154071428Y-95138571D02*
X154214285Y-95186190D01*
X154261904Y-95233809D01*
X154309523Y-95329047D01*
X154309523Y-95471904D01*
X154261904Y-95567142D01*
X154214285Y-95614761D01*
X154119047Y-95662380D01*
X153738095Y-95662380D01*
X153738095Y-94662380D01*
X154071428Y-94662380D01*
X154166666Y-94710000D01*
X154214285Y-94757619D01*
X154261904Y-94852857D01*
X154261904Y-94948095D01*
X154214285Y-95043333D01*
X154166666Y-95090952D01*
X154071428Y-95138571D01*
X153738095Y-95138571D01*
X153904761Y-92162380D02*
X154095238Y-92162380D01*
X154190476Y-92210000D01*
X154285714Y-92305238D01*
X154333333Y-92495714D01*
X154333333Y-92829047D01*
X154285714Y-93019523D01*
X154190476Y-93114761D01*
X154095238Y-93162380D01*
X153904761Y-93162380D01*
X153809523Y-93114761D01*
X153714285Y-93019523D01*
X153666666Y-92829047D01*
X153666666Y-92495714D01*
X153714285Y-92305238D01*
X153809523Y-92210000D01*
X153904761Y-92162380D01*
X154261904Y-89610000D02*
X154166666Y-89562380D01*
X154023809Y-89562380D01*
X153880952Y-89610000D01*
X153785714Y-89705238D01*
X153738095Y-89800476D01*
X153690476Y-89990952D01*
X153690476Y-90133809D01*
X153738095Y-90324285D01*
X153785714Y-90419523D01*
X153880952Y-90514761D01*
X154023809Y-90562380D01*
X154119047Y-90562380D01*
X154261904Y-90514761D01*
X154309523Y-90467142D01*
X154309523Y-90133809D01*
X154119047Y-90133809D01*
X153666666Y-84562380D02*
X154000000Y-85562380D01*
X154333333Y-84562380D01*
X153666666Y-87062380D02*
X154000000Y-88062380D01*
X154333333Y-87062380D01*
D11*
X130952380Y-87871904D02*
X129952380Y-87871904D01*
X129952380Y-87490952D01*
X130000000Y-87395714D01*
X130047619Y-87348095D01*
X130142857Y-87300476D01*
X130285714Y-87300476D01*
X130380952Y-87348095D01*
X130428571Y-87395714D01*
X130476190Y-87490952D01*
X130476190Y-87871904D01*
X130000000Y-86348095D02*
X129952380Y-86443333D01*
X129952380Y-86586190D01*
X130000000Y-86729047D01*
X130095238Y-86824285D01*
X130190476Y-86871904D01*
X130380952Y-86919523D01*
X130523809Y-86919523D01*
X130714285Y-86871904D01*
X130809523Y-86824285D01*
X130904761Y-86729047D01*
X130952380Y-86586190D01*
X130952380Y-86490952D01*
X130904761Y-86348095D01*
X130857142Y-86300476D01*
X130523809Y-86300476D01*
X130523809Y-86490952D01*
X132704761Y-89286190D02*
X132752380Y-89143333D01*
X132752380Y-88905238D01*
X132704761Y-88810000D01*
X132657142Y-88762380D01*
X132561904Y-88714761D01*
X132466666Y-88714761D01*
X132371428Y-88762380D01*
X132323809Y-88810000D01*
X132276190Y-88905238D01*
X132228571Y-89095714D01*
X132180952Y-89190952D01*
X132133333Y-89238571D01*
X132038095Y-89286190D01*
X131942857Y-89286190D01*
X131847619Y-89238571D01*
X131800000Y-89190952D01*
X131752380Y-89095714D01*
X131752380Y-88857619D01*
X131800000Y-88714761D01*
X131752380Y-88429047D02*
X131752380Y-87857619D01*
X132752380Y-88143333D02*
X131752380Y-88143333D01*
X132466666Y-87571904D02*
X132466666Y-87095714D01*
X132752380Y-87667142D02*
X131752380Y-87333809D01*
X132752380Y-87000476D01*
X131752380Y-86810000D02*
X131752380Y-86238571D01*
X132752380Y-86524285D02*
X131752380Y-86524285D01*
X126638095Y-89670000D02*
X126542857Y-89622380D01*
X126400000Y-89622380D01*
X126257142Y-89670000D01*
X126161904Y-89765238D01*
X126114285Y-89860476D01*
X126066666Y-90050952D01*
X126066666Y-90193809D01*
X126114285Y-90384285D01*
X126161904Y-90479523D01*
X126257142Y-90574761D01*
X126400000Y-90622380D01*
X126495238Y-90622380D01*
X126638095Y-90574761D01*
X126685714Y-90527142D01*
X126685714Y-90193809D01*
X126495238Y-90193809D01*
X127114285Y-90622380D02*
X127114285Y-89622380D01*
X127685714Y-90622380D01*
X127685714Y-89622380D01*
X128161904Y-90622380D02*
X128161904Y-89622380D01*
X128400000Y-89622380D01*
X128542857Y-89670000D01*
X128638095Y-89765238D01*
X128685714Y-89860476D01*
X128733333Y-90050952D01*
X128733333Y-90193809D01*
X128685714Y-90384285D01*
X128638095Y-90479523D01*
X128542857Y-90574761D01*
X128400000Y-90622380D01*
X128161904Y-90622380D01*
X126066667Y-88074761D02*
X126209524Y-88122380D01*
X126447619Y-88122380D01*
X126542857Y-88074761D01*
X126590476Y-88027142D01*
X126638095Y-87931904D01*
X126638095Y-87836666D01*
X126590476Y-87741428D01*
X126542857Y-87693809D01*
X126447619Y-87646190D01*
X126257143Y-87598571D01*
X126161905Y-87550952D01*
X126114286Y-87503333D01*
X126066667Y-87408095D01*
X126066667Y-87312857D01*
X126114286Y-87217619D01*
X126161905Y-87170000D01*
X126257143Y-87122380D01*
X126495238Y-87122380D01*
X126638095Y-87170000D01*
X127066667Y-88122380D02*
X127066667Y-87122380D01*
X127304762Y-87122380D01*
X127447619Y-87170000D01*
X127542857Y-87265238D01*
X127590476Y-87360476D01*
X127638095Y-87550952D01*
X127638095Y-87693809D01*
X127590476Y-87884285D01*
X127542857Y-87979523D01*
X127447619Y-88074761D01*
X127304762Y-88122380D01*
X127066667Y-88122380D01*
X128019048Y-87836666D02*
X128495238Y-87836666D01*
X127923810Y-88122380D02*
X128257143Y-87122380D01*
X128590476Y-88122380D01*
X126066666Y-85514761D02*
X126209523Y-85562380D01*
X126447619Y-85562380D01*
X126542857Y-85514761D01*
X126590476Y-85467142D01*
X126638095Y-85371904D01*
X126638095Y-85276666D01*
X126590476Y-85181428D01*
X126542857Y-85133809D01*
X126447619Y-85086190D01*
X126257143Y-85038571D01*
X126161904Y-84990952D01*
X126114285Y-84943333D01*
X126066666Y-84848095D01*
X126066666Y-84752857D01*
X126114285Y-84657619D01*
X126161904Y-84610000D01*
X126257143Y-84562380D01*
X126495238Y-84562380D01*
X126638095Y-84610000D01*
X127638095Y-85467142D02*
X127590476Y-85514761D01*
X127447619Y-85562380D01*
X127352381Y-85562380D01*
X127209523Y-85514761D01*
X127114285Y-85419523D01*
X127066666Y-85324285D01*
X127019047Y-85133809D01*
X127019047Y-84990952D01*
X127066666Y-84800476D01*
X127114285Y-84705238D01*
X127209523Y-84610000D01*
X127352381Y-84562380D01*
X127447619Y-84562380D01*
X127590476Y-84610000D01*
X127638095Y-84657619D01*
X128542857Y-85562380D02*
X128066666Y-85562380D01*
X128066666Y-84562380D01*
D12*
%TO.C,C1*%
X139938748Y-85345000D02*
X140461252Y-85345000D01*
X139938748Y-83875000D02*
X140461252Y-83875000D01*
%TO.C,C2*%
X143338748Y-85875000D02*
X143861252Y-85875000D01*
X143338748Y-87345000D02*
X143861252Y-87345000D01*
%TO.C,C3*%
X143338748Y-89345000D02*
X143861252Y-89345000D01*
X143338748Y-87875000D02*
X143861252Y-87875000D01*
%TO.C,C4*%
X143861252Y-91345000D02*
X143338748Y-91345000D01*
X143861252Y-89875000D02*
X143338748Y-89875000D01*
%TO.C,C5*%
X137538748Y-95145000D02*
X138061252Y-95145000D01*
X137538748Y-93675000D02*
X138061252Y-93675000D01*
%TO.C,C6*%
X134261252Y-93675000D02*
X133738748Y-93675000D01*
X134261252Y-95145000D02*
X133738748Y-95145000D01*
%TO.C,C7*%
X137538748Y-95675000D02*
X138061252Y-95675000D01*
X137538748Y-97145000D02*
X138061252Y-97145000D01*
%TO.C,C8*%
X138435000Y-103848748D02*
X138435000Y-104371252D01*
X136965000Y-103848748D02*
X136965000Y-104371252D01*
%TO.C,C10*%
X143165000Y-103848748D02*
X143165000Y-104371252D01*
X144635000Y-103848748D02*
X144635000Y-104371252D01*
%TO.C,D1*%
X147300000Y-83375000D02*
X145015000Y-83375000D01*
X145015000Y-83375000D02*
X145015000Y-84845000D01*
X145015000Y-84845000D02*
X147300000Y-84845000D01*
%TO.C,D2*%
X132935000Y-85330000D02*
X132935000Y-83045000D01*
X132935000Y-83045000D02*
X131465000Y-83045000D01*
X131465000Y-83045000D02*
X131465000Y-85330000D01*
%TO.C,D3*%
X129665000Y-83045000D02*
X129665000Y-85330000D01*
X131135000Y-83045000D02*
X129665000Y-83045000D01*
X131135000Y-85330000D02*
X131135000Y-83045000D01*
%TO.C,D4*%
X146585000Y-99575000D02*
X144300000Y-99575000D01*
X146585000Y-101045000D02*
X146585000Y-99575000D01*
X144300000Y-101045000D02*
X146585000Y-101045000D01*
%TO.C,J5*%
X145990000Y-91460000D02*
X148650000Y-91460000D01*
X145990000Y-88860000D02*
X145990000Y-91460000D01*
X148650000Y-88860000D02*
X148650000Y-91460000D01*
X145990000Y-88860000D02*
X148650000Y-88860000D01*
X145990000Y-87590000D02*
X145990000Y-86260000D01*
X145990000Y-86260000D02*
X147320000Y-86260000D01*
%TO.C,J6*%
X145990000Y-106700000D02*
X148650000Y-106700000D01*
X145990000Y-104100000D02*
X145990000Y-106700000D01*
X148650000Y-104100000D02*
X148650000Y-106700000D01*
X145990000Y-104100000D02*
X148650000Y-104100000D01*
X145990000Y-102830000D02*
X145990000Y-101500000D01*
X145990000Y-101500000D02*
X147320000Y-101500000D01*
%TO.C,J7*%
X145990000Y-93880000D02*
X147320000Y-93880000D01*
X145990000Y-95210000D02*
X145990000Y-93880000D01*
X145990000Y-96480000D02*
X148650000Y-96480000D01*
X148650000Y-96480000D02*
X148650000Y-99080000D01*
X145990000Y-96480000D02*
X145990000Y-99080000D01*
X145990000Y-99080000D02*
X148650000Y-99080000D01*
%TO.C,J8*%
X120680000Y-106710000D02*
X123340000Y-106710000D01*
X120680000Y-101570000D02*
X120680000Y-106710000D01*
X123340000Y-101570000D02*
X123340000Y-106710000D01*
X120680000Y-101570000D02*
X123340000Y-101570000D01*
X120680000Y-100300000D02*
X120680000Y-98970000D01*
X120680000Y-98970000D02*
X122010000Y-98970000D01*
%TO.C,J9*%
X123220000Y-106710000D02*
X125880000Y-106710000D01*
X123220000Y-101570000D02*
X123220000Y-106710000D01*
X125880000Y-101570000D02*
X125880000Y-106710000D01*
X123220000Y-101570000D02*
X125880000Y-101570000D01*
X123220000Y-100300000D02*
X123220000Y-98970000D01*
X123220000Y-98970000D02*
X124550000Y-98970000D01*
%TO.C,J10*%
X125760000Y-98970000D02*
X127090000Y-98970000D01*
X125760000Y-100300000D02*
X125760000Y-98970000D01*
X125760000Y-101570000D02*
X128420000Y-101570000D01*
X128420000Y-101570000D02*
X128420000Y-106710000D01*
X125760000Y-101570000D02*
X125760000Y-106710000D01*
X125760000Y-106710000D02*
X128420000Y-106710000D01*
%TO.C,J12*%
X132970000Y-101770000D02*
X135510000Y-101770000D01*
X131760000Y-107210000D02*
X130430000Y-107210000D01*
X130430000Y-107210000D02*
X130430000Y-105880000D01*
X132970000Y-101410000D02*
X135510000Y-101410000D01*
X132970000Y-107210000D02*
X135510000Y-107210000D01*
X135510000Y-107210000D02*
X135510000Y-101410000D01*
X132970000Y-107210000D02*
X132970000Y-101410000D01*
%TO.C,R7*%
X136035000Y-84282936D02*
X136035000Y-84737064D01*
X134565000Y-84282936D02*
X134565000Y-84737064D01*
%TO.C,R8*%
X136465000Y-84282936D02*
X136465000Y-84737064D01*
X137935000Y-84282936D02*
X137935000Y-84737064D01*
%TO.C,R9*%
X131372936Y-91045000D02*
X131827064Y-91045000D01*
X131372936Y-89575000D02*
X131827064Y-89575000D01*
%TO.C,SW1*%
X128960000Y-95920000D02*
X122840000Y-95920000D01*
X122840000Y-95920000D02*
X122840000Y-92300000D01*
X122840000Y-92300000D02*
X128960000Y-92300000D01*
X128960000Y-92300000D02*
X128960000Y-95920000D01*
%TO.C,U1*%
X135590000Y-87200000D02*
X136065000Y-87200000D01*
X135590000Y-90945000D02*
X135590000Y-91420000D01*
X139810000Y-87675000D02*
X139810000Y-87200000D01*
X139810000Y-91420000D02*
X139335000Y-91420000D01*
X135590000Y-87675000D02*
X135590000Y-87200000D01*
X139810000Y-90945000D02*
X139810000Y-91420000D01*
X135590000Y-91420000D02*
X136065000Y-91420000D01*
%TO.C,U2*%
X139900000Y-105720000D02*
X141700000Y-105720000D01*
X141700000Y-102500000D02*
X139250000Y-102500000D01*
%TO.C,L1*%
X139960000Y-98750000D02*
X140905000Y-98750000D01*
X139960000Y-93470000D02*
X139960000Y-98750000D01*
X140905000Y-93470000D02*
X139960000Y-93470000D01*
X144295000Y-93470000D02*
X145240000Y-93470000D01*
X145240000Y-98750000D02*
X144295000Y-98750000D01*
X145240000Y-93470000D02*
X145240000Y-98750000D01*
%TO.C,J4*%
X148530000Y-83720000D02*
X149860000Y-83720000D01*
X148530000Y-85050000D02*
X148530000Y-83720000D01*
X148530000Y-86320000D02*
X151190000Y-86320000D01*
X151190000Y-86320000D02*
X151190000Y-106700000D01*
X148530000Y-86320000D02*
X148530000Y-106700000D01*
X148530000Y-106700000D02*
X151190000Y-106700000D01*
%TO.C,J13*%
X143770000Y-99680000D02*
X143770000Y-101010000D01*
X142440000Y-99680000D02*
X143770000Y-99680000D01*
X141170000Y-99680000D02*
X141170000Y-102340000D01*
X141170000Y-102340000D02*
X136030000Y-102340000D01*
X141170000Y-99680000D02*
X136030000Y-99680000D01*
X136030000Y-99680000D02*
X136030000Y-102340000D01*
%TO.C,J3*%
X123170000Y-83720000D02*
X124500000Y-83720000D01*
X123170000Y-85050000D02*
X123170000Y-83720000D01*
X123170000Y-86320000D02*
X125830000Y-86320000D01*
X125830000Y-86320000D02*
X125830000Y-91460000D01*
X123170000Y-86320000D02*
X123170000Y-91460000D01*
X123170000Y-91460000D02*
X125830000Y-91460000D01*
%TO.C,J11*%
X131930000Y-100570000D02*
X130600000Y-100570000D01*
X131930000Y-99240000D02*
X131930000Y-100570000D01*
X131930000Y-97970000D02*
X129270000Y-97970000D01*
X129270000Y-97970000D02*
X129270000Y-95370000D01*
X131930000Y-97970000D02*
X131930000Y-95370000D01*
X131930000Y-95370000D02*
X129270000Y-95370000D01*
%TO.C,C1*%
D10*
X142433333Y-85067142D02*
X142385714Y-85114761D01*
X142242857Y-85162380D01*
X142147619Y-85162380D01*
X142004761Y-85114761D01*
X141909523Y-85019523D01*
X141861904Y-84924285D01*
X141814285Y-84733809D01*
X141814285Y-84590952D01*
X141861904Y-84400476D01*
X141909523Y-84305238D01*
X142004761Y-84210000D01*
X142147619Y-84162380D01*
X142242857Y-84162380D01*
X142385714Y-84210000D01*
X142433333Y-84257619D01*
X143385714Y-85162380D02*
X142814285Y-85162380D01*
X143100000Y-85162380D02*
X143100000Y-84162380D01*
X143004761Y-84305238D01*
X142909523Y-84400476D01*
X142814285Y-84448095D01*
%TO.C,C2*%
X140933333Y-87167142D02*
X140885714Y-87214761D01*
X140742857Y-87262380D01*
X140647619Y-87262380D01*
X140504761Y-87214761D01*
X140409523Y-87119523D01*
X140361904Y-87024285D01*
X140314285Y-86833809D01*
X140314285Y-86690952D01*
X140361904Y-86500476D01*
X140409523Y-86405238D01*
X140504761Y-86310000D01*
X140647619Y-86262380D01*
X140742857Y-86262380D01*
X140885714Y-86310000D01*
X140933333Y-86357619D01*
X141314285Y-86357619D02*
X141361904Y-86310000D01*
X141457142Y-86262380D01*
X141695238Y-86262380D01*
X141790476Y-86310000D01*
X141838095Y-86357619D01*
X141885714Y-86452857D01*
X141885714Y-86548095D01*
X141838095Y-86690952D01*
X141266666Y-87262380D01*
X141885714Y-87262380D01*
%TO.C,C3*%
X140933333Y-88667142D02*
X140885714Y-88714761D01*
X140742857Y-88762380D01*
X140647619Y-88762380D01*
X140504761Y-88714761D01*
X140409523Y-88619523D01*
X140361904Y-88524285D01*
X140314285Y-88333809D01*
X140314285Y-88190952D01*
X140361904Y-88000476D01*
X140409523Y-87905238D01*
X140504761Y-87810000D01*
X140647619Y-87762380D01*
X140742857Y-87762380D01*
X140885714Y-87810000D01*
X140933333Y-87857619D01*
X141266666Y-87762380D02*
X141885714Y-87762380D01*
X141552380Y-88143333D01*
X141695238Y-88143333D01*
X141790476Y-88190952D01*
X141838095Y-88238571D01*
X141885714Y-88333809D01*
X141885714Y-88571904D01*
X141838095Y-88667142D01*
X141790476Y-88714761D01*
X141695238Y-88762380D01*
X141409523Y-88762380D01*
X141314285Y-88714761D01*
X141266666Y-88667142D01*
%TO.C,C4*%
X140933333Y-90967142D02*
X140885714Y-91014761D01*
X140742857Y-91062380D01*
X140647619Y-91062380D01*
X140504761Y-91014761D01*
X140409523Y-90919523D01*
X140361904Y-90824285D01*
X140314285Y-90633809D01*
X140314285Y-90490952D01*
X140361904Y-90300476D01*
X140409523Y-90205238D01*
X140504761Y-90110000D01*
X140647619Y-90062380D01*
X140742857Y-90062380D01*
X140885714Y-90110000D01*
X140933333Y-90157619D01*
X141790476Y-90395714D02*
X141790476Y-91062380D01*
X141552380Y-90014761D02*
X141314285Y-90729047D01*
X141933333Y-90729047D01*
%TO.C,C5*%
X137733333Y-93087142D02*
X137685714Y-93134761D01*
X137542857Y-93182380D01*
X137447619Y-93182380D01*
X137304761Y-93134761D01*
X137209523Y-93039523D01*
X137161904Y-92944285D01*
X137114285Y-92753809D01*
X137114285Y-92610952D01*
X137161904Y-92420476D01*
X137209523Y-92325238D01*
X137304761Y-92230000D01*
X137447619Y-92182380D01*
X137542857Y-92182380D01*
X137685714Y-92230000D01*
X137733333Y-92277619D01*
X138638095Y-92182380D02*
X138161904Y-92182380D01*
X138114285Y-92658571D01*
X138161904Y-92610952D01*
X138257142Y-92563333D01*
X138495238Y-92563333D01*
X138590476Y-92610952D01*
X138638095Y-92658571D01*
X138685714Y-92753809D01*
X138685714Y-92991904D01*
X138638095Y-93087142D01*
X138590476Y-93134761D01*
X138495238Y-93182380D01*
X138257142Y-93182380D01*
X138161904Y-93134761D01*
X138114285Y-93087142D01*
%TO.C,C6*%
X134933333Y-93257142D02*
X134885714Y-93304761D01*
X134742857Y-93352380D01*
X134647619Y-93352380D01*
X134504761Y-93304761D01*
X134409523Y-93209523D01*
X134361904Y-93114285D01*
X134314285Y-92923809D01*
X134314285Y-92780952D01*
X134361904Y-92590476D01*
X134409523Y-92495238D01*
X134504761Y-92400000D01*
X134647619Y-92352380D01*
X134742857Y-92352380D01*
X134885714Y-92400000D01*
X134933333Y-92447619D01*
X135790476Y-92352380D02*
X135600000Y-92352380D01*
X135504761Y-92400000D01*
X135457142Y-92447619D01*
X135361904Y-92590476D01*
X135314285Y-92780952D01*
X135314285Y-93161904D01*
X135361904Y-93257142D01*
X135409523Y-93304761D01*
X135504761Y-93352380D01*
X135695238Y-93352380D01*
X135790476Y-93304761D01*
X135838095Y-93257142D01*
X135885714Y-93161904D01*
X135885714Y-92923809D01*
X135838095Y-92828571D01*
X135790476Y-92780952D01*
X135695238Y-92733333D01*
X135504761Y-92733333D01*
X135409523Y-92780952D01*
X135361904Y-92828571D01*
X135314285Y-92923809D01*
%TO.C,C7*%
X137833333Y-98467142D02*
X137785714Y-98514761D01*
X137642857Y-98562380D01*
X137547619Y-98562380D01*
X137404761Y-98514761D01*
X137309523Y-98419523D01*
X137261904Y-98324285D01*
X137214285Y-98133809D01*
X137214285Y-97990952D01*
X137261904Y-97800476D01*
X137309523Y-97705238D01*
X137404761Y-97610000D01*
X137547619Y-97562380D01*
X137642857Y-97562380D01*
X137785714Y-97610000D01*
X137833333Y-97657619D01*
X138166666Y-97562380D02*
X138833333Y-97562380D01*
X138404761Y-98562380D01*
%TO.C,C8*%
X136657142Y-104476666D02*
X136704761Y-104524285D01*
X136752380Y-104667142D01*
X136752380Y-104762380D01*
X136704761Y-104905238D01*
X136609523Y-105000476D01*
X136514285Y-105048095D01*
X136323809Y-105095714D01*
X136180952Y-105095714D01*
X135990476Y-105048095D01*
X135895238Y-105000476D01*
X135800000Y-104905238D01*
X135752380Y-104762380D01*
X135752380Y-104667142D01*
X135800000Y-104524285D01*
X135847619Y-104476666D01*
X136180952Y-103905238D02*
X136133333Y-104000476D01*
X136085714Y-104048095D01*
X135990476Y-104095714D01*
X135942857Y-104095714D01*
X135847619Y-104048095D01*
X135800000Y-104000476D01*
X135752380Y-103905238D01*
X135752380Y-103714761D01*
X135800000Y-103619523D01*
X135847619Y-103571904D01*
X135942857Y-103524285D01*
X135990476Y-103524285D01*
X136085714Y-103571904D01*
X136133333Y-103619523D01*
X136180952Y-103714761D01*
X136180952Y-103905238D01*
X136228571Y-104000476D01*
X136276190Y-104048095D01*
X136371428Y-104095714D01*
X136561904Y-104095714D01*
X136657142Y-104048095D01*
X136704761Y-104000476D01*
X136752380Y-103905238D01*
X136752380Y-103714761D01*
X136704761Y-103619523D01*
X136657142Y-103571904D01*
X136561904Y-103524285D01*
X136371428Y-103524285D01*
X136276190Y-103571904D01*
X136228571Y-103619523D01*
X136180952Y-103714761D01*
%TO.C,C10*%
X145757142Y-104852857D02*
X145804761Y-104900476D01*
X145852380Y-105043333D01*
X145852380Y-105138571D01*
X145804761Y-105281428D01*
X145709523Y-105376666D01*
X145614285Y-105424285D01*
X145423809Y-105471904D01*
X145280952Y-105471904D01*
X145090476Y-105424285D01*
X144995238Y-105376666D01*
X144900000Y-105281428D01*
X144852380Y-105138571D01*
X144852380Y-105043333D01*
X144900000Y-104900476D01*
X144947619Y-104852857D01*
X145852380Y-103900476D02*
X145852380Y-104471904D01*
X145852380Y-104186190D02*
X144852380Y-104186190D01*
X144995238Y-104281428D01*
X145090476Y-104376666D01*
X145138095Y-104471904D01*
X144852380Y-103281428D02*
X144852380Y-103186190D01*
X144900000Y-103090952D01*
X144947619Y-103043333D01*
X145042857Y-102995714D01*
X145233333Y-102948095D01*
X145471428Y-102948095D01*
X145661904Y-102995714D01*
X145757142Y-103043333D01*
X145804761Y-103090952D01*
X145852380Y-103186190D01*
X145852380Y-103281428D01*
X145804761Y-103376666D01*
X145757142Y-103424285D01*
X145661904Y-103471904D01*
X145471428Y-103519523D01*
X145233333Y-103519523D01*
X145042857Y-103471904D01*
X144947619Y-103424285D01*
X144900000Y-103376666D01*
X144852380Y-103281428D01*
%TO.C,D1*%
X143461904Y-84662380D02*
X143461904Y-83662380D01*
X143700000Y-83662380D01*
X143842857Y-83710000D01*
X143938095Y-83805238D01*
X143985714Y-83900476D01*
X144033333Y-84090952D01*
X144033333Y-84233809D01*
X143985714Y-84424285D01*
X143938095Y-84519523D01*
X143842857Y-84614761D01*
X143700000Y-84662380D01*
X143461904Y-84662380D01*
X144985714Y-84662380D02*
X144414285Y-84662380D01*
X144700000Y-84662380D02*
X144700000Y-83662380D01*
X144604761Y-83805238D01*
X144509523Y-83900476D01*
X144414285Y-83948095D01*
%TO.C,D2*%
X134152380Y-84548095D02*
X133152380Y-84548095D01*
X133152380Y-84310000D01*
X133200000Y-84167142D01*
X133295238Y-84071904D01*
X133390476Y-84024285D01*
X133580952Y-83976666D01*
X133723809Y-83976666D01*
X133914285Y-84024285D01*
X134009523Y-84071904D01*
X134104761Y-84167142D01*
X134152380Y-84310000D01*
X134152380Y-84548095D01*
X133247619Y-83595714D02*
X133200000Y-83548095D01*
X133152380Y-83452857D01*
X133152380Y-83214761D01*
X133200000Y-83119523D01*
X133247619Y-83071904D01*
X133342857Y-83024285D01*
X133438095Y-83024285D01*
X133580952Y-83071904D01*
X134152380Y-83643333D01*
X134152380Y-83024285D01*
%TO.C,D3*%
X129352380Y-84648095D02*
X128352380Y-84648095D01*
X128352380Y-84410000D01*
X128400000Y-84267142D01*
X128495238Y-84171904D01*
X128590476Y-84124285D01*
X128780952Y-84076666D01*
X128923809Y-84076666D01*
X129114285Y-84124285D01*
X129209523Y-84171904D01*
X129304761Y-84267142D01*
X129352380Y-84410000D01*
X129352380Y-84648095D01*
X128352380Y-83743333D02*
X128352380Y-83124285D01*
X128733333Y-83457619D01*
X128733333Y-83314761D01*
X128780952Y-83219523D01*
X128828571Y-83171904D01*
X128923809Y-83124285D01*
X129161904Y-83124285D01*
X129257142Y-83171904D01*
X129304761Y-83219523D01*
X129352380Y-83314761D01*
X129352380Y-83600476D01*
X129304761Y-83695714D01*
X129257142Y-83743333D01*
%TO.C,D4*%
X144361904Y-102192380D02*
X144361904Y-101192380D01*
X144600000Y-101192380D01*
X144742857Y-101240000D01*
X144838095Y-101335238D01*
X144885714Y-101430476D01*
X144933333Y-101620952D01*
X144933333Y-101763809D01*
X144885714Y-101954285D01*
X144838095Y-102049523D01*
X144742857Y-102144761D01*
X144600000Y-102192380D01*
X144361904Y-102192380D01*
X145790476Y-101525714D02*
X145790476Y-102192380D01*
X145552380Y-101144761D02*
X145314285Y-101859047D01*
X145933333Y-101859047D01*
%TO.C,J5*%
X146986666Y-85062380D02*
X146986666Y-85776666D01*
X146939047Y-85919523D01*
X146843809Y-86014761D01*
X146700952Y-86062380D01*
X146605714Y-86062380D01*
X147939047Y-85062380D02*
X147462857Y-85062380D01*
X147415238Y-85538571D01*
X147462857Y-85490952D01*
X147558095Y-85443333D01*
X147796190Y-85443333D01*
X147891428Y-85490952D01*
X147939047Y-85538571D01*
X147986666Y-85633809D01*
X147986666Y-85871904D01*
X147939047Y-85967142D01*
X147891428Y-86014761D01*
X147796190Y-86062380D01*
X147558095Y-86062380D01*
X147462857Y-86014761D01*
X147415238Y-85967142D01*
%TO.C,J6*%
X147166666Y-99762380D02*
X147166666Y-100476666D01*
X147119047Y-100619523D01*
X147023809Y-100714761D01*
X146880952Y-100762380D01*
X146785714Y-100762380D01*
X148071428Y-99762380D02*
X147880952Y-99762380D01*
X147785714Y-99810000D01*
X147738095Y-99857619D01*
X147642857Y-100000476D01*
X147595238Y-100190952D01*
X147595238Y-100571904D01*
X147642857Y-100667142D01*
X147690476Y-100714761D01*
X147785714Y-100762380D01*
X147976190Y-100762380D01*
X148071428Y-100714761D01*
X148119047Y-100667142D01*
X148166666Y-100571904D01*
X148166666Y-100333809D01*
X148119047Y-100238571D01*
X148071428Y-100190952D01*
X147976190Y-100143333D01*
X147785714Y-100143333D01*
X147690476Y-100190952D01*
X147642857Y-100238571D01*
X147595238Y-100333809D01*
%TO.C,J7*%
X146986666Y-92332380D02*
X146986666Y-93046666D01*
X146939047Y-93189523D01*
X146843809Y-93284761D01*
X146700952Y-93332380D01*
X146605714Y-93332380D01*
X147367619Y-92332380D02*
X148034285Y-92332380D01*
X147605714Y-93332380D01*
%TO.C,J8*%
X121466666Y-97422380D02*
X121466666Y-98136666D01*
X121419047Y-98279523D01*
X121323809Y-98374761D01*
X121180952Y-98422380D01*
X121085714Y-98422380D01*
X122085714Y-97850952D02*
X121990476Y-97803333D01*
X121942857Y-97755714D01*
X121895238Y-97660476D01*
X121895238Y-97612857D01*
X121942857Y-97517619D01*
X121990476Y-97470000D01*
X122085714Y-97422380D01*
X122276190Y-97422380D01*
X122371428Y-97470000D01*
X122419047Y-97517619D01*
X122466666Y-97612857D01*
X122466666Y-97660476D01*
X122419047Y-97755714D01*
X122371428Y-97803333D01*
X122276190Y-97850952D01*
X122085714Y-97850952D01*
X121990476Y-97898571D01*
X121942857Y-97946190D01*
X121895238Y-98041428D01*
X121895238Y-98231904D01*
X121942857Y-98327142D01*
X121990476Y-98374761D01*
X122085714Y-98422380D01*
X122276190Y-98422380D01*
X122371428Y-98374761D01*
X122419047Y-98327142D01*
X122466666Y-98231904D01*
X122466666Y-98041428D01*
X122419047Y-97946190D01*
X122371428Y-97898571D01*
X122276190Y-97850952D01*
%TO.C,J9*%
X124216666Y-97422380D02*
X124216666Y-98136666D01*
X124169047Y-98279523D01*
X124073809Y-98374761D01*
X123930952Y-98422380D01*
X123835714Y-98422380D01*
X124740476Y-98422380D02*
X124930952Y-98422380D01*
X125026190Y-98374761D01*
X125073809Y-98327142D01*
X125169047Y-98184285D01*
X125216666Y-97993809D01*
X125216666Y-97612857D01*
X125169047Y-97517619D01*
X125121428Y-97470000D01*
X125026190Y-97422380D01*
X124835714Y-97422380D01*
X124740476Y-97470000D01*
X124692857Y-97517619D01*
X124645238Y-97612857D01*
X124645238Y-97850952D01*
X124692857Y-97946190D01*
X124740476Y-97993809D01*
X124835714Y-98041428D01*
X125026190Y-98041428D01*
X125121428Y-97993809D01*
X125169047Y-97946190D01*
X125216666Y-97850952D01*
%TO.C,J10*%
X126280476Y-97422380D02*
X126280476Y-98136666D01*
X126232857Y-98279523D01*
X126137619Y-98374761D01*
X125994761Y-98422380D01*
X125899523Y-98422380D01*
X127280476Y-98422380D02*
X126709047Y-98422380D01*
X126994761Y-98422380D02*
X126994761Y-97422380D01*
X126899523Y-97565238D01*
X126804285Y-97660476D01*
X126709047Y-97708095D01*
X127899523Y-97422380D02*
X127994761Y-97422380D01*
X128090000Y-97470000D01*
X128137619Y-97517619D01*
X128185238Y-97612857D01*
X128232857Y-97803333D01*
X128232857Y-98041428D01*
X128185238Y-98231904D01*
X128137619Y-98327142D01*
X128090000Y-98374761D01*
X127994761Y-98422380D01*
X127899523Y-98422380D01*
X127804285Y-98374761D01*
X127756666Y-98327142D01*
X127709047Y-98231904D01*
X127661428Y-98041428D01*
X127661428Y-97803333D01*
X127709047Y-97612857D01*
X127756666Y-97517619D01*
X127804285Y-97470000D01*
X127899523Y-97422380D01*
%TO.C,J12*%
X129052380Y-106509523D02*
X129766666Y-106509523D01*
X129909523Y-106557142D01*
X130004761Y-106652380D01*
X130052380Y-106795238D01*
X130052380Y-106890476D01*
X130052380Y-105509523D02*
X130052380Y-106080952D01*
X130052380Y-105795238D02*
X129052380Y-105795238D01*
X129195238Y-105890476D01*
X129290476Y-105985714D01*
X129338095Y-106080952D01*
X129147619Y-105128571D02*
X129100000Y-105080952D01*
X129052380Y-104985714D01*
X129052380Y-104747619D01*
X129100000Y-104652380D01*
X129147619Y-104604761D01*
X129242857Y-104557142D01*
X129338095Y-104557142D01*
X129480952Y-104604761D01*
X130052380Y-105176190D01*
X130052380Y-104557142D01*
%TO.C,R7*%
X134133333Y-87362380D02*
X133800000Y-86886190D01*
X133561904Y-87362380D02*
X133561904Y-86362380D01*
X133942857Y-86362380D01*
X134038095Y-86410000D01*
X134085714Y-86457619D01*
X134133333Y-86552857D01*
X134133333Y-86695714D01*
X134085714Y-86790952D01*
X134038095Y-86838571D01*
X133942857Y-86886190D01*
X133561904Y-86886190D01*
X134466666Y-86362380D02*
X135133333Y-86362380D01*
X134704761Y-87362380D01*
%TO.C,R8*%
X138833333Y-86662380D02*
X138500000Y-86186190D01*
X138261904Y-86662380D02*
X138261904Y-85662380D01*
X138642857Y-85662380D01*
X138738095Y-85710000D01*
X138785714Y-85757619D01*
X138833333Y-85852857D01*
X138833333Y-85995714D01*
X138785714Y-86090952D01*
X138738095Y-86138571D01*
X138642857Y-86186190D01*
X138261904Y-86186190D01*
X139404761Y-86090952D02*
X139309523Y-86043333D01*
X139261904Y-85995714D01*
X139214285Y-85900476D01*
X139214285Y-85852857D01*
X139261904Y-85757619D01*
X139309523Y-85710000D01*
X139404761Y-85662380D01*
X139595238Y-85662380D01*
X139690476Y-85710000D01*
X139738095Y-85757619D01*
X139785714Y-85852857D01*
X139785714Y-85900476D01*
X139738095Y-85995714D01*
X139690476Y-86043333D01*
X139595238Y-86090952D01*
X139404761Y-86090952D01*
X139309523Y-86138571D01*
X139261904Y-86186190D01*
X139214285Y-86281428D01*
X139214285Y-86471904D01*
X139261904Y-86567142D01*
X139309523Y-86614761D01*
X139404761Y-86662380D01*
X139595238Y-86662380D01*
X139690476Y-86614761D01*
X139738095Y-86567142D01*
X139785714Y-86471904D01*
X139785714Y-86281428D01*
X139738095Y-86186190D01*
X139690476Y-86138571D01*
X139595238Y-86090952D01*
%TO.C,R9*%
X129633333Y-92362380D02*
X129300000Y-91886190D01*
X129061904Y-92362380D02*
X129061904Y-91362380D01*
X129442857Y-91362380D01*
X129538095Y-91410000D01*
X129585714Y-91457619D01*
X129633333Y-91552857D01*
X129633333Y-91695714D01*
X129585714Y-91790952D01*
X129538095Y-91838571D01*
X129442857Y-91886190D01*
X129061904Y-91886190D01*
X130109523Y-92362380D02*
X130300000Y-92362380D01*
X130395238Y-92314761D01*
X130442857Y-92267142D01*
X130538095Y-92124285D01*
X130585714Y-91933809D01*
X130585714Y-91552857D01*
X130538095Y-91457619D01*
X130490476Y-91410000D01*
X130395238Y-91362380D01*
X130204761Y-91362380D01*
X130109523Y-91410000D01*
X130061904Y-91457619D01*
X130014285Y-91552857D01*
X130014285Y-91790952D01*
X130061904Y-91886190D01*
X130109523Y-91933809D01*
X130204761Y-91981428D01*
X130395238Y-91981428D01*
X130490476Y-91933809D01*
X130538095Y-91886190D01*
X130585714Y-91790952D01*
%TO.C,SW1*%
X120366666Y-97114761D02*
X120509523Y-97162380D01*
X120747619Y-97162380D01*
X120842857Y-97114761D01*
X120890476Y-97067142D01*
X120938095Y-96971904D01*
X120938095Y-96876666D01*
X120890476Y-96781428D01*
X120842857Y-96733809D01*
X120747619Y-96686190D01*
X120557142Y-96638571D01*
X120461904Y-96590952D01*
X120414285Y-96543333D01*
X120366666Y-96448095D01*
X120366666Y-96352857D01*
X120414285Y-96257619D01*
X120461904Y-96210000D01*
X120557142Y-96162380D01*
X120795238Y-96162380D01*
X120938095Y-96210000D01*
X121271428Y-96162380D02*
X121509523Y-97162380D01*
X121700000Y-96448095D01*
X121890476Y-97162380D01*
X122128571Y-96162380D01*
X123033333Y-97162380D02*
X122461904Y-97162380D01*
X122747619Y-97162380D02*
X122747619Y-96162380D01*
X122652380Y-96305238D01*
X122557142Y-96400476D01*
X122461904Y-96448095D01*
%TO.C,U1*%
X140438095Y-91462380D02*
X140438095Y-92271904D01*
X140485714Y-92367142D01*
X140533333Y-92414761D01*
X140628571Y-92462380D01*
X140819047Y-92462380D01*
X140914285Y-92414761D01*
X140961904Y-92367142D01*
X141009523Y-92271904D01*
X141009523Y-91462380D01*
X142009523Y-92462380D02*
X141438095Y-92462380D01*
X141723809Y-92462380D02*
X141723809Y-91462380D01*
X141628571Y-91605238D01*
X141533333Y-91700476D01*
X141438095Y-91748095D01*
%TO.C,U2*%
X141438095Y-105962380D02*
X141438095Y-106771904D01*
X141485714Y-106867142D01*
X141533333Y-106914761D01*
X141628571Y-106962380D01*
X141819047Y-106962380D01*
X141914285Y-106914761D01*
X141961904Y-106867142D01*
X142009523Y-106771904D01*
X142009523Y-105962380D01*
X142438095Y-106057619D02*
X142485714Y-106010000D01*
X142580952Y-105962380D01*
X142819047Y-105962380D01*
X142914285Y-106010000D01*
X142961904Y-106057619D01*
X143009523Y-106152857D01*
X143009523Y-106248095D01*
X142961904Y-106390952D01*
X142390476Y-106962380D01*
X143009523Y-106962380D01*
%TO.C,L1*%
X144733333Y-92962380D02*
X144257142Y-92962380D01*
X144257142Y-91962380D01*
X145590476Y-92962380D02*
X145019047Y-92962380D01*
X145304761Y-92962380D02*
X145304761Y-91962380D01*
X145209523Y-92105238D01*
X145114285Y-92200476D01*
X145019047Y-92248095D01*
%TO.C,J4*%
X151566666Y-82862380D02*
X151566666Y-83576666D01*
X151519047Y-83719523D01*
X151423809Y-83814761D01*
X151280952Y-83862380D01*
X151185714Y-83862380D01*
X152471428Y-83195714D02*
X152471428Y-83862380D01*
X152233333Y-82814761D02*
X151995238Y-83529047D01*
X152614285Y-83529047D01*
%TO.C,J13*%
X134990476Y-98362380D02*
X134990476Y-99076666D01*
X134942857Y-99219523D01*
X134847619Y-99314761D01*
X134704761Y-99362380D01*
X134609523Y-99362380D01*
X135990476Y-99362380D02*
X135419047Y-99362380D01*
X135704761Y-99362380D02*
X135704761Y-98362380D01*
X135609523Y-98505238D01*
X135514285Y-98600476D01*
X135419047Y-98648095D01*
X136323809Y-98362380D02*
X136942857Y-98362380D01*
X136609523Y-98743333D01*
X136752380Y-98743333D01*
X136847619Y-98790952D01*
X136895238Y-98838571D01*
X136942857Y-98933809D01*
X136942857Y-99171904D01*
X136895238Y-99267142D01*
X136847619Y-99314761D01*
X136752380Y-99362380D01*
X136466666Y-99362380D01*
X136371428Y-99314761D01*
X136323809Y-99267142D01*
%TO.C,J3*%
X126366666Y-83262380D02*
X126366666Y-83976666D01*
X126319047Y-84119523D01*
X126223809Y-84214761D01*
X126080952Y-84262380D01*
X125985714Y-84262380D01*
X126747619Y-83262380D02*
X127366666Y-83262380D01*
X127033333Y-83643333D01*
X127176190Y-83643333D01*
X127271428Y-83690952D01*
X127319047Y-83738571D01*
X127366666Y-83833809D01*
X127366666Y-84071904D01*
X127319047Y-84167142D01*
X127271428Y-84214761D01*
X127176190Y-84262380D01*
X126890476Y-84262380D01*
X126795238Y-84214761D01*
X126747619Y-84167142D01*
%TO.C,J11*%
X132252380Y-99309523D02*
X132966666Y-99309523D01*
X133109523Y-99357142D01*
X133204761Y-99452380D01*
X133252380Y-99595238D01*
X133252380Y-99690476D01*
X133252380Y-98309523D02*
X133252380Y-98880952D01*
X133252380Y-98595238D02*
X132252380Y-98595238D01*
X132395238Y-98690476D01*
X132490476Y-98785714D01*
X132538095Y-98880952D01*
X133252380Y-97357142D02*
X133252380Y-97928571D01*
X133252380Y-97642857D02*
X132252380Y-97642857D01*
X132395238Y-97738095D01*
X132490476Y-97833333D01*
X132538095Y-97928571D01*
%TD*%
M02*
