M48
; DRILL file {KiCad (5.1.9)-1} date 03/28/21 18:29:20
; FORMAT={-:-/ absolute / inch / decimal}
; #@! TF.CreationDate,2021-03-28T18:29:20+04:00
; #@! TF.GenerationSoftware,Kicad,Pcbnew,(5.1.9)-1
; #@! TF.FileFunction,Plated,1,2,PTH
FMAT,2
INCH
T1C0.0118
T2C0.0315
T3C0.0394
%
G90
G05
T1
X3.5535Y-1.75
X3.5535Y-1.8484
X3.5535Y-1.9508
X3.5535Y-2.0492
X3.5535Y-2.1516
X3.5535Y-2.25
X3.5535Y-2.3484
X3.5535Y-2.4508
X3.5535Y-2.5492
X3.5535Y-2.6516
X3.5535Y-2.75
X3.5535Y-2.8524
X3.8724Y-1.7264
X3.8724Y-1.7736
X3.8724Y-1.8248
X3.9472Y-2.1516
X3.9472Y-2.25
X3.9472Y-2.3484
X3.9472Y-2.4508
X3.9472Y-2.5492
X3.9472Y-2.6516
X3.9472Y-2.8524
X4.1362Y-1.75
X4.1835Y-1.6398
X4.1835Y-1.8406
X4.1835Y-2.1516
X4.1835Y-2.3484
X4.3016Y-2.8012
X4.3016Y-2.8996
X4.3094Y-1.6988
X4.3094Y-2.2146
X4.4157Y-1.8799
X4.4157Y-1.9797
X4.4157Y-2.0297
X4.4157Y-2.1297
X4.4157Y-2.6417
X4.4197Y-2.3917
X4.4197Y-2.4429
X4.4197Y-2.4902
X4.4197Y-2.5413
X4.4709Y-1.8799
X4.4748Y-2.6437
X4.4984Y-1.6004
X4.4984Y-1.6988
X4.4984Y-2.8012
X4.4984Y-2.8996
X4.5417Y-2.1791
X4.7898Y-1.8524
X4.7898Y-1.9508
X4.7898Y-2.0492
X4.7898Y-2.1516
X4.7898Y-2.25
X4.7898Y-2.3484
X4.8921Y-2.8996
X4.9236Y-1.6004
X5.2425Y-1.75
X5.2425Y-1.8524
X5.2425Y-1.9508
X5.2425Y-2.0492
X5.2425Y-2.1516
X5.2425Y-2.25
X5.2425Y-2.3484
X5.2425Y-2.4508
X5.2425Y-2.5492
X5.2425Y-2.6516
X5.2425Y-2.75
X5.2425Y-2.8524
T2
X4.1Y-1.6
X4.1Y-1.7
X4.1Y-1.8
X4.1Y-1.9
X4.1Y-2.0
X4.1Y-2.1
X4.1Y-2.2
X4.1Y-2.3
X4.1Y-2.4
X4.1Y-2.5
X4.1Y-2.6
X4.1Y-2.7
X4.1Y-2.8
X4.1Y-2.9
X4.7Y-1.6
X4.7Y-1.7
X4.7Y-1.8
X4.7Y-1.9
X4.7Y-2.0
X4.7Y-2.1
X4.7Y-2.2
X4.7Y-2.3
X4.7Y-2.4
X4.7Y-2.5
X4.7Y-2.6
X4.7Y-2.7
X4.7Y-2.8
X4.7Y-2.9
T3
X3.6Y-1.6
X3.6Y-1.7
X3.6Y-1.8
X3.6Y-1.9
X3.6Y-2.0
X3.6Y-2.1
X3.6Y-2.2
X3.6Y-2.3
X3.6Y-2.4
X3.6Y-2.5
X3.6Y-2.6
X3.6Y-2.7
X3.6Y-2.8
X3.6Y-2.9
X3.7Y-1.6
X3.7Y-1.7
X3.7Y-1.8
X3.7Y-1.9
X3.7Y-2.0
X3.7Y-2.1
X3.7Y-2.2
X3.7Y-2.3
X3.7Y-2.4
X3.7Y-2.5
X3.7Y-2.6
X3.7Y-2.7
X3.7Y-2.8
X3.7Y-2.9
X3.8Y-1.6
X3.8Y-1.7
X3.8Y-1.8
X3.8Y-1.9
X3.8Y-2.0
X3.8Y-2.1
X3.8Y-2.2
X3.8Y-2.3
X3.8Y-2.4
X3.8Y-2.5
X3.8Y-2.6
X3.8Y-2.7
X3.8Y-2.8
X3.8Y-2.9
X5.0Y-1.6
X5.0Y-1.7
X5.0Y-1.8
X5.0Y-1.9
X5.0Y-2.0
X5.0Y-2.1
X5.0Y-2.2
X5.0Y-2.3
X5.0Y-2.4
X5.0Y-2.5
X5.0Y-2.6
X5.0Y-2.7
X5.0Y-2.8
X5.0Y-2.9
X5.1Y-1.6
X5.1Y-1.7
X5.1Y-1.8
X5.1Y-1.9
X5.1Y-2.0
X5.1Y-2.1
X5.1Y-2.2
X5.1Y-2.3
X5.1Y-2.4
X5.1Y-2.5
X5.1Y-2.6
X5.1Y-2.7
X5.1Y-2.8
X5.1Y-2.9
X5.2Y-1.6
X5.2Y-1.7
X5.2Y-1.8
X5.2Y-1.9
X5.2Y-2.0
X5.2Y-2.1
X5.2Y-2.2
X5.2Y-2.3
X5.2Y-2.4
X5.2Y-2.5
X5.2Y-2.6
X5.2Y-2.7
X5.2Y-2.8
X5.2Y-2.9
T0
M30
