%TF.GenerationSoftware,KiCad,Pcbnew,(5.1.9)-1*%
%TF.CreationDate,2021-03-28T18:29:17+04:00*%
%TF.ProjectId,zx-mini-pcb-debug-module-ay-3-8912-v1,7a782d6d-696e-4692-9d70-63622d646562,rev?*%
%TF.SameCoordinates,Original*%
%TF.FileFunction,Legend,Bot*%
%TF.FilePolarity,Positive*%
%FSLAX46Y46*%
G04 Gerber Fmt 4.6, Leading zero omitted, Abs format (unit mm)*
G04 Created by KiCad (PCBNEW (5.1.9)-1) date 2021-03-28 18:29:17*
%MOMM*%
%LPD*%
G01*
G04 APERTURE LIST*
%ADD10C,0.120000*%
%ADD11C,0.150000*%
G04 APERTURE END LIST*
D10*
X102760000Y-47150000D02*
X102360000Y-46750000D01*
X102760000Y-48950000D02*
X102760000Y-47150000D01*
X102360000Y-49350000D02*
X102760000Y-48950000D01*
X101760000Y-49350000D02*
X102360000Y-49350000D01*
D11*
X118107619Y-75578571D02*
X118107619Y-74911904D01*
X117107619Y-75578571D01*
X117107619Y-74911904D01*
X118107619Y-74626190D02*
X117107619Y-73959523D01*
X118107619Y-73959523D02*
X117107619Y-74626190D01*
X117488571Y-73578571D02*
X117488571Y-72816666D01*
X117107619Y-72340476D02*
X118107619Y-72340476D01*
X117393333Y-72007142D01*
X118107619Y-71673809D01*
X117107619Y-71673809D01*
X117107619Y-71197619D02*
X118107619Y-71197619D01*
X117107619Y-70721428D02*
X118107619Y-70721428D01*
X117107619Y-70149999D01*
X118107619Y-70149999D01*
X117107619Y-69673809D02*
X118107619Y-69673809D01*
X117488571Y-69197619D02*
X117488571Y-68435714D01*
X117107619Y-67959523D02*
X118107619Y-67959523D01*
X118107619Y-67578571D01*
X118060000Y-67483333D01*
X118012380Y-67435714D01*
X117917142Y-67388095D01*
X117774285Y-67388095D01*
X117679047Y-67435714D01*
X117631428Y-67483333D01*
X117583809Y-67578571D01*
X117583809Y-67959523D01*
X117202857Y-66388095D02*
X117155238Y-66435714D01*
X117107619Y-66578571D01*
X117107619Y-66673809D01*
X117155238Y-66816666D01*
X117250476Y-66911904D01*
X117345714Y-66959523D01*
X117536190Y-67007142D01*
X117679047Y-67007142D01*
X117869523Y-66959523D01*
X117964761Y-66911904D01*
X118060000Y-66816666D01*
X118107619Y-66673809D01*
X118107619Y-66578571D01*
X118060000Y-66435714D01*
X118012380Y-66388095D01*
X117631428Y-65626190D02*
X117583809Y-65483333D01*
X117536190Y-65435714D01*
X117440952Y-65388095D01*
X117298095Y-65388095D01*
X117202857Y-65435714D01*
X117155238Y-65483333D01*
X117107619Y-65578571D01*
X117107619Y-65959523D01*
X118107619Y-65959523D01*
X118107619Y-65626190D01*
X118060000Y-65530952D01*
X118012380Y-65483333D01*
X117917142Y-65435714D01*
X117821904Y-65435714D01*
X117726666Y-65483333D01*
X117679047Y-65530952D01*
X117631428Y-65626190D01*
X117631428Y-65959523D01*
X117488571Y-64959523D02*
X117488571Y-64197619D01*
X117107619Y-63721428D02*
X118107619Y-63721428D01*
X118107619Y-63483333D01*
X118060000Y-63340476D01*
X117964761Y-63245238D01*
X117869523Y-63197619D01*
X117679047Y-63149999D01*
X117536190Y-63149999D01*
X117345714Y-63197619D01*
X117250476Y-63245238D01*
X117155238Y-63340476D01*
X117107619Y-63483333D01*
X117107619Y-63721428D01*
X117631428Y-62721428D02*
X117631428Y-62388095D01*
X117107619Y-62245238D02*
X117107619Y-62721428D01*
X118107619Y-62721428D01*
X118107619Y-62245238D01*
X117631428Y-61483333D02*
X117583809Y-61340476D01*
X117536190Y-61292857D01*
X117440952Y-61245238D01*
X117298095Y-61245238D01*
X117202857Y-61292857D01*
X117155238Y-61340476D01*
X117107619Y-61435714D01*
X117107619Y-61816666D01*
X118107619Y-61816666D01*
X118107619Y-61483333D01*
X118060000Y-61388095D01*
X118012380Y-61340476D01*
X117917142Y-61292857D01*
X117821904Y-61292857D01*
X117726666Y-61340476D01*
X117679047Y-61388095D01*
X117631428Y-61483333D01*
X117631428Y-61816666D01*
X118107619Y-60816666D02*
X117298095Y-60816666D01*
X117202857Y-60769047D01*
X117155238Y-60721428D01*
X117107619Y-60626190D01*
X117107619Y-60435714D01*
X117155238Y-60340476D01*
X117202857Y-60292857D01*
X117298095Y-60245238D01*
X118107619Y-60245238D01*
X118060000Y-59245238D02*
X118107619Y-59340476D01*
X118107619Y-59483333D01*
X118060000Y-59626190D01*
X117964761Y-59721428D01*
X117869523Y-59769047D01*
X117679047Y-59816666D01*
X117536190Y-59816666D01*
X117345714Y-59769047D01*
X117250476Y-59721428D01*
X117155238Y-59626190D01*
X117107619Y-59483333D01*
X117107619Y-59388095D01*
X117155238Y-59245238D01*
X117202857Y-59197619D01*
X117536190Y-59197619D01*
X117536190Y-59388095D01*
X117488571Y-58769047D02*
X117488571Y-58007142D01*
X117107619Y-57530952D02*
X118107619Y-57530952D01*
X117393333Y-57197619D01*
X118107619Y-56864285D01*
X117107619Y-56864285D01*
X118107619Y-56197619D02*
X118107619Y-56007142D01*
X118060000Y-55911904D01*
X117964761Y-55816666D01*
X117774285Y-55769047D01*
X117440952Y-55769047D01*
X117250476Y-55816666D01*
X117155238Y-55911904D01*
X117107619Y-56007142D01*
X117107619Y-56197619D01*
X117155238Y-56292857D01*
X117250476Y-56388095D01*
X117440952Y-56435714D01*
X117774285Y-56435714D01*
X117964761Y-56388095D01*
X118060000Y-56292857D01*
X118107619Y-56197619D01*
X117107619Y-55340476D02*
X118107619Y-55340476D01*
X118107619Y-55102380D01*
X118060000Y-54959523D01*
X117964761Y-54864285D01*
X117869523Y-54816666D01*
X117679047Y-54769047D01*
X117536190Y-54769047D01*
X117345714Y-54816666D01*
X117250476Y-54864285D01*
X117155238Y-54959523D01*
X117107619Y-55102380D01*
X117107619Y-55340476D01*
X118107619Y-54340476D02*
X117298095Y-54340476D01*
X117202857Y-54292857D01*
X117155238Y-54245238D01*
X117107619Y-54149999D01*
X117107619Y-53959523D01*
X117155238Y-53864285D01*
X117202857Y-53816666D01*
X117298095Y-53769047D01*
X118107619Y-53769047D01*
X117107619Y-52816666D02*
X117107619Y-53292857D01*
X118107619Y-53292857D01*
X117631428Y-52483333D02*
X117631428Y-52149999D01*
X117107619Y-52007142D02*
X117107619Y-52483333D01*
X118107619Y-52483333D01*
X118107619Y-52007142D01*
X117488571Y-51578571D02*
X117488571Y-50816666D01*
X117393333Y-50388095D02*
X117393333Y-49911904D01*
X117107619Y-50483333D02*
X118107619Y-50149999D01*
X117107619Y-49816666D01*
X117583809Y-49292857D02*
X117107619Y-49292857D01*
X118107619Y-49626190D02*
X117583809Y-49292857D01*
X118107619Y-48959523D01*
X117488571Y-48626190D02*
X117488571Y-47864285D01*
X118107619Y-47483333D02*
X118107619Y-46864285D01*
X117726666Y-47197619D01*
X117726666Y-47054761D01*
X117679047Y-46959523D01*
X117631428Y-46911904D01*
X117536190Y-46864285D01*
X117298095Y-46864285D01*
X117202857Y-46911904D01*
X117155238Y-46959523D01*
X117107619Y-47054761D01*
X117107619Y-47340476D01*
X117155238Y-47435714D01*
X117202857Y-47483333D01*
X117488571Y-46435714D02*
X117488571Y-45673809D01*
X117679047Y-45054761D02*
X117726666Y-45149999D01*
X117774285Y-45197619D01*
X117869523Y-45245238D01*
X117917142Y-45245238D01*
X118012380Y-45197619D01*
X118060000Y-45149999D01*
X118107619Y-45054761D01*
X118107619Y-44864285D01*
X118060000Y-44769047D01*
X118012380Y-44721428D01*
X117917142Y-44673809D01*
X117869523Y-44673809D01*
X117774285Y-44721428D01*
X117726666Y-44769047D01*
X117679047Y-44864285D01*
X117679047Y-45054761D01*
X117631428Y-45149999D01*
X117583809Y-45197619D01*
X117488571Y-45245238D01*
X117298095Y-45245238D01*
X117202857Y-45197619D01*
X117155238Y-45149999D01*
X117107619Y-45054761D01*
X117107619Y-44864285D01*
X117155238Y-44769047D01*
X117202857Y-44721428D01*
X117298095Y-44673809D01*
X117488571Y-44673809D01*
X117583809Y-44721428D01*
X117631428Y-44769047D01*
X117679047Y-44864285D01*
X117107619Y-44197619D02*
X117107619Y-44007142D01*
X117155238Y-43911904D01*
X117202857Y-43864285D01*
X117345714Y-43769047D01*
X117536190Y-43721428D01*
X117917142Y-43721428D01*
X118012380Y-43769047D01*
X118060000Y-43816666D01*
X118107619Y-43911904D01*
X118107619Y-44102380D01*
X118060000Y-44197619D01*
X118012380Y-44245238D01*
X117917142Y-44292857D01*
X117679047Y-44292857D01*
X117583809Y-44245238D01*
X117536190Y-44197619D01*
X117488571Y-44102380D01*
X117488571Y-43911904D01*
X117536190Y-43816666D01*
X117583809Y-43769047D01*
X117679047Y-43721428D01*
X117107619Y-42769047D02*
X117107619Y-43340476D01*
X117107619Y-43054761D02*
X118107619Y-43054761D01*
X117964761Y-43149999D01*
X117869523Y-43245238D01*
X117821904Y-43340476D01*
X118012380Y-42388095D02*
X118060000Y-42340476D01*
X118107619Y-42245238D01*
X118107619Y-42007142D01*
X118060000Y-41911904D01*
X118012380Y-41864285D01*
X117917142Y-41816666D01*
X117821904Y-41816666D01*
X117679047Y-41864285D01*
X117107619Y-42435714D01*
X117107619Y-41816666D01*
X117488571Y-41388095D02*
X117488571Y-40626190D01*
X118107619Y-40292857D02*
X117107619Y-39959523D01*
X118107619Y-39626190D01*
X117107619Y-38769047D02*
X117107619Y-39340476D01*
X117107619Y-39054761D02*
X118107619Y-39054761D01*
X117964761Y-39149999D01*
X117869523Y-39245238D01*
X117821904Y-39340476D01*
D10*
%TO.C,U1*%
X112860000Y-67710000D02*
X110910000Y-67710000D01*
X112860000Y-67710000D02*
X114810000Y-67710000D01*
X112860000Y-57590000D02*
X110910000Y-57590000D01*
X112860000Y-57590000D02*
X116310000Y-57590000D01*
%TO.C,C1*%
X107521252Y-43885000D02*
X106998748Y-43885000D01*
X107521252Y-42415000D02*
X106998748Y-42415000D01*
%TO.C,C2*%
X107521252Y-44415000D02*
X106998748Y-44415000D01*
X107521252Y-45885000D02*
X106998748Y-45885000D01*
%TO.C,C3*%
X107571252Y-56985000D02*
X107048748Y-56985000D01*
X107571252Y-55515000D02*
X107048748Y-55515000D01*
%TO.C,C4*%
X100821252Y-47085000D02*
X100298748Y-47085000D01*
X100821252Y-45615000D02*
X100298748Y-45615000D01*
%TO.C,C5*%
X107571252Y-57515000D02*
X107048748Y-57515000D01*
X107571252Y-58985000D02*
X107048748Y-58985000D01*
%TO.C,C6*%
X100821252Y-43615000D02*
X100298748Y-43615000D01*
X100821252Y-45085000D02*
X100298748Y-45085000D01*
%TO.C,C7*%
X98960000Y-41315000D02*
X102870000Y-41315000D01*
X102870000Y-41315000D02*
X102870000Y-43185000D01*
X102870000Y-43185000D02*
X98960000Y-43185000D01*
%TO.C,J1*%
X91440000Y-39310000D02*
X90110000Y-39310000D01*
X90110000Y-39310000D02*
X90110000Y-40640000D01*
X90110000Y-41910000D02*
X90110000Y-74990000D01*
X92770000Y-74990000D02*
X90110000Y-74990000D01*
X92770000Y-41910000D02*
X92770000Y-74990000D01*
X92770000Y-41910000D02*
X90110000Y-41910000D01*
%TO.C,J2*%
X133410000Y-41910000D02*
X130750000Y-41910000D01*
X133410000Y-41910000D02*
X133410000Y-74990000D01*
X133410000Y-74990000D02*
X130750000Y-74990000D01*
X130750000Y-41910000D02*
X130750000Y-74990000D01*
X130750000Y-39310000D02*
X130750000Y-40640000D01*
X132080000Y-39310000D02*
X130750000Y-39310000D01*
%TO.C,R1*%
X123387064Y-39915000D02*
X122932936Y-39915000D01*
X123387064Y-41385000D02*
X122932936Y-41385000D01*
%TO.C,R2*%
X122345436Y-70415000D02*
X122799564Y-70415000D01*
X122345436Y-71885000D02*
X122799564Y-71885000D01*
%TO.C,R3*%
X122787064Y-67865000D02*
X122332936Y-67865000D01*
X122787064Y-69335000D02*
X122332936Y-69335000D01*
%TO.C,R4*%
X122787064Y-64235000D02*
X122332936Y-64235000D01*
X122787064Y-62765000D02*
X122332936Y-62765000D01*
%TO.C,U2*%
X112860000Y-54710000D02*
X110910000Y-54710000D01*
X112860000Y-54710000D02*
X114810000Y-54710000D01*
X112860000Y-44590000D02*
X110910000Y-44590000D01*
X112860000Y-44590000D02*
X116310000Y-44590000D01*
%TO.C,U1*%
D11*
X113621904Y-56202380D02*
X113621904Y-57011904D01*
X113574285Y-57107142D01*
X113526666Y-57154761D01*
X113431428Y-57202380D01*
X113240952Y-57202380D01*
X113145714Y-57154761D01*
X113098095Y-57107142D01*
X113050476Y-57011904D01*
X113050476Y-56202380D01*
X112050476Y-57202380D02*
X112621904Y-57202380D01*
X112336190Y-57202380D02*
X112336190Y-56202380D01*
X112431428Y-56345238D01*
X112526666Y-56440476D01*
X112621904Y-56488095D01*
%TO.C,C1*%
X107426666Y-41807142D02*
X107474285Y-41854761D01*
X107617142Y-41902380D01*
X107712380Y-41902380D01*
X107855238Y-41854761D01*
X107950476Y-41759523D01*
X107998095Y-41664285D01*
X108045714Y-41473809D01*
X108045714Y-41330952D01*
X107998095Y-41140476D01*
X107950476Y-41045238D01*
X107855238Y-40950000D01*
X107712380Y-40902380D01*
X107617142Y-40902380D01*
X107474285Y-40950000D01*
X107426666Y-40997619D01*
X106474285Y-41902380D02*
X107045714Y-41902380D01*
X106760000Y-41902380D02*
X106760000Y-40902380D01*
X106855238Y-41045238D01*
X106950476Y-41140476D01*
X107045714Y-41188095D01*
%TO.C,C2*%
X107526666Y-47207142D02*
X107574285Y-47254761D01*
X107717142Y-47302380D01*
X107812380Y-47302380D01*
X107955238Y-47254761D01*
X108050476Y-47159523D01*
X108098095Y-47064285D01*
X108145714Y-46873809D01*
X108145714Y-46730952D01*
X108098095Y-46540476D01*
X108050476Y-46445238D01*
X107955238Y-46350000D01*
X107812380Y-46302380D01*
X107717142Y-46302380D01*
X107574285Y-46350000D01*
X107526666Y-46397619D01*
X107145714Y-46397619D02*
X107098095Y-46350000D01*
X107002857Y-46302380D01*
X106764761Y-46302380D01*
X106669523Y-46350000D01*
X106621904Y-46397619D01*
X106574285Y-46492857D01*
X106574285Y-46588095D01*
X106621904Y-46730952D01*
X107193333Y-47302380D01*
X106574285Y-47302380D01*
%TO.C,C3*%
X107426666Y-55007142D02*
X107474285Y-55054761D01*
X107617142Y-55102380D01*
X107712380Y-55102380D01*
X107855238Y-55054761D01*
X107950476Y-54959523D01*
X107998095Y-54864285D01*
X108045714Y-54673809D01*
X108045714Y-54530952D01*
X107998095Y-54340476D01*
X107950476Y-54245238D01*
X107855238Y-54150000D01*
X107712380Y-54102380D01*
X107617142Y-54102380D01*
X107474285Y-54150000D01*
X107426666Y-54197619D01*
X107093333Y-54102380D02*
X106474285Y-54102380D01*
X106807619Y-54483333D01*
X106664761Y-54483333D01*
X106569523Y-54530952D01*
X106521904Y-54578571D01*
X106474285Y-54673809D01*
X106474285Y-54911904D01*
X106521904Y-55007142D01*
X106569523Y-55054761D01*
X106664761Y-55102380D01*
X106950476Y-55102380D01*
X107045714Y-55054761D01*
X107093333Y-55007142D01*
%TO.C,C4*%
X100826666Y-49807142D02*
X100874285Y-49854761D01*
X101017142Y-49902380D01*
X101112380Y-49902380D01*
X101255238Y-49854761D01*
X101350476Y-49759523D01*
X101398095Y-49664285D01*
X101445714Y-49473809D01*
X101445714Y-49330952D01*
X101398095Y-49140476D01*
X101350476Y-49045238D01*
X101255238Y-48950000D01*
X101112380Y-48902380D01*
X101017142Y-48902380D01*
X100874285Y-48950000D01*
X100826666Y-48997619D01*
X99969523Y-49235714D02*
X99969523Y-49902380D01*
X100207619Y-48854761D02*
X100445714Y-49569047D01*
X99826666Y-49569047D01*
%TO.C,C5*%
X107426666Y-60207142D02*
X107474285Y-60254761D01*
X107617142Y-60302380D01*
X107712380Y-60302380D01*
X107855238Y-60254761D01*
X107950476Y-60159523D01*
X107998095Y-60064285D01*
X108045714Y-59873809D01*
X108045714Y-59730952D01*
X107998095Y-59540476D01*
X107950476Y-59445238D01*
X107855238Y-59350000D01*
X107712380Y-59302380D01*
X107617142Y-59302380D01*
X107474285Y-59350000D01*
X107426666Y-59397619D01*
X106521904Y-59302380D02*
X106998095Y-59302380D01*
X107045714Y-59778571D01*
X106998095Y-59730952D01*
X106902857Y-59683333D01*
X106664761Y-59683333D01*
X106569523Y-59730952D01*
X106521904Y-59778571D01*
X106474285Y-59873809D01*
X106474285Y-60111904D01*
X106521904Y-60207142D01*
X106569523Y-60254761D01*
X106664761Y-60302380D01*
X106902857Y-60302380D01*
X106998095Y-60254761D01*
X107045714Y-60207142D01*
%TO.C,C6*%
X100826666Y-48407142D02*
X100874285Y-48454761D01*
X101017142Y-48502380D01*
X101112380Y-48502380D01*
X101255238Y-48454761D01*
X101350476Y-48359523D01*
X101398095Y-48264285D01*
X101445714Y-48073809D01*
X101445714Y-47930952D01*
X101398095Y-47740476D01*
X101350476Y-47645238D01*
X101255238Y-47550000D01*
X101112380Y-47502380D01*
X101017142Y-47502380D01*
X100874285Y-47550000D01*
X100826666Y-47597619D01*
X99969523Y-47502380D02*
X100160000Y-47502380D01*
X100255238Y-47550000D01*
X100302857Y-47597619D01*
X100398095Y-47740476D01*
X100445714Y-47930952D01*
X100445714Y-48311904D01*
X100398095Y-48407142D01*
X100350476Y-48454761D01*
X100255238Y-48502380D01*
X100064761Y-48502380D01*
X99969523Y-48454761D01*
X99921904Y-48407142D01*
X99874285Y-48311904D01*
X99874285Y-48073809D01*
X99921904Y-47978571D01*
X99969523Y-47930952D01*
X100064761Y-47883333D01*
X100255238Y-47883333D01*
X100350476Y-47930952D01*
X100398095Y-47978571D01*
X100445714Y-48073809D01*
%TO.C,C7*%
X100626666Y-40807142D02*
X100674285Y-40854761D01*
X100817142Y-40902380D01*
X100912380Y-40902380D01*
X101055238Y-40854761D01*
X101150476Y-40759523D01*
X101198095Y-40664285D01*
X101245714Y-40473809D01*
X101245714Y-40330952D01*
X101198095Y-40140476D01*
X101150476Y-40045238D01*
X101055238Y-39950000D01*
X100912380Y-39902380D01*
X100817142Y-39902380D01*
X100674285Y-39950000D01*
X100626666Y-39997619D01*
X100293333Y-39902380D02*
X99626666Y-39902380D01*
X100055238Y-40902380D01*
%TO.C,J1*%
X98793333Y-38502380D02*
X98793333Y-39216666D01*
X98840952Y-39359523D01*
X98936190Y-39454761D01*
X99079047Y-39502380D01*
X99174285Y-39502380D01*
X97793333Y-39502380D02*
X98364761Y-39502380D01*
X98079047Y-39502380D02*
X98079047Y-38502380D01*
X98174285Y-38645238D01*
X98269523Y-38740476D01*
X98364761Y-38788095D01*
%TO.C,J2*%
X125393333Y-38502380D02*
X125393333Y-39216666D01*
X125440952Y-39359523D01*
X125536190Y-39454761D01*
X125679047Y-39502380D01*
X125774285Y-39502380D01*
X124964761Y-38597619D02*
X124917142Y-38550000D01*
X124821904Y-38502380D01*
X124583809Y-38502380D01*
X124488571Y-38550000D01*
X124440952Y-38597619D01*
X124393333Y-38692857D01*
X124393333Y-38788095D01*
X124440952Y-38930952D01*
X125012380Y-39502380D01*
X124393333Y-39502380D01*
%TO.C,R1*%
X123226666Y-42802380D02*
X123560000Y-42326190D01*
X123798095Y-42802380D02*
X123798095Y-41802380D01*
X123417142Y-41802380D01*
X123321904Y-41850000D01*
X123274285Y-41897619D01*
X123226666Y-41992857D01*
X123226666Y-42135714D01*
X123274285Y-42230952D01*
X123321904Y-42278571D01*
X123417142Y-42326190D01*
X123798095Y-42326190D01*
X122274285Y-42802380D02*
X122845714Y-42802380D01*
X122560000Y-42802380D02*
X122560000Y-41802380D01*
X122655238Y-41945238D01*
X122750476Y-42040476D01*
X122845714Y-42088095D01*
%TO.C,R2*%
X122739166Y-73102380D02*
X123072500Y-72626190D01*
X123310595Y-73102380D02*
X123310595Y-72102380D01*
X122929642Y-72102380D01*
X122834404Y-72150000D01*
X122786785Y-72197619D01*
X122739166Y-72292857D01*
X122739166Y-72435714D01*
X122786785Y-72530952D01*
X122834404Y-72578571D01*
X122929642Y-72626190D01*
X123310595Y-72626190D01*
X122358214Y-72197619D02*
X122310595Y-72150000D01*
X122215357Y-72102380D01*
X121977261Y-72102380D01*
X121882023Y-72150000D01*
X121834404Y-72197619D01*
X121786785Y-72292857D01*
X121786785Y-72388095D01*
X121834404Y-72530952D01*
X122405833Y-73102380D01*
X121786785Y-73102380D01*
%TO.C,R3*%
X122826666Y-67502380D02*
X123160000Y-67026190D01*
X123398095Y-67502380D02*
X123398095Y-66502380D01*
X123017142Y-66502380D01*
X122921904Y-66550000D01*
X122874285Y-66597619D01*
X122826666Y-66692857D01*
X122826666Y-66835714D01*
X122874285Y-66930952D01*
X122921904Y-66978571D01*
X123017142Y-67026190D01*
X123398095Y-67026190D01*
X122493333Y-66502380D02*
X121874285Y-66502380D01*
X122207619Y-66883333D01*
X122064761Y-66883333D01*
X121969523Y-66930952D01*
X121921904Y-66978571D01*
X121874285Y-67073809D01*
X121874285Y-67311904D01*
X121921904Y-67407142D01*
X121969523Y-67454761D01*
X122064761Y-67502380D01*
X122350476Y-67502380D01*
X122445714Y-67454761D01*
X122493333Y-67407142D01*
%TO.C,R4*%
X122726666Y-62402380D02*
X123060000Y-61926190D01*
X123298095Y-62402380D02*
X123298095Y-61402380D01*
X122917142Y-61402380D01*
X122821904Y-61450000D01*
X122774285Y-61497619D01*
X122726666Y-61592857D01*
X122726666Y-61735714D01*
X122774285Y-61830952D01*
X122821904Y-61878571D01*
X122917142Y-61926190D01*
X123298095Y-61926190D01*
X121869523Y-61735714D02*
X121869523Y-62402380D01*
X122107619Y-61354761D02*
X122345714Y-62069047D01*
X121726666Y-62069047D01*
%TO.C,U2*%
X113621904Y-43202380D02*
X113621904Y-44011904D01*
X113574285Y-44107142D01*
X113526666Y-44154761D01*
X113431428Y-44202380D01*
X113240952Y-44202380D01*
X113145714Y-44154761D01*
X113098095Y-44107142D01*
X113050476Y-44011904D01*
X113050476Y-43202380D01*
X112621904Y-43297619D02*
X112574285Y-43250000D01*
X112479047Y-43202380D01*
X112240952Y-43202380D01*
X112145714Y-43250000D01*
X112098095Y-43297619D01*
X112050476Y-43392857D01*
X112050476Y-43488095D01*
X112098095Y-43630952D01*
X112669523Y-44202380D01*
X112050476Y-44202380D01*
%TD*%
M02*
