%TF.GenerationSoftware,KiCad,Pcbnew,(5.1.9)-1*%
%TF.CreationDate,2021-03-28T18:29:17+04:00*%
%TF.ProjectId,zx-mini-pcb-debug-module-ay-3-8912-v1,7a782d6d-696e-4692-9d70-63622d646562,rev?*%
%TF.SameCoordinates,Original*%
%TF.FileFunction,Soldermask,Top*%
%TF.FilePolarity,Negative*%
%FSLAX46Y46*%
G04 Gerber Fmt 4.6, Leading zero omitted, Abs format (unit mm)*
G04 Created by KiCad (PCBNEW (5.1.9)-1) date 2021-03-28 18:29:17*
%MOMM*%
%LPD*%
G01*
G04 APERTURE LIST*
%ADD10R,1.600000X1.600000*%
%ADD11O,1.600000X1.600000*%
%ADD12O,1.700000X1.700000*%
%ADD13R,1.700000X1.700000*%
G04 APERTURE END LIST*
%TO.C,D1*%
G36*
G01*
X121835000Y-40906250D02*
X121835000Y-40393750D01*
G75*
G02*
X122053750Y-40175000I218750J0D01*
G01*
X122491250Y-40175000D01*
G75*
G02*
X122710000Y-40393750I0J-218750D01*
G01*
X122710000Y-40906250D01*
G75*
G02*
X122491250Y-41125000I-218750J0D01*
G01*
X122053750Y-41125000D01*
G75*
G02*
X121835000Y-40906250I0J218750D01*
G01*
G37*
G36*
G01*
X123410000Y-40906250D02*
X123410000Y-40393750D01*
G75*
G02*
X123628750Y-40175000I218750J0D01*
G01*
X124066250Y-40175000D01*
G75*
G02*
X124285000Y-40393750I0J-218750D01*
G01*
X124285000Y-40906250D01*
G75*
G02*
X124066250Y-41125000I-218750J0D01*
G01*
X123628750Y-41125000D01*
G75*
G02*
X123410000Y-40906250I0J218750D01*
G01*
G37*
%TD*%
D10*
%TO.C,D2*%
X104140000Y-40640000D03*
D11*
X119380000Y-73660000D03*
X104140000Y-43180000D03*
X119380000Y-71120000D03*
X104140000Y-45720000D03*
X119380000Y-68580000D03*
X104140000Y-48260000D03*
X119380000Y-66040000D03*
X104140000Y-50800000D03*
X119380000Y-63500000D03*
X104140000Y-53340000D03*
X119380000Y-60960000D03*
X104140000Y-55880000D03*
X119380000Y-58420000D03*
X104140000Y-58420000D03*
X119380000Y-55880000D03*
X104140000Y-60960000D03*
X119380000Y-53340000D03*
X104140000Y-63500000D03*
X119380000Y-50800000D03*
X104140000Y-66040000D03*
X119380000Y-48260000D03*
X104140000Y-68580000D03*
X119380000Y-45720000D03*
X104140000Y-71120000D03*
X119380000Y-43180000D03*
X104140000Y-73660000D03*
X119380000Y-40640000D03*
%TD*%
D12*
%TO.C,J1*%
X91440000Y-73660000D03*
X91440000Y-71120000D03*
X91440000Y-68580000D03*
X91440000Y-66040000D03*
X91440000Y-63500000D03*
X91440000Y-60960000D03*
X91440000Y-58420000D03*
X91440000Y-55880000D03*
X91440000Y-53340000D03*
X91440000Y-50800000D03*
X91440000Y-48260000D03*
X91440000Y-45720000D03*
X91440000Y-43180000D03*
D13*
X91440000Y-40640000D03*
%TD*%
%TO.C,J2*%
X132080000Y-40640000D03*
D12*
X132080000Y-43180000D03*
X132080000Y-45720000D03*
X132080000Y-48260000D03*
X132080000Y-50800000D03*
X132080000Y-53340000D03*
X132080000Y-55880000D03*
X132080000Y-58420000D03*
X132080000Y-60960000D03*
X132080000Y-63500000D03*
X132080000Y-66040000D03*
X132080000Y-68580000D03*
X132080000Y-71120000D03*
X132080000Y-73660000D03*
%TD*%
%TO.C,J3*%
X93980000Y-73660000D03*
X93980000Y-71120000D03*
X93980000Y-68580000D03*
X93980000Y-66040000D03*
X93980000Y-63500000D03*
X93980000Y-60960000D03*
X93980000Y-58420000D03*
X93980000Y-55880000D03*
X93980000Y-53340000D03*
X93980000Y-50800000D03*
X93980000Y-48260000D03*
X93980000Y-45720000D03*
X93980000Y-43180000D03*
D13*
X93980000Y-40640000D03*
%TD*%
%TO.C,J4*%
X129540000Y-40640000D03*
D12*
X129540000Y-43180000D03*
X129540000Y-45720000D03*
X129540000Y-48260000D03*
X129540000Y-50800000D03*
X129540000Y-53340000D03*
X129540000Y-55880000D03*
X129540000Y-58420000D03*
X129540000Y-60960000D03*
X129540000Y-63500000D03*
X129540000Y-66040000D03*
X129540000Y-68580000D03*
X129540000Y-71120000D03*
X129540000Y-73660000D03*
%TD*%
D13*
%TO.C,J5*%
X96520000Y-40640000D03*
D12*
X96520000Y-43180000D03*
X96520000Y-45720000D03*
X96520000Y-48260000D03*
X96520000Y-50800000D03*
X96520000Y-53340000D03*
X96520000Y-55880000D03*
X96520000Y-58420000D03*
X96520000Y-60960000D03*
X96520000Y-63500000D03*
X96520000Y-66040000D03*
X96520000Y-68580000D03*
X96520000Y-71120000D03*
X96520000Y-73660000D03*
%TD*%
%TO.C,J6*%
X127000000Y-73660000D03*
X127000000Y-71120000D03*
X127000000Y-68580000D03*
X127000000Y-66040000D03*
X127000000Y-63500000D03*
X127000000Y-60960000D03*
X127000000Y-58420000D03*
X127000000Y-55880000D03*
X127000000Y-53340000D03*
X127000000Y-50800000D03*
X127000000Y-48260000D03*
X127000000Y-45720000D03*
X127000000Y-43180000D03*
D13*
X127000000Y-40640000D03*
%TD*%
M02*
