{
  "formatVersion": 1,
  "database": {
    "version": 3,
    "identityHash": "858036e51cf2c3bd24e6976ca384c5a9",
    "entities": [
      {
        "tableName": "users",
        "createSql": "CREATE TABLE IF NOT EXISTS `${TABLE_NAME}` (`uid` TEXT NOT NULL, `email` TEXT NOT NULL, `registered_on_backend` INTEGER NOT NULL, `scheme` TEXT, `schemeColonBackslash` TEXT, `host` TEXT, `port` TEXT, `portColon` TEXT, PRIMARY KEY(`uid`))",
        "fields": [
          {
            "fieldPath": "uid",
            "columnName": "uid",
            "affinity": "TEXT",
            "notNull": true
          },
          {
            "fieldPath": "email",
            "columnName": "email",
            "affinity": "TEXT",
            "notNull": true
          },
          {
            "fieldPath": "registeredOnBackend",
            "columnName": "registered_on_backend",
            "affinity": "INTEGER",
            "notNull": true
          },
          {
            "fieldPath": "urlHolder.scheme",
            "columnName": "scheme",
            "affinity": "TEXT",
            "notNull": false
          },
          {
            "fieldPath": "urlHolder.schemeColonBackslash",
            "columnName": "schemeColonBackslash",
            "affinity": "TEXT",
            "notNull": false
          },
          {
            "fieldPath": "urlHolder.host",
            "columnName": "host",
            "affinity": "TEXT",
            "notNull": false
          },
          {
            "fieldPath": "urlHolder.port",
            "columnName": "port",
            "affinity": "TEXT",
            "notNull": false
          },
          {
            "fieldPath": "urlHolder.portColon",
            "columnName": "portColon",
            "affinity": "TEXT",
            "notNull": false
          }
        ],
        "primaryKey": {
          "columnNames": [
            "uid"
          ],
          "autoGenerate": false
        },
        "indices": [],
        "foreignKeys": []
      },
      {
        "tableName": "tradfri_gateways",
        "createSql": "CREATE TABLE IF NOT EXISTS `${TABLE_NAME}` (`psk` TEXT NOT NULL, `user_id` TEXT NOT NULL, `host` TEXT NOT NULL, `label` TEXT NOT NULL, `icon` TEXT, PRIMARY KEY(`psk`), FOREIGN KEY(`user_id`) REFERENCES `users`(`uid`) ON UPDATE NO ACTION ON DELETE CASCADE )",
        "fields": [
          {
            "fieldPath": "psk",
            "columnName": "psk",
            "affinity": "TEXT",
            "notNull": true
          },
          {
            "fieldPath": "userId",
            "columnName": "user_id",
            "affinity": "TEXT",
            "notNull": true
          },
          {
            "fieldPath": "host",
            "columnName": "host",
            "affinity": "TEXT",
            "notNull": true
          },
          {
            "fieldPath": "label",
            "columnName": "label",
            "affinity": "TEXT",
            "notNull": true
          },
          {
            "fieldPath": "icon",
            "columnName": "icon",
            "affinity": "TEXT",
            "notNull": false
          }
        ],
        "primaryKey": {
          "columnNames": [
            "psk"
          ],
          "autoGenerate": false
        },
        "indices": [
          {
            "name": "index_tradfri_gateways_user_id",
            "unique": false,
            "columnNames": [
              "user_id"
            ],
            "createSql": "CREATE INDEX IF NOT EXISTS `index_tradfri_gateways_user_id` ON `${TABLE_NAME}` (`user_id`)"
          }
        ],
        "foreignKeys": [
          {
            "table": "users",
            "onDelete": "CASCADE",
            "onUpdate": "NO ACTION",
            "columns": [
              "user_id"
            ],
            "referencedColumns": [
              "uid"
            ]
          }
        ]
      },
      {
        "tableName": "tradfri_light_bulbs",
        "createSql": "CREATE TABLE IF NOT EXISTS `${TABLE_NAME}` (`gateway_psk` TEXT NOT NULL, `bulb_id` INTEGER NOT NULL, `name` TEXT NOT NULL, `last_seen` INTEGER NOT NULL, `reachable` INTEGER NOT NULL, `is_on` INTEGER NOT NULL, `dimmer_value` INTEGER NOT NULL, `manufacturer` TEXT NOT NULL, `model_number` TEXT NOT NULL, `firmware_version` TEXT NOT NULL, PRIMARY KEY(`gateway_psk`, `bulb_id`), FOREIGN KEY(`gateway_psk`) REFERENCES `tradfri_gateways`(`psk`) ON UPDATE NO ACTION ON DELETE CASCADE )",
        "fields": [
          {
            "fieldPath": "gatewayPsk",
            "columnName": "gateway_psk",
            "affinity": "TEXT",
            "notNull": true
          },
          {
            "fieldPath": "bulbId",
            "columnName": "bulb_id",
            "affinity": "INTEGER",
            "notNull": true
          },
          {
            "fieldPath": "name",
            "columnName": "name",
            "affinity": "TEXT",
            "notNull": true
          },
          {
            "fieldPath": "lastSeen",
            "columnName": "last_seen",
            "affinity": "INTEGER",
            "notNull": true
          },
          {
            "fieldPath": "reachable",
            "columnName": "reachable",
            "affinity": "INTEGER",
            "notNull": true
          },
          {
            "fieldPath": "isOn",
            "columnName": "is_on",
            "affinity": "INTEGER",
            "notNull": true
          },
          {
            "fieldPath": "dimmerValue",
            "columnName": "dimmer_value",
            "affinity": "INTEGER",
            "notNull": true
          },
          {
            "fieldPath": "manufacturer",
            "columnName": "manufacturer",
            "affinity": "TEXT",
            "notNull": true
          },
          {
            "fieldPath": "modelNumber",
            "columnName": "model_number",
            "affinity": "TEXT",
            "notNull": true
          },
          {
            "fieldPath": "firmwareVersion",
            "columnName": "firmware_version",
            "affinity": "TEXT",
            "notNull": true
          }
        ],
        "primaryKey": {
          "columnNames": [
            "gateway_psk",
            "bulb_id"
          ],
          "autoGenerate": false
        },
        "indices": [],
        "foreignKeys": [
          {
            "table": "tradfri_gateways",
            "onDelete": "CASCADE",
            "onUpdate": "NO ACTION",
            "columns": [
              "gateway_psk"
            ],
            "referencedColumns": [
              "psk"
            ]
          }
        ]
      }
    ],
    "views": [],
    "setupQueries": [
      "CREATE TABLE IF NOT EXISTS room_master_table (id INTEGER PRIMARY KEY,identity_hash TEXT)",
      "INSERT OR REPLACE INTO room_master_table (id,identity_hash) VALUES(42, '858036e51cf2c3bd24e6976ca384c5a9')"
    ]
  }
}