{
  "rm_items": "Ar tikrai norite pašalinti pasirinktą mediją?",
  "upload": {
    "instruct": "Pasirinkite medijos failus įkelimui",
    "submit": "Įkelti"
  },
  "sort": {
    "name": "Pavadinimas",
    "date": "Data"
  }

}
