{
  "type": "lib",
  "name": "authing.ui",
  "version": "0.1.7",
  "license": "MIT",
  "repository": "https://gitlab.com/zunzuncito/twigs/lib/authing.ui.git",
  "branch": "master",
  "lib": {
    "flyhtml": "*"
  }
}
