{
  "name": "flypack",
  "description": "Zunzuncito page packing script",
  "type": "cli",
  "version": "0.0.13",
  "license": "MIT",
  "repository": "https://gitlab.com/zunzuncito/twigs/cli/flypack.git",
  "branch": "master",
  "lib": {
    "flyutil": "*"
  }
}