<?xml version='1.0'?>
<ns2:test-suite xmlns:ns2='urn:model.allure.qatools.yandex.ru' start='1636470982098' stop='1636470995299'>
    <name>Validate Login Page allows successful Login:</name>
    <title>Validate Login Page allows successful Login:</title>
    <test-cases>
        <test-case start='1636470990985' status='passed' stop='1636470993860'>
            <name>User logs into website successfully and logs out</name>
            <title>User logs into website successfully and logs out</title>
            <labels/>
            <parameters/>
            <steps>
                <step start='1636470990994' status='passed' stop='1636470990996'>
                    <name>loginPage: roleLogin "standardUser"</name>
                    <title>loginPage: roleLogin "standardUser"</title>
                    <attachments/>
                    <steps>
                        <step start='1636470990994' status='passed' stop='1636470990996'>
                            <name>I get data "loginDetails.json"</name>
                            <title>I get data "loginDetails.json"</title>
                            <attachments/>
                            <steps/>
                        </step>
                    </steps>
                </step>
                <step start='1636470990997' status='passed' stop='1636470991305'>
                    <name>I am on page "https://www.saucedemo.com/"</name>
                    <title>I am on page "https://www.saucedemo.com/"</title>
                    <attachments/>
                    <steps/>
                </step>
                <step start='1636470991305' status='passed' stop='1636470991313'>
                    <name>I see in current url "https://www.saucedemo.com/"</name>
                    <title>I see in current url "https://www.saucedemo.com/"</title>
                    <attachments/>
                    <steps/>
                </step>
                <step start='1636470991313' status='passed' stop='1636470991496'>
                    <name>loginPage: checkPage </name>
                    <title>loginPage: checkPage </title>
                    <attachments/>
                    <steps>
                        <step start='1636470991313' status='passed' stop='1636470991327'>
                            <name>I wait for element {"xpath":"//div[@class = 'login_logo']"}, 10</name>
                            <title>I wait for element {"xpath":"//div[@class = 'login_logo']"}, 10</title>
                            <attachments/>
                            <steps/>
                        </step>
                        <step start='1636470991327' status='passed' stop='1636470991345'>
                            <name>I see element {"xpath":"//div[@class = 'login_logo']"}</name>
                            <title>I see element {"xpath":"//div[@class = 'login_logo']"}</title>
                            <attachments/>
                            <steps/>
                        </step>
                        <step start='1636470991345' status='passed' stop='1636470991355'>
                            <name>I wait for element {"xpath":"//*[@id = 'login-button']"}, 10</name>
                            <title>I wait for element {"xpath":"//*[@id = 'login-button']"}, 10</title>
                            <attachments/>
                            <steps/>
                        </step>
                        <step start='1636470991355' status='passed' stop='1636470991378'>
                            <name>I wait for clickable {"xpath":"//*[@id = 'login-button']"}, 10</name>
                            <title>I wait for clickable {"xpath":"//*[@id = 'login-button']"}, 10</title>
                            <attachments/>
                            <steps/>
                        </step>
                        <step start='1636470991378' status='passed' stop='1636470991393'>
                            <name>I see element {"xpath":"//*[@id = 'login-button']"}</name>
                            <title>I see element {"xpath":"//*[@id = 'login-button']"}</title>
                            <attachments/>
                            <steps/>
                        </step>
                        <step start='1636470991393' status='passed' stop='1636470991395'>
                            <name>I take screenshot "loginPageLoaded.png"</name>
                            <title>I take screenshot "loginPageLoaded.png"</title>
                            <attachments/>
                            <steps/>
                        </step>
                    </steps>
                </step>
                <step start='1636470991496' status='passed' stop='1636470991763'>
                    <name>I fill field {"xpath":"//input[@id = 'user-name']"}, "standard_user"</name>
                    <title>I fill field {"xpath":"//input[@id = 'user-name']"}, "standard_user"</title>
                    <attachments/>
                    <steps/>
                </step>
                <step start='1636470991873' status='passed' stop='1636470992137'>
                    <name>I fill field {"xpath":"//input[@id = 'password']"}, "secret_sauce"</name>
                    <title>I fill field {"xpath":"//input[@id = 'password']"}, "secret_sauce"</title>
                    <attachments/>
                    <steps/>
                </step>
                <step start='1636470992137' status='passed' stop='1636470992139'>
                    <name>I take screenshot "loginPageFilled.png"</name>
                    <title>I take screenshot "loginPageFilled.png"</title>
                    <attachments/>
                    <steps/>
                </step>
                <step start='1636470992248' status='passed' stop='1636470992518'>
                    <name>I click {"xpath":"//*[@id = 'login-button']"}</name>
                    <title>I click {"xpath":"//*[@id = 'login-button']"}</title>
                    <attachments/>
                    <steps/>
                </step>
                <step start='1636470992518' status='passed' stop='1636470992561'>
                    <name>homePage: checkPage </name>
                    <title>homePage: checkPage </title>
                    <attachments/>
                    <steps>
                        <step start='1636470992518' status='passed' stop='1636470992528'>
                            <name>I wait for element {"xpath":"//div[@class = 'app_logo']"}, 5</name>
                            <title>I wait for element {"xpath":"//div[@class = 'app_logo']"}, 5</title>
                            <attachments/>
                            <steps/>
                        </step>
                        <step start='1636470992528' status='passed' stop='1636470992541'>
                            <name>I see element {"xpath":"//div[@class = 'app_logo']"}</name>
                            <title>I see element {"xpath":"//div[@class = 'app_logo']"}</title>
                            <attachments/>
                            <steps/>
                        </step>
                        <step start='1636470992541' status='passed' stop='1636470992550'>
                            <name>I wait for element {"xpath":"//*[contains(text(), 'Products')]"}, 10</name>
                            <title>I wait for element {"xpath":"//*[contains(text(), 'Products')]"}, 10</title>
                            <attachments/>
                            <steps/>
                        </step>
                        <step start='1636470992550' status='passed' stop='1636470992561'>
                            <name>I see element {"xpath":"//*[contains(text(), 'Products')]"}</name>
                            <title>I see element {"xpath":"//*[contains(text(), 'Products')]"}</title>
                            <attachments/>
                            <steps/>
                        </step>
                    </steps>
                </step>
                <step start='1636470992561' status='passed' stop='1636470993808'>
                    <name>homePage: logOut </name>
                    <title>homePage: logOut </title>
                    <attachments/>
                    <steps>
                        <step start='1636470992561' status='passed' stop='1636470993065'>
                            <name>I dont see element {"xpath":"//a[@id='logout_sidebar_link']"}</name>
                            <title>I dont see element {"xpath":"//a[@id='logout_sidebar_link']"}</title>
                            <attachments/>
                            <steps/>
                        </step>
                        <step start='1636470993065' status='passed' stop='1636470993073'>
                            <name>I wait for element {"xpath":"//button[contains(@id, 'menu-btn')]"}, 10</name>
                            <title>I wait for element {"xpath":"//button[contains(@id, 'menu-btn')]"}, 10</title>
                            <attachments/>
                            <steps/>
                        </step>
                        <step start='1636470993073' status='passed' stop='1636470993089'>
                            <name>I wait for clickable {"xpath":"//button[contains(@id, 'menu-btn')]"}, 5</name>
                            <title>I wait for clickable {"xpath":"//button[contains(@id, 'menu-btn')]"}, 5</title>
                            <attachments/>
                            <steps/>
                        </step>
                        <step start='1636470993089' status='passed' stop='1636470993099'>
                            <name>I see element {"xpath":"//button[contains(@id, 'menu-btn')]"}</name>
                            <title>I see element {"xpath":"//button[contains(@id, 'menu-btn')]"}</title>
                            <attachments/>
                            <steps/>
                        </step>
                        <step start='1636470993210' status='passed' stop='1636470993447'>
                            <name>I click {"xpath":"//button[contains(@id, 'menu-btn')]"}</name>
                            <title>I click {"xpath":"//button[contains(@id, 'menu-btn')]"}</title>
                            <attachments/>
                            <steps/>
                        </step>
                        <step start='1636470993448' status='passed' stop='1636470993455'>
                            <name>I wait for element {"xpath":"//a[@id='logout_sidebar_link']"}, 10</name>
                            <title>I wait for element {"xpath":"//a[@id='logout_sidebar_link']"}, 10</title>
                            <attachments/>
                            <steps/>
                        </step>
                        <step start='1636470993455' status='passed' stop='1636470993468'>
                            <name>I see element {"xpath":"//a[@id='logout_sidebar_link']"}</name>
                            <title>I see element {"xpath":"//a[@id='logout_sidebar_link']"}</title>
                            <attachments/>
                            <steps/>
                        </step>
                        <step start='1636470993574' status='passed' stop='1636470993808'>
                            <name>I click {"xpath":"//a[@id='logout_sidebar_link']"}</name>
                            <title>I click {"xpath":"//a[@id='logout_sidebar_link']"}</title>
                            <attachments/>
                            <steps/>
                        </step>
                    </steps>
                </step>
                <step start='1636470993808' status='passed' stop='1636470993860'>
                    <name>loginPage: checkPage </name>
                    <title>loginPage: checkPage </title>
                    <attachments/>
                    <steps>
                        <step start='1636470993808' status='passed' stop='1636470993815'>
                            <name>I wait for element {"xpath":"//div[@class = 'login_logo']"}, 10</name>
                            <title>I wait for element {"xpath":"//div[@class = 'login_logo']"}, 10</title>
                            <attachments/>
                            <steps/>
                        </step>
                        <step start='1636470993815' status='passed' stop='1636470993826'>
                            <name>I see element {"xpath":"//div[@class = 'login_logo']"}</name>
                            <title>I see element {"xpath":"//div[@class = 'login_logo']"}</title>
                            <attachments/>
                            <steps/>
                        </step>
                        <step start='1636470993827' status='passed' stop='1636470993832'>
                            <name>I wait for element {"xpath":"//*[@id = 'login-button']"}, 10</name>
                            <title>I wait for element {"xpath":"//*[@id = 'login-button']"}, 10</title>
                            <attachments/>
                            <steps/>
                        </step>
                        <step start='1636470993832' status='passed' stop='1636470993847'>
                            <name>I wait for clickable {"xpath":"//*[@id = 'login-button']"}, 10</name>
                            <title>I wait for clickable {"xpath":"//*[@id = 'login-button']"}, 10</title>
                            <attachments/>
                            <steps/>
                        </step>
                        <step start='1636470993847' status='passed' stop='1636470993858'>
                            <name>I see element {"xpath":"//*[@id = 'login-button']"}</name>
                            <title>I see element {"xpath":"//*[@id = 'login-button']"}</title>
                            <attachments/>
                            <steps/>
                        </step>
                        <step start='1636470993858' status='passed' stop='1636470993859'>
                            <name>I take screenshot "loginPageLoaded.png"</name>
                            <title>I take screenshot "loginPageLoaded.png"</title>
                            <attachments/>
                            <steps/>
                        </step>
                    </steps>
                </step>
            </steps>
            <attachments/>
        </test-case>
        <test-case start='1636470993861' status='passed' stop='1636470995298'>
            <name>User attempts to login as locked out user</name>
            <title>User attempts to login as locked out user</title>
            <labels/>
            <parameters/>
            <steps>
                <step start='1636470993862' status='passed' stop='1636470993863'>
                    <name>loginPage: roleLogin "lockedoutuser"</name>
                    <title>loginPage: roleLogin "lockedoutuser"</title>
                    <attachments/>
                    <steps>
                        <step start='1636470993862' status='passed' stop='1636470993862'>
                            <name>I get data "loginDetails.json"</name>
                            <title>I get data "loginDetails.json"</title>
                            <attachments/>
                            <steps/>
                        </step>
                    </steps>
                </step>
                <step start='1636470993863' status='passed' stop='1636470993974'>
                    <name>I am on page "https://www.saucedemo.com/"</name>
                    <title>I am on page "https://www.saucedemo.com/"</title>
                    <attachments/>
                    <steps/>
                </step>
                <step start='1636470993974' status='passed' stop='1636470993979'>
                    <name>I see in current url "https://www.saucedemo.com/"</name>
                    <title>I see in current url "https://www.saucedemo.com/"</title>
                    <attachments/>
                    <steps/>
                </step>
                <step start='1636470993979' status='passed' stop='1636470994143'>
                    <name>loginPage: checkPage </name>
                    <title>loginPage: checkPage </title>
                    <attachments/>
                    <steps>
                        <step start='1636470993979' status='passed' stop='1636470993986'>
                            <name>I wait for element {"xpath":"//div[@class = 'login_logo']"}, 10</name>
                            <title>I wait for element {"xpath":"//div[@class = 'login_logo']"}, 10</title>
                            <attachments/>
                            <steps/>
                        </step>
                        <step start='1636470993986' status='passed' stop='1636470993999'>
                            <name>I see element {"xpath":"//div[@class = 'login_logo']"}</name>
                            <title>I see element {"xpath":"//div[@class = 'login_logo']"}</title>
                            <attachments/>
                            <steps/>
                        </step>
                        <step start='1636470993999' status='passed' stop='1636470994006'>
                            <name>I wait for element {"xpath":"//*[@id = 'login-button']"}, 10</name>
                            <title>I wait for element {"xpath":"//*[@id = 'login-button']"}, 10</title>
                            <attachments/>
                            <steps/>
                        </step>
                        <step start='1636470994006' status='passed' stop='1636470994023'>
                            <name>I wait for clickable {"xpath":"//*[@id = 'login-button']"}, 10</name>
                            <title>I wait for clickable {"xpath":"//*[@id = 'login-button']"}, 10</title>
                            <attachments/>
                            <steps/>
                        </step>
                        <step start='1636470994023' status='passed' stop='1636470994034'>
                            <name>I see element {"xpath":"//*[@id = 'login-button']"}</name>
                            <title>I see element {"xpath":"//*[@id = 'login-button']"}</title>
                            <attachments/>
                            <steps/>
                        </step>
                        <step start='1636470994034' status='passed' stop='1636470994036'>
                            <name>I take screenshot "loginPageLoaded.png"</name>
                            <title>I take screenshot "loginPageLoaded.png"</title>
                            <attachments/>
                            <steps/>
                        </step>
                    </steps>
                </step>
                <step start='1636470994143' status='passed' stop='1636470994408'>
                    <name>I fill field {"xpath":"//input[@id = 'user-name']"}, "locked_out_user"</name>
                    <title>I fill field {"xpath":"//input[@id = 'user-name']"}, "locked_out_user"</title>
                    <attachments/>
                    <steps/>
                </step>
                <step start='1636470994517' status='passed' stop='1636470994769'>
                    <name>I fill field {"xpath":"//input[@id = 'password']"}, "secret_sauce"</name>
                    <title>I fill field {"xpath":"//input[@id = 'password']"}, "secret_sauce"</title>
                    <attachments/>
                    <steps/>
                </step>
                <step start='1636470994769' status='passed' stop='1636470994771'>
                    <name>I take screenshot "loginPageFilled.png"</name>
                    <title>I take screenshot "loginPageFilled.png"</title>
                    <attachments/>
                    <steps/>
                </step>
                <step start='1636470994880' status='passed' stop='1636470995117'>
                    <name>I click {"xpath":"//*[@id = 'login-button']"}</name>
                    <title>I click {"xpath":"//*[@id = 'login-button']"}</title>
                    <attachments/>
                    <steps/>
                </step>
                <step start='1636470995117' status='passed' stop='1636470995141'>
                    <name>loginPage: checkError </name>
                    <title>loginPage: checkError </title>
                    <attachments/>
                    <steps>
                        <step start='1636470995117' status='passed' stop='1636470995128'>
                            <name>I wait for element {"xpath":"//h3[@data-test = 'error']"}, 10</name>
                            <title>I wait for element {"xpath":"//h3[@data-test = 'error']"}, 10</title>
                            <attachments/>
                            <steps/>
                        </step>
                        <step start='1636470995128' status='passed' stop='1636470995140'>
                            <name>I see element {"xpath":"//h3[@data-test = 'error']"}</name>
                            <title>I see element {"xpath":"//h3[@data-test = 'error']"}</title>
                            <attachments/>
                            <steps/>
                        </step>
                        <step start='1636470995140' status='passed' stop='1636470995141'>
                            <name>I take screenshot "LoginError.png"</name>
                            <title>I take screenshot "LoginError.png"</title>
                            <attachments/>
                            <steps/>
                        </step>
                    </steps>
                </step>
                <step start='1636470995141' status='passed' stop='1636470995298'>
                    <name>loginPage: clearLoginFields </name>
                    <title>loginPage: clearLoginFields </title>
                    <attachments/>
                    <steps>
                        <step start='1636470995141' status='passed' stop='1636470995243'>
                            <name>I clear field {"xpath":"//input[@id = 'user-name']"}</name>
                            <title>I clear field {"xpath":"//input[@id = 'user-name']"}</title>
                            <attachments/>
                            <steps/>
                        </step>
                        <step start='1636470995243' status='passed' stop='1636470995260'>
                            <name>I clear field {"xpath":"//input[@id = 'password']"}</name>
                            <title>I clear field {"xpath":"//input[@id = 'password']"}</title>
                            <attachments/>
                            <steps/>
                        </step>
                        <step start='1636470995260' status='passed' stop='1636470995280'>
                            <name>I see in field {"xpath":"//input[@id = 'user-name']"}, </name>
                            <title>I see in field {"xpath":"//input[@id = 'user-name']"}, </title>
                            <attachments/>
                            <steps/>
                        </step>
                        <step start='1636470995280' status='passed' stop='1636470995298'>
                            <name>I see in field {"xpath":"//input[@id = 'password']"}, </name>
                            <title>I see in field {"xpath":"//input[@id = 'password']"}, </title>
                            <attachments/>
                            <steps/>
                        </step>
                    </steps>
                </step>
            </steps>
            <attachments/>
        </test-case>
    </test-cases>
</ns2:test-suite>