<?xml version='1.0'?>
<ns2:test-suite xmlns:ns2='urn:model.allure.qatools.yandex.ru' start='1653317126430' stop='1653317137217'>
    <name>Validate Login Page allows successful Login:</name>
    <title>Validate Login Page allows successful Login:</title>
    <test-cases>
        <test-case start='1653317137206' status='passed' stop='1653317137216'>
            <name>User logs into website successfully and logs out @smoke</name>
            <title>User logs into website successfully and logs out @smoke</title>
            <labels>
                <label name='tag' value='@smoke'/>
            </labels>
            <parameters/>
            <steps/>
            <attachments/>
        </test-case>
    </test-cases>
</ns2:test-suite>