<?xml version='1.0'?>
<ns2:test-suite xmlns:ns2='urn:model.allure.qatools.yandex.ru' start='1635950675107' stop='1635950685720'>
    <name>User purchases items from SauceDemo.com:</name>
    <title>User purchases items from SauceDemo.com:</title>
    <test-cases>
        <test-case start='1635950683264' status='passed' stop='1635950684840'>
            <name>User logs into website successfully</name>
            <title>User logs into website successfully</title>
            <labels/>
            <parameters/>
            <steps>
                <step start='1635950683273' status='passed' stop='1635950683275'>
                    <name>loginPage: roleLogin "standardUser"</name>
                    <title>loginPage: roleLogin "standardUser"</title>
                    <attachments/>
                    <steps>
                        <step start='1635950683273' status='passed' stop='1635950683275'>
                            <name>I get data "loginDetails.json"</name>
                            <title>I get data "loginDetails.json"</title>
                            <attachments/>
                            <steps/>
                        </step>
                    </steps>
                </step>
                <step start='1635950683275' status='passed' stop='1635950683551'>
                    <name>I am on page "https://www.saucedemo.com/"</name>
                    <title>I am on page "https://www.saucedemo.com/"</title>
                    <attachments/>
                    <steps/>
                </step>
                <step start='1635950683551' status='passed' stop='1635950683560'>
                    <name>I see in current url "https://www.saucedemo.com/"</name>
                    <title>I see in current url "https://www.saucedemo.com/"</title>
                    <attachments/>
                    <steps/>
                </step>
                <step start='1635950683560' status='passed' stop='1635950683750'>
                    <name>loginPage: checkPage </name>
                    <title>loginPage: checkPage </title>
                    <attachments/>
                    <steps>
                        <step start='1635950683560' status='passed' stop='1635950683573'>
                            <name>I wait for element {"xpath":"//div[@class = 'login_logo']"}, 10</name>
                            <title>I wait for element {"xpath":"//div[@class = 'login_logo']"}, 10</title>
                            <attachments/>
                            <steps/>
                        </step>
                        <step start='1635950683573' status='passed' stop='1635950683592'>
                            <name>I see element {"xpath":"//div[@class = 'login_logo']"}</name>
                            <title>I see element {"xpath":"//div[@class = 'login_logo']"}</title>
                            <attachments/>
                            <steps/>
                        </step>
                        <step start='1635950683592' status='passed' stop='1635950683603'>
                            <name>I wait for element {"xpath":"//*[@id = 'login-button']"}, 10</name>
                            <title>I wait for element {"xpath":"//*[@id = 'login-button']"}, 10</title>
                            <attachments/>
                            <steps/>
                        </step>
                        <step start='1635950683603' status='passed' stop='1635950683625'>
                            <name>I wait for clickable {"xpath":"//*[@id = 'login-button']"}, 10</name>
                            <title>I wait for clickable {"xpath":"//*[@id = 'login-button']"}, 10</title>
                            <attachments/>
                            <steps/>
                        </step>
                        <step start='1635950683625' status='passed' stop='1635950683639'>
                            <name>I see element {"xpath":"//*[@id = 'login-button']"}</name>
                            <title>I see element {"xpath":"//*[@id = 'login-button']"}</title>
                            <attachments/>
                            <steps/>
                        </step>
                        <step start='1635950683639' status='passed' stop='1635950683641'>
                            <name>I take screenshot "loginPageLoaded.png"</name>
                            <title>I take screenshot "loginPageLoaded.png"</title>
                            <attachments/>
                            <steps/>
                        </step>
                    </steps>
                </step>
                <step start='1635950683750' status='passed' stop='1635950684033'>
                    <name>I fill field {"xpath":"//input[@id = 'user-name']"}, "standard_user"</name>
                    <title>I fill field {"xpath":"//input[@id = 'user-name']"}, "standard_user"</title>
                    <attachments/>
                    <steps/>
                </step>
                <step start='1635950684144' status='passed' stop='1635950684409'>
                    <name>I fill field {"xpath":"//input[@id = 'password']"}, "secret_sauce"</name>
                    <title>I fill field {"xpath":"//input[@id = 'password']"}, "secret_sauce"</title>
                    <attachments/>
                    <steps/>
                </step>
                <step start='1635950684409' status='passed' stop='1635950684412'>
                    <name>I take screenshot "loginPageFilled.png"</name>
                    <title>I take screenshot "loginPageFilled.png"</title>
                    <attachments/>
                    <steps/>
                </step>
                <step start='1635950684521' status='passed' stop='1635950684793'>
                    <name>I click {"xpath":"//*[@id = 'login-button']"}</name>
                    <title>I click {"xpath":"//*[@id = 'login-button']"}</title>
                    <attachments/>
                    <steps/>
                </step>
                <step start='1635950684793' status='passed' stop='1635950684840'>
                    <name>homePage: checkPage </name>
                    <title>homePage: checkPage </title>
                    <attachments/>
                    <steps>
                        <step start='1635950684793' status='passed' stop='1635950684805'>
                            <name>I wait for element {"xpath":"//div[@class = 'app_logo']"}, 5</name>
                            <title>I wait for element {"xpath":"//div[@class = 'app_logo']"}, 5</title>
                            <attachments/>
                            <steps/>
                        </step>
                        <step start='1635950684805' status='passed' stop='1635950684817'>
                            <name>I see element {"xpath":"//div[@class = 'app_logo']"}</name>
                            <title>I see element {"xpath":"//div[@class = 'app_logo']"}</title>
                            <attachments/>
                            <steps/>
                        </step>
                        <step start='1635950684817' status='passed' stop='1635950684827'>
                            <name>I wait for element {"xpath":"//*[contains(text(), 'Products')]"}, 10</name>
                            <title>I wait for element {"xpath":"//*[contains(text(), 'Products')]"}, 10</title>
                            <attachments/>
                            <steps/>
                        </step>
                        <step start='1635950684828' status='passed' stop='1635950684839'>
                            <name>I see element {"xpath":"//*[contains(text(), 'Products')]"}</name>
                            <title>I see element {"xpath":"//*[contains(text(), 'Products')]"}</title>
                            <attachments/>
                            <steps/>
                        </step>
                    </steps>
                </step>
            </steps>
            <attachments/>
        </test-case>
        <test-case start='1635950684841' status='failed' stop='1635950685619'>
            <name>User adds items to their cart that they want to purchase</name>
            <title>User adds items to their cart that they want to purchase</title>
            <labels/>
            <parameters/>
            <steps>
                <step start='1635950684843' status='passed' stop='1635950685597'>
                    <name>homePage: addItemToCart "backpack"</name>
                    <title>homePage: addItemToCart "backpack"</title>
                    <attachments/>
                    <steps>
                        <step start='1635950684843' status='passed' stop='1635950684862'>
                            <name>I wait for clickable {"xpath":"//*[contains(@id, 'add-to-cart') and contains(@id, 'backpack')]"}, 10</name>
                            <title>I wait for clickable {"xpath":"//*[contains(@id, 'add-to-cart') and contains(@id, 'backpack')]"}, 10</title>
                            <attachments/>
                            <steps/>
                        </step>
                        <step start='1635950684862' status='passed' stop='1635950684873'>
                            <name>I see element {"xpath":"//*[contains(@id, 'add-to-cart') and contains(@id, 'backpack')]"}</name>
                            <title>I see element {"xpath":"//*[contains(@id, 'add-to-cart') and contains(@id, 'backpack')]"}</title>
                            <attachments/>
                            <steps/>
                        </step>
                        <step start='1635950684985' status='passed' stop='1635950685221'>
                            <name>I click {"xpath":"//*[contains(@id, 'add-to-cart') and contains(@id, 'backpack')]"}</name>
                            <title>I click {"xpath":"//*[contains(@id, 'add-to-cart') and contains(@id, 'backpack')]"}</title>
                            <attachments/>
                            <steps/>
                        </step>
                        <step start='1635950685221' status='passed' stop='1635950685236'>
                            <name>I see element {"xpath":"//*[contains(@id, 'remove') and contains(@id, 'backpack')]"}</name>
                            <title>I see element {"xpath":"//*[contains(@id, 'remove') and contains(@id, 'backpack')]"}</title>
                            <attachments/>
                            <steps/>
                        </step>
                        <step start='1635950685236' status='passed' stop='1635950685255'>
                            <name>I wait for clickable {"xpath":"//*[@class='shopping_cart_link']"}, 10</name>
                            <title>I wait for clickable {"xpath":"//*[@class='shopping_cart_link']"}, 10</title>
                            <attachments/>
                            <steps/>
                        </step>
                        <step start='1635950685360' status='passed' stop='1635950685596'>
                            <name>I click {"xpath":"//*[@class='shopping_cart_link']"}</name>
                            <title>I click {"xpath":"//*[@class='shopping_cart_link']"}</title>
                            <attachments/>
                            <steps/>
                        </step>
                        <step start='1635950685596' status='passed' stop='1635950685597'>
                            <name>I get data "shoppingItems.json"</name>
                            <title>I get data "shoppingItems.json"</title>
                            <attachments/>
                            <steps/>
                        </step>
                    </steps>
                </step>
                <step start='1635950685597' status='passed' stop='1635950685618'>
                    <name>I grab text from all {"xpath":"//*[@class='inventory_item_name']"}</name>
                    <title>I grab text from all {"xpath":"//*[@class='inventory_item_name']"}</title>
                    <attachments/>
                    <steps/>
                </step>
            </steps>
            <attachments>
                <attachment title='Last Seen Screenshot' source='80c61872-0e4a-4bf9-b234-852fff41268e-attachment.png' type='image/png' size='83735'/>
            </attachments>
            <failure>
                <message>Sauce Labs Backpack is not a function</message>
                <stack-trace>TypeError: Sauce Labs Backpack is not a function
                    at Array.find (&lt;anonymous>)
                    at Object.validateItemAddedToCart (C:\Users\RAT\Framework\UI\pages\cartPage.js:42:39)
                    at processTicksAndRejections (node:internal/process/task_queues:96:5)
                    at async Object.addItemToCart (C:\Users\RAT\Framework\UI\pages\homePage.js:70:9)
                    at async Test.&lt;anonymous> (C:\Users\RAT\Framework\UI\tests\purchaseItems_test.js:10:5)</stack-trace>
            </failure>
        </test-case>
    </test-cases>
</ns2:test-suite>