<?xml version='1.0'?>
<ns2:test-suite xmlns:ns2='urn:model.allure.qatools.yandex.ru' start='1635959276128' stop='1635959438301'>
    <name>User purchases items from SauceDemo.com:</name>
    <title>User purchases items from SauceDemo.com:</title>
    <test-cases>
        <test-case start='1635959284592' status='passed' stop='1635959286119'>
            <name>User logs into website successfully</name>
            <title>User logs into website successfully</title>
            <labels/>
            <parameters/>
            <steps>
                <step start='1635959284601' status='passed' stop='1635959284602'>
                    <name>loginPage: roleLogin "standardUser"</name>
                    <title>loginPage: roleLogin "standardUser"</title>
                    <attachments/>
                    <steps>
                        <step start='1635959284601' status='passed' stop='1635959284602'>
                            <name>I get data "loginDetails.json"</name>
                            <title>I get data "loginDetails.json"</title>
                            <attachments/>
                            <steps/>
                        </step>
                    </steps>
                </step>
                <step start='1635959284603' status='passed' stop='1635959284846'>
                    <name>I am on page "https://www.saucedemo.com/"</name>
                    <title>I am on page "https://www.saucedemo.com/"</title>
                    <attachments/>
                    <steps/>
                </step>
                <step start='1635959284846' status='passed' stop='1635959284854'>
                    <name>I see in current url "https://www.saucedemo.com/"</name>
                    <title>I see in current url "https://www.saucedemo.com/"</title>
                    <attachments/>
                    <steps/>
                </step>
                <step start='1635959284854' status='passed' stop='1635959285043'>
                    <name>loginPage: checkPage </name>
                    <title>loginPage: checkPage </title>
                    <attachments/>
                    <steps>
                        <step start='1635959284854' status='passed' stop='1635959284867'>
                            <name>I wait for element {"xpath":"//div[@class = 'login_logo']"}, 10</name>
                            <title>I wait for element {"xpath":"//div[@class = 'login_logo']"}, 10</title>
                            <attachments/>
                            <steps/>
                        </step>
                        <step start='1635959284868' status='passed' stop='1635959284887'>
                            <name>I see element {"xpath":"//div[@class = 'login_logo']"}</name>
                            <title>I see element {"xpath":"//div[@class = 'login_logo']"}</title>
                            <attachments/>
                            <steps/>
                        </step>
                        <step start='1635959284887' status='passed' stop='1635959284897'>
                            <name>I wait for element {"xpath":"//*[@id = 'login-button']"}, 10</name>
                            <title>I wait for element {"xpath":"//*[@id = 'login-button']"}, 10</title>
                            <attachments/>
                            <steps/>
                        </step>
                        <step start='1635959284897' status='passed' stop='1635959284920'>
                            <name>I wait for clickable {"xpath":"//*[@id = 'login-button']"}, 10</name>
                            <title>I wait for clickable {"xpath":"//*[@id = 'login-button']"}, 10</title>
                            <attachments/>
                            <steps/>
                        </step>
                        <step start='1635959284920' status='passed' stop='1635959284935'>
                            <name>I see element {"xpath":"//*[@id = 'login-button']"}</name>
                            <title>I see element {"xpath":"//*[@id = 'login-button']"}</title>
                            <attachments/>
                            <steps/>
                        </step>
                        <step start='1635959284935' status='passed' stop='1635959284937'>
                            <name>I take screenshot "loginPageLoaded.png"</name>
                            <title>I take screenshot "loginPageLoaded.png"</title>
                            <attachments/>
                            <steps/>
                        </step>
                    </steps>
                </step>
                <step start='1635959285043' status='passed' stop='1635959285310'>
                    <name>I fill field {"xpath":"//input[@id = 'user-name']"}, "standard_user"</name>
                    <title>I fill field {"xpath":"//input[@id = 'user-name']"}, "standard_user"</title>
                    <attachments/>
                    <steps/>
                </step>
                <step start='1635959285420' status='passed' stop='1635959285690'>
                    <name>I fill field {"xpath":"//input[@id = 'password']"}, "secret_sauce"</name>
                    <title>I fill field {"xpath":"//input[@id = 'password']"}, "secret_sauce"</title>
                    <attachments/>
                    <steps/>
                </step>
                <step start='1635959285690' status='passed' stop='1635959285692'>
                    <name>I take screenshot "loginPageFilled.png"</name>
                    <title>I take screenshot "loginPageFilled.png"</title>
                    <attachments/>
                    <steps/>
                </step>
                <step start='1635959285794' status='passed' stop='1635959286072'>
                    <name>I click {"xpath":"//*[@id = 'login-button']"}</name>
                    <title>I click {"xpath":"//*[@id = 'login-button']"}</title>
                    <attachments/>
                    <steps/>
                </step>
                <step start='1635959286072' status='passed' stop='1635959286119'>
                    <name>homePage: checkPage </name>
                    <title>homePage: checkPage </title>
                    <attachments/>
                    <steps>
                        <step start='1635959286072' status='passed' stop='1635959286084'>
                            <name>I wait for element {"xpath":"//div[@class = 'app_logo']"}, 5</name>
                            <title>I wait for element {"xpath":"//div[@class = 'app_logo']"}, 5</title>
                            <attachments/>
                            <steps/>
                        </step>
                        <step start='1635959286084' status='passed' stop='1635959286096'>
                            <name>I see element {"xpath":"//div[@class = 'app_logo']"}</name>
                            <title>I see element {"xpath":"//div[@class = 'app_logo']"}</title>
                            <attachments/>
                            <steps/>
                        </step>
                        <step start='1635959286096' status='passed' stop='1635959286106'>
                            <name>I wait for element {"xpath":"//*[contains(text(), 'Products')]"}, 10</name>
                            <title>I wait for element {"xpath":"//*[contains(text(), 'Products')]"}, 10</title>
                            <attachments/>
                            <steps/>
                        </step>
                        <step start='1635959286106' status='passed' stop='1635959286119'>
                            <name>I see element {"xpath":"//*[contains(text(), 'Products')]"}</name>
                            <title>I see element {"xpath":"//*[contains(text(), 'Products')]"}</title>
                            <attachments/>
                            <steps/>
                        </step>
                    </steps>
                </step>
            </steps>
            <attachments/>
        </test-case>
        <test-case start='1635959286120' status='failed' stop='1635959438181'>
            <name>User adds items to their cart that they want to purchase</name>
            <title>User adds items to their cart that they want to purchase</title>
            <labels/>
            <parameters/>
            <steps>
                <step start='1635959286122' status='passed' stop='1635959286875'>
                    <name>homePage: addItemToCart "backpack"</name>
                    <title>homePage: addItemToCart "backpack"</title>
                    <attachments/>
                    <steps>
                        <step start='1635959286122' status='passed' stop='1635959286142'>
                            <name>I wait for clickable {"xpath":"//*[contains(@id, 'add-to-cart') and contains(@id, 'backpack')]"}, 10</name>
                            <title>I wait for clickable {"xpath":"//*[contains(@id, 'add-to-cart') and contains(@id, 'backpack')]"}, 10</title>
                            <attachments/>
                            <steps/>
                        </step>
                        <step start='1635959286142' status='passed' stop='1635959286155'>
                            <name>I see element {"xpath":"//*[contains(@id, 'add-to-cart') and contains(@id, 'backpack')]"}</name>
                            <title>I see element {"xpath":"//*[contains(@id, 'add-to-cart') and contains(@id, 'backpack')]"}</title>
                            <attachments/>
                            <steps/>
                        </step>
                        <step start='1635959286260' status='passed' stop='1635959286493'>
                            <name>I click {"xpath":"//*[contains(@id, 'add-to-cart') and contains(@id, 'backpack')]"}</name>
                            <title>I click {"xpath":"//*[contains(@id, 'add-to-cart') and contains(@id, 'backpack')]"}</title>
                            <attachments/>
                            <steps/>
                        </step>
                        <step start='1635959286493' status='passed' stop='1635959286512'>
                            <name>I see element {"xpath":"//*[contains(@id, 'remove') and contains(@id, 'backpack')]"}</name>
                            <title>I see element {"xpath":"//*[contains(@id, 'remove') and contains(@id, 'backpack')]"}</title>
                            <attachments/>
                            <steps/>
                        </step>
                        <step start='1635959286512' status='passed' stop='1635959286536'>
                            <name>I wait for clickable {"xpath":"//*[@class='shopping_cart_link']"}, 10</name>
                            <title>I wait for clickable {"xpath":"//*[@class='shopping_cart_link']"}, 10</title>
                            <attachments/>
                            <steps/>
                        </step>
                        <step start='1635959286636' status='passed' stop='1635959286874'>
                            <name>I click {"xpath":"//*[@class='shopping_cart_link']"}</name>
                            <title>I click {"xpath":"//*[@class='shopping_cart_link']"}</title>
                            <attachments/>
                            <steps/>
                        </step>
                        <step start='1635959286874' status='passed' stop='1635959286875'>
                            <name>I get data "shoppingItems.json"</name>
                            <title>I get data "shoppingItems.json"</title>
                            <attachments/>
                            <steps/>
                        </step>
                    </steps>
                </step>
                <step start='1635959286875' status='passed' stop='1635959286896'>
                    <name>I grab text from all {"xpath":"//*[@class='inventory_item_name']"}</name>
                    <title>I grab text from all {"xpath":"//*[@class='inventory_item_name']"}</title>
                    <attachments/>
                    <steps/>
                </step>
                <step start='1635959286897' status='passed' stop='1635959286897'>
                    <name>I assert equal "Sauce Labs Backpack", "Sauce Labs Backpack"</name>
                    <title>I assert equal "Sauce Labs Backpack", "Sauce Labs Backpack"</title>
                    <attachments/>
                    <steps/>
                </step>
                <step start='1635959286897' status='passed' stop='1635959286916'>
                    <name>I see text equals "$29.99", {"xpath":"//*[contains(text(), 'Sauce Labs Backpack')]//following::div[@class='inventory_item_price' and text()='29.99']"}</name>
                    <title>I see text equals "$29.99", {"xpath":"//*[contains(text(), 'Sauce Labs Backpack')]//following::div[@class='inventory_item_price' and text()='29.99']"}</title>
                    <attachments/>
                    <steps/>
                </step>
                <step start='1635959286916' status='passed' stop='1635959287290'>
                    <name>cartPage: goToHomePage </name>
                    <title>cartPage: goToHomePage </title>
                    <attachments/>
                    <steps>
                        <step start='1635959286916' status='passed' stop='1635959286934'>
                            <name>I wait for clickable {"xpath":"//button[contains(text(), 'Continue')]"}, 10</name>
                            <title>I wait for clickable {"xpath":"//button[contains(text(), 'Continue')]"}, 10</title>
                            <attachments/>
                            <steps/>
                        </step>
                        <step start='1635959286934' status='passed' stop='1635959286946'>
                            <name>I see element {"xpath":"//button[contains(text(), 'Continue')]"}</name>
                            <title>I see element {"xpath":"//button[contains(text(), 'Continue')]"}</title>
                            <attachments/>
                            <steps/>
                        </step>
                        <step start='1635959287050' status='passed' stop='1635959287290'>
                            <name>I click {"xpath":"//button[contains(text(), 'Continue')]"}</name>
                            <title>I click {"xpath":"//button[contains(text(), 'Continue')]"}</title>
                            <attachments/>
                            <steps/>
                        </step>
                    </steps>
                </step>
                <step start='1635959287290' status='passed' stop='1635959287328'>
                    <name>homePage: checkPage </name>
                    <title>homePage: checkPage </title>
                    <attachments/>
                    <steps>
                        <step start='1635959287290' status='passed' stop='1635959287299'>
                            <name>I wait for element {"xpath":"//div[@class = 'app_logo']"}, 5</name>
                            <title>I wait for element {"xpath":"//div[@class = 'app_logo']"}, 5</title>
                            <attachments/>
                            <steps/>
                        </step>
                        <step start='1635959287299' status='passed' stop='1635959287311'>
                            <name>I see element {"xpath":"//div[@class = 'app_logo']"}</name>
                            <title>I see element {"xpath":"//div[@class = 'app_logo']"}</title>
                            <attachments/>
                            <steps/>
                        </step>
                        <step start='1635959287311' status='passed' stop='1635959287317'>
                            <name>I wait for element {"xpath":"//*[contains(text(), 'Products')]"}, 10</name>
                            <title>I wait for element {"xpath":"//*[contains(text(), 'Products')]"}, 10</title>
                            <attachments/>
                            <steps/>
                        </step>
                        <step start='1635959287317' status='passed' stop='1635959287328'>
                            <name>I see element {"xpath":"//*[contains(text(), 'Products')]"}</name>
                            <title>I see element {"xpath":"//*[contains(text(), 'Products')]"}</title>
                            <attachments/>
                            <steps/>
                        </step>
                    </steps>
                </step>
                <step start='1635959287328' status='passed' stop='1635959288087'>
                    <name>homePage: addItemToCart "bike"</name>
                    <title>homePage: addItemToCart "bike"</title>
                    <attachments/>
                    <steps>
                        <step start='1635959287328' status='passed' stop='1635959287347'>
                            <name>I wait for clickable {"xpath":"//*[contains(@id, 'add-to-cart') and contains(@id, 'bike')]"}, 10</name>
                            <title>I wait for clickable {"xpath":"//*[contains(@id, 'add-to-cart') and contains(@id, 'bike')]"}, 10</title>
                            <attachments/>
                            <steps/>
                        </step>
                        <step start='1635959287347' status='passed' stop='1635959287358'>
                            <name>I see element {"xpath":"//*[contains(@id, 'add-to-cart') and contains(@id, 'bike')]"}</name>
                            <title>I see element {"xpath":"//*[contains(@id, 'add-to-cart') and contains(@id, 'bike')]"}</title>
                            <attachments/>
                            <steps/>
                        </step>
                        <step start='1635959287466' status='passed' stop='1635959287705'>
                            <name>I click {"xpath":"//*[contains(@id, 'add-to-cart') and contains(@id, 'bike')]"}</name>
                            <title>I click {"xpath":"//*[contains(@id, 'add-to-cart') and contains(@id, 'bike')]"}</title>
                            <attachments/>
                            <steps/>
                        </step>
                        <step start='1635959287705' status='passed' stop='1635959287721'>
                            <name>I see element {"xpath":"//*[contains(@id, 'remove') and contains(@id, 'bike')]"}</name>
                            <title>I see element {"xpath":"//*[contains(@id, 'remove') and contains(@id, 'bike')]"}</title>
                            <attachments/>
                            <steps/>
                        </step>
                        <step start='1635959287721' status='passed' stop='1635959287738'>
                            <name>I wait for clickable {"xpath":"//*[@class='shopping_cart_link']"}, 10</name>
                            <title>I wait for clickable {"xpath":"//*[@class='shopping_cart_link']"}, 10</title>
                            <attachments/>
                            <steps/>
                        </step>
                        <step start='1635959287849' status='passed' stop='1635959288086'>
                            <name>I click {"xpath":"//*[@class='shopping_cart_link']"}</name>
                            <title>I click {"xpath":"//*[@class='shopping_cart_link']"}</title>
                            <attachments/>
                            <steps/>
                        </step>
                        <step start='1635959288086' status='passed' stop='1635959288087'>
                            <name>I get data "shoppingItems.json"</name>
                            <title>I get data "shoppingItems.json"</title>
                            <attachments/>
                            <steps/>
                        </step>
                    </steps>
                </step>
                <step start='1635959288087' status='passed' stop='1635959288111'>
                    <name>I grab text from all {"xpath":"//*[@class='inventory_item_name']"}</name>
                    <title>I grab text from all {"xpath":"//*[@class='inventory_item_name']"}</title>
                    <attachments/>
                    <steps/>
                </step>
                <step start='1635959288112' status='passed' stop='1635959288112'>
                    <name>I assert equal "Sauce Labs Bike Light", "Sauce Labs Bike Light"</name>
                    <title>I assert equal "Sauce Labs Bike Light", "Sauce Labs Bike Light"</title>
                    <attachments/>
                    <steps/>
                </step>
                <step start='1635959288112' status='passed' stop='1635959288129'>
                    <name>I see text equals "$9.99", {"xpath":"//*[contains(text(), 'Sauce Labs Bike Light')]//following::div[@class='inventory_item_price' and text()='9.99']"}</name>
                    <title>I see text equals "$9.99", {"xpath":"//*[contains(text(), 'Sauce Labs Bike Light')]//following::div[@class='inventory_item_price' and text()='9.99']"}</title>
                    <attachments/>
                    <steps/>
                </step>
                <step start='1635959288129' status='passed' stop='1635959288491'>
                    <name>cartPage: goToHomePage </name>
                    <title>cartPage: goToHomePage </title>
                    <attachments/>
                    <steps>
                        <step start='1635959288129' status='passed' stop='1635959288144'>
                            <name>I wait for clickable {"xpath":"//button[contains(text(), 'Continue')]"}, 10</name>
                            <title>I wait for clickable {"xpath":"//button[contains(text(), 'Continue')]"}, 10</title>
                            <attachments/>
                            <steps/>
                        </step>
                        <step start='1635959288144' status='passed' stop='1635959288154'>
                            <name>I see element {"xpath":"//button[contains(text(), 'Continue')]"}</name>
                            <title>I see element {"xpath":"//button[contains(text(), 'Continue')]"}</title>
                            <attachments/>
                            <steps/>
                        </step>
                        <step start='1635959288259' status='passed' stop='1635959288491'>
                            <name>I click {"xpath":"//button[contains(text(), 'Continue')]"}</name>
                            <title>I click {"xpath":"//button[contains(text(), 'Continue')]"}</title>
                            <attachments/>
                            <steps/>
                        </step>
                    </steps>
                </step>
                <step start='1635959288491' status='passed' stop='1635959288526'>
                    <name>homePage: checkPage </name>
                    <title>homePage: checkPage </title>
                    <attachments/>
                    <steps>
                        <step start='1635959288491' status='passed' stop='1635959288499'>
                            <name>I wait for element {"xpath":"//div[@class = 'app_logo']"}, 5</name>
                            <title>I wait for element {"xpath":"//div[@class = 'app_logo']"}, 5</title>
                            <attachments/>
                            <steps/>
                        </step>
                        <step start='1635959288499' status='passed' stop='1635959288510'>
                            <name>I see element {"xpath":"//div[@class = 'app_logo']"}</name>
                            <title>I see element {"xpath":"//div[@class = 'app_logo']"}</title>
                            <attachments/>
                            <steps/>
                        </step>
                        <step start='1635959288510' status='passed' stop='1635959288516'>
                            <name>I wait for element {"xpath":"//*[contains(text(), 'Products')]"}, 10</name>
                            <title>I wait for element {"xpath":"//*[contains(text(), 'Products')]"}, 10</title>
                            <attachments/>
                            <steps/>
                        </step>
                        <step start='1635959288516' status='passed' stop='1635959288526'>
                            <name>I see element {"xpath":"//*[contains(text(), 'Products')]"}</name>
                            <title>I see element {"xpath":"//*[contains(text(), 'Products')]"}</title>
                            <attachments/>
                            <steps/>
                        </step>
                    </steps>
                </step>
                <step start='1635959288526' status='passed' stop='1635959289281'>
                    <name>homePage: addItemToCart "bolt"</name>
                    <title>homePage: addItemToCart "bolt"</title>
                    <attachments/>
                    <steps>
                        <step start='1635959288526' status='passed' stop='1635959288544'>
                            <name>I wait for clickable {"xpath":"//*[contains(@id, 'add-to-cart') and contains(@id, 'bolt')]"}, 10</name>
                            <title>I wait for clickable {"xpath":"//*[contains(@id, 'add-to-cart') and contains(@id, 'bolt')]"}, 10</title>
                            <attachments/>
                            <steps/>
                        </step>
                        <step start='1635959288544' status='passed' stop='1635959288554'>
                            <name>I see element {"xpath":"//*[contains(@id, 'add-to-cart') and contains(@id, 'bolt')]"}</name>
                            <title>I see element {"xpath":"//*[contains(@id, 'add-to-cart') and contains(@id, 'bolt')]"}</title>
                            <attachments/>
                            <steps/>
                        </step>
                        <step start='1635959288667' status='passed' stop='1635959288903'>
                            <name>I click {"xpath":"//*[contains(@id, 'add-to-cart') and contains(@id, 'bolt')]"}</name>
                            <title>I click {"xpath":"//*[contains(@id, 'add-to-cart') and contains(@id, 'bolt')]"}</title>
                            <attachments/>
                            <steps/>
                        </step>
                        <step start='1635959288903' status='passed' stop='1635959288917'>
                            <name>I see element {"xpath":"//*[contains(@id, 'remove') and contains(@id, 'bolt')]"}</name>
                            <title>I see element {"xpath":"//*[contains(@id, 'remove') and contains(@id, 'bolt')]"}</title>
                            <attachments/>
                            <steps/>
                        </step>
                        <step start='1635959288917' status='passed' stop='1635959288931'>
                            <name>I wait for clickable {"xpath":"//*[@class='shopping_cart_link']"}, 10</name>
                            <title>I wait for clickable {"xpath":"//*[@class='shopping_cart_link']"}, 10</title>
                            <attachments/>
                            <steps/>
                        </step>
                        <step start='1635959289046' status='passed' stop='1635959289280'>
                            <name>I click {"xpath":"//*[@class='shopping_cart_link']"}</name>
                            <title>I click {"xpath":"//*[@class='shopping_cart_link']"}</title>
                            <attachments/>
                            <steps/>
                        </step>
                        <step start='1635959289280' status='passed' stop='1635959289281'>
                            <name>I get data "shoppingItems.json"</name>
                            <title>I get data "shoppingItems.json"</title>
                            <attachments/>
                            <steps/>
                        </step>
                    </steps>
                </step>
                <step start='1635959289281' status='passed' stop='1635959289312'>
                    <name>I grab text from all {"xpath":"//*[@class='inventory_item_name']"}</name>
                    <title>I grab text from all {"xpath":"//*[@class='inventory_item_name']"}</title>
                    <attachments/>
                    <steps/>
                </step>
                <step start='1635959289313' status='passed' stop='1635959289313'>
                    <name>I assert equal "Sauce Labs Bolt T-Shirt", "Sauce Labs Bolt T-Shirt"</name>
                    <title>I assert equal "Sauce Labs Bolt T-Shirt", "Sauce Labs Bolt T-Shirt"</title>
                    <attachments/>
                    <steps/>
                </step>
                <step start='1635959289313' status='passed' stop='1635959289329'>
                    <name>I see text equals "$15.99", {"xpath":"//*[contains(text(), 'Sauce Labs Bolt T-Shirt')]//following::div[@class='inventory_item_price' and text()='15.99']"}</name>
                    <title>I see text equals "$15.99", {"xpath":"//*[contains(text(), 'Sauce Labs Bolt T-Shirt')]//following::div[@class='inventory_item_price' and text()='15.99']"}</title>
                    <attachments/>
                    <steps/>
                </step>
                <step start='1635959289330' status='passed' stop='1635959289704'>
                    <name>cartPage: goToHomePage </name>
                    <title>cartPage: goToHomePage </title>
                    <attachments/>
                    <steps>
                        <step start='1635959289330' status='passed' stop='1635959289346'>
                            <name>I wait for clickable {"xpath":"//button[contains(text(), 'Continue')]"}, 10</name>
                            <title>I wait for clickable {"xpath":"//button[contains(text(), 'Continue')]"}, 10</title>
                            <attachments/>
                            <steps/>
                        </step>
                        <step start='1635959289346' status='passed' stop='1635959289355'>
                            <name>I see element {"xpath":"//button[contains(text(), 'Continue')]"}</name>
                            <title>I see element {"xpath":"//button[contains(text(), 'Continue')]"}</title>
                            <attachments/>
                            <steps/>
                        </step>
                        <step start='1635959289467' status='passed' stop='1635959289704'>
                            <name>I click {"xpath":"//button[contains(text(), 'Continue')]"}</name>
                            <title>I click {"xpath":"//button[contains(text(), 'Continue')]"}</title>
                            <attachments/>
                            <steps/>
                        </step>
                    </steps>
                </step>
                <step start='1635959289704' status='passed' stop='1635959301530'>
                    <name>homePage: checkPage </name>
                    <title>homePage: checkPage </title>
                    <attachments/>
                    <steps>
                        <step start='1635959289704' status='passed' stop='1635959289711'>
                            <name>I wait for element {"xpath":"//div[@class = 'app_logo']"}, 5</name>
                            <title>I wait for element {"xpath":"//div[@class = 'app_logo']"}, 5</title>
                            <attachments/>
                            <steps/>
                        </step>
                        <step start='1635959289711' status='passed' stop='1635959289720'>
                            <name>I see element {"xpath":"//div[@class = 'app_logo']"}</name>
                            <title>I see element {"xpath":"//div[@class = 'app_logo']"}</title>
                            <attachments/>
                            <steps/>
                        </step>
                        <step start='1635959289720' status='passed' stop='1635959289727'>
                            <name>I wait for element {"xpath":"//*[contains(text(), 'Products')]"}, 10</name>
                            <title>I wait for element {"xpath":"//*[contains(text(), 'Products')]"}, 10</title>
                            <attachments/>
                            <steps/>
                        </step>
                        <step start='1635959289727' status='passed' stop='1635959289736'>
                            <name>I see element {"xpath":"//*[contains(text(), 'Products')]"}</name>
                            <title>I see element {"xpath":"//*[contains(text(), 'Products')]"}</title>
                            <attachments/>
                            <steps/>
                        </step>
                    </steps>
                </step>
                <step start='1635959301530' status='passed' stop='1635959428199'>
                    <name>homePage: addItemToCart "onesie"</name>
                    <title>homePage: addItemToCart "onesie"</title>
                    <attachments/>
                    <steps>
                        <step start='1635959301530' status='passed' stop='1635959304598'>
                            <name>I wait for clickable {"xpath":"//*[contains(@id, 'add-to-cart') and contains(@id, 'onesie')]"}, 10</name>
                            <title>I wait for clickable {"xpath":"//*[contains(@id, 'add-to-cart') and contains(@id, 'onesie')]"}, 10</title>
                            <attachments/>
                            <steps/>
                        </step>
                        <step start='1635959304598' status='passed' stop='1635959306950'>
                            <name>I see element {"xpath":"//*[contains(@id, 'add-to-cart') and contains(@id, 'onesie')]"}</name>
                            <title>I see element {"xpath":"//*[contains(@id, 'add-to-cart') and contains(@id, 'onesie')]"}</title>
                            <attachments/>
                            <steps/>
                        </step>
                        <step start='1635959307056' status='passed' stop='1635959312436'>
                            <name>I click {"xpath":"//*[contains(@id, 'add-to-cart') and contains(@id, 'onesie')]"}</name>
                            <title>I click {"xpath":"//*[contains(@id, 'add-to-cart') and contains(@id, 'onesie')]"}</title>
                            <attachments/>
                            <steps/>
                        </step>
                        <step start='1635959312436' status='passed' stop='1635959317286'>
                            <name>I see element {"xpath":"//*[contains(@id, 'remove') and contains(@id, 'onesie')]"}</name>
                            <title>I see element {"xpath":"//*[contains(@id, 'remove') and contains(@id, 'onesie')]"}</title>
                            <attachments/>
                            <steps/>
                        </step>
                        <step start='1635959317286' status='passed' stop='1635959329653'>
                            <name>I wait for clickable {"xpath":"//*[@class='shopping_cart_link']"}, 10</name>
                            <title>I wait for clickable {"xpath":"//*[@class='shopping_cart_link']"}, 10</title>
                            <attachments/>
                            <steps/>
                        </step>
                        <step start='1635959329762' status='passed' stop='1635959335980'>
                            <name>I click {"xpath":"//*[@class='shopping_cart_link']"}</name>
                            <title>I click {"xpath":"//*[@class='shopping_cart_link']"}</title>
                            <attachments/>
                            <steps/>
                        </step>
                        <step start='1635959335980' status='passed' stop='1635959428199'>
                            <name>I get data "shoppingItems.json"</name>
                            <title>I get data "shoppingItems.json"</title>
                            <attachments/>
                            <steps/>
                        </step>
                    </steps>
                </step>
                <step start='1635959428199' status='passed' stop='1635959438180'>
                    <name>I grab text from all {"xpath":"//*[@class='inventory_item_name']"}</name>
                    <title>I grab text from all {"xpath":"//*[@class='inventory_item_name']"}</title>
                    <attachments/>
                    <steps/>
                </step>
            </steps>
            <attachments>
                <attachment title='Last Seen Screenshot' source='7dab237d-0238-4659-b1c7-7ef7003a376e-attachment.png' type='image/png' size='72408'/>
            </attachments>
            <failure>
                <message>Cannot read properties of undefined (reading 'name')</message>
                <stack-trace>TypeError: Cannot read properties of undefined (reading 'name')
                    at Object.validateItemAddedToCart (C:\Users\RAT\Framework\UI\pages\cartPage.js:64:44)
                    at processTicksAndRejections (node:internal/process/task_queues:96:5)
                    at async Object.addItemToCart (C:\Users\RAT\Framework\UI\pages\homePage.js:70:9)
                    at async Test.&lt;anonymous> (C:\Users\RAT\Framework\UI\tests\purchaseItems_test.js:23:5)</stack-trace>
            </failure>
        </test-case>
    </test-cases>
</ns2:test-suite>