<?xml version='1.0'?>
<ns2:test-suite xmlns:ns2='urn:model.allure.qatools.yandex.ru' start='1635873241061' stop='1635873253367'>
    <name>Validate Login Page allows successful Login:</name>
    <title>Validate Login Page allows successful Login:</title>
    <test-cases>
        <test-case start='1635873249054' status='passed' stop='1635873251913'>
            <name>User logs into website successfully and logs out</name>
            <title>User logs into website successfully and logs out</title>
            <labels/>
            <parameters/>
            <steps>
                <step start='1635873249063' status='passed' stop='1635873249064'>
                    <name>loginPage: roleLogin "standardUser"</name>
                    <title>loginPage: roleLogin "standardUser"</title>
                    <attachments/>
                    <steps>
                        <step start='1635873249063' status='passed' stop='1635873249064'>
                            <name>I get data "loginDetails.json"</name>
                            <title>I get data "loginDetails.json"</title>
                            <attachments/>
                            <steps/>
                        </step>
                    </steps>
                </step>
                <step start='1635873249065' status='passed' stop='1635873249323'>
                    <name>I am on page "https://www.saucedemo.com/"</name>
                    <title>I am on page "https://www.saucedemo.com/"</title>
                    <attachments/>
                    <steps/>
                </step>
                <step start='1635873249323' status='passed' stop='1635873249331'>
                    <name>I see in current url "https://www.saucedemo.com/"</name>
                    <title>I see in current url "https://www.saucedemo.com/"</title>
                    <attachments/>
                    <steps/>
                </step>
                <step start='1635873249331' status='passed' stop='1635873249519'>
                    <name>loginPage: checkPage </name>
                    <title>loginPage: checkPage </title>
                    <attachments/>
                    <steps>
                        <step start='1635873249331' status='passed' stop='1635873249345'>
                            <name>I wait for element {"xpath":"//div[@class = 'login_logo']"}, 10</name>
                            <title>I wait for element {"xpath":"//div[@class = 'login_logo']"}, 10</title>
                            <attachments/>
                            <steps/>
                        </step>
                        <step start='1635873249345' status='passed' stop='1635873249362'>
                            <name>I see element {"xpath":"//div[@class = 'login_logo']"}</name>
                            <title>I see element {"xpath":"//div[@class = 'login_logo']"}</title>
                            <attachments/>
                            <steps/>
                        </step>
                        <step start='1635873249362' status='passed' stop='1635873249372'>
                            <name>I wait for element {"xpath":"//*[@id = 'login-button']"}, 10</name>
                            <title>I wait for element {"xpath":"//*[@id = 'login-button']"}, 10</title>
                            <attachments/>
                            <steps/>
                        </step>
                        <step start='1635873249372' status='passed' stop='1635873249395'>
                            <name>I wait for clickable {"xpath":"//*[@id = 'login-button']"}, 10</name>
                            <title>I wait for clickable {"xpath":"//*[@id = 'login-button']"}, 10</title>
                            <attachments/>
                            <steps/>
                        </step>
                        <step start='1635873249395' status='passed' stop='1635873249410'>
                            <name>I see element {"xpath":"//*[@id = 'login-button']"}</name>
                            <title>I see element {"xpath":"//*[@id = 'login-button']"}</title>
                            <attachments/>
                            <steps/>
                        </step>
                        <step start='1635873249411' status='passed' stop='1635873249413'>
                            <name>I take screenshot "loginPageLoaded.png"</name>
                            <title>I take screenshot "loginPageLoaded.png"</title>
                            <attachments/>
                            <steps/>
                        </step>
                    </steps>
                </step>
                <step start='1635873249519' status='passed' stop='1635873249798'>
                    <name>I fill field {"xpath":"//input[@id = 'user-name']"}, "standard_user"</name>
                    <title>I fill field {"xpath":"//input[@id = 'user-name']"}, "standard_user"</title>
                    <attachments/>
                    <steps/>
                </step>
                <step start='1635873249908' status='passed' stop='1635873250174'>
                    <name>I fill field {"xpath":"//input[@id = 'password']"}, "secret_sauce"</name>
                    <title>I fill field {"xpath":"//input[@id = 'password']"}, "secret_sauce"</title>
                    <attachments/>
                    <steps/>
                </step>
                <step start='1635873250174' status='passed' stop='1635873250176'>
                    <name>I take screenshot "loginPageFilled.png"</name>
                    <title>I take screenshot "loginPageFilled.png"</title>
                    <attachments/>
                    <steps/>
                </step>
                <step start='1635873250286' status='passed' stop='1635873250556'>
                    <name>I click {"xpath":"//*[@id = 'login-button']"}</name>
                    <title>I click {"xpath":"//*[@id = 'login-button']"}</title>
                    <attachments/>
                    <steps/>
                </step>
                <step start='1635873250556' status='passed' stop='1635873250602'>
                    <name>homePage: checkPage </name>
                    <title>homePage: checkPage </title>
                    <attachments/>
                    <steps>
                        <step start='1635873250556' status='passed' stop='1635873250567'>
                            <name>I wait for element {"xpath":"//div[@class = 'app_logo']"}, 10</name>
                            <title>I wait for element {"xpath":"//div[@class = 'app_logo']"}, 10</title>
                            <attachments/>
                            <steps/>
                        </step>
                        <step start='1635873250567' status='passed' stop='1635873250580'>
                            <name>I see element {"xpath":"//div[@class = 'app_logo']"}</name>
                            <title>I see element {"xpath":"//div[@class = 'app_logo']"}</title>
                            <attachments/>
                            <steps/>
                        </step>
                        <step start='1635873250580' status='passed' stop='1635873250590'>
                            <name>I wait for element {"xpath":"//*[contains(text(), 'Products')]"}, 10</name>
                            <title>I wait for element {"xpath":"//*[contains(text(), 'Products')]"}, 10</title>
                            <attachments/>
                            <steps/>
                        </step>
                        <step start='1635873250590' status='passed' stop='1635873250602'>
                            <name>I see element {"xpath":"//*[contains(text(), 'Products')]"}</name>
                            <title>I see element {"xpath":"//*[contains(text(), 'Products')]"}</title>
                            <attachments/>
                            <steps/>
                        </step>
                    </steps>
                </step>
                <step start='1635873250602' status='passed' stop='1635873251856'>
                    <name>homePage: logOut </name>
                    <title>homePage: logOut </title>
                    <attachments/>
                    <steps>
                        <step start='1635873250602' status='passed' stop='1635873251107'>
                            <name>I dont see element {"xpath":"//a[@id='logout_sidebar_link']"}</name>
                            <title>I dont see element {"xpath":"//a[@id='logout_sidebar_link']"}</title>
                            <attachments/>
                            <steps/>
                        </step>
                        <step start='1635873251107' status='passed' stop='1635873251116'>
                            <name>I wait for element {"xpath":"//button[contains(@id, 'menu-btn')]"}, 10</name>
                            <title>I wait for element {"xpath":"//button[contains(@id, 'menu-btn')]"}, 10</title>
                            <attachments/>
                            <steps/>
                        </step>
                        <step start='1635873251116' status='passed' stop='1635873251133'>
                            <name>I wait for clickable {"xpath":"//button[contains(@id, 'menu-btn')]"}, 5</name>
                            <title>I wait for clickable {"xpath":"//button[contains(@id, 'menu-btn')]"}, 5</title>
                            <attachments/>
                            <steps/>
                        </step>
                        <step start='1635873251133' status='passed' stop='1635873251144'>
                            <name>I see element {"xpath":"//button[contains(@id, 'menu-btn')]"}</name>
                            <title>I see element {"xpath":"//button[contains(@id, 'menu-btn')]"}</title>
                            <attachments/>
                            <steps/>
                        </step>
                        <step start='1635873251252' status='passed' stop='1635873251488'>
                            <name>I click {"xpath":"//button[contains(@id, 'menu-btn')]"}</name>
                            <title>I click {"xpath":"//button[contains(@id, 'menu-btn')]"}</title>
                            <attachments/>
                            <steps/>
                        </step>
                        <step start='1635873251488' status='passed' stop='1635873251496'>
                            <name>I wait for element {"xpath":"//a[@id='logout_sidebar_link']"}, 10</name>
                            <title>I wait for element {"xpath":"//a[@id='logout_sidebar_link']"}, 10</title>
                            <attachments/>
                            <steps/>
                        </step>
                        <step start='1635873251496' status='passed' stop='1635873251507'>
                            <name>I see element {"xpath":"//a[@id='logout_sidebar_link']"}</name>
                            <title>I see element {"xpath":"//a[@id='logout_sidebar_link']"}</title>
                            <attachments/>
                            <steps/>
                        </step>
                        <step start='1635873251616' status='passed' stop='1635873251856'>
                            <name>I click {"xpath":"//a[@id='logout_sidebar_link']"}</name>
                            <title>I click {"xpath":"//a[@id='logout_sidebar_link']"}</title>
                            <attachments/>
                            <steps/>
                        </step>
                    </steps>
                </step>
                <step start='1635873251856' status='passed' stop='1635873251913'>
                    <name>loginPage: checkPage </name>
                    <title>loginPage: checkPage </title>
                    <attachments/>
                    <steps>
                        <step start='1635873251856' status='passed' stop='1635873251864'>
                            <name>I wait for element {"xpath":"//div[@class = 'login_logo']"}, 10</name>
                            <title>I wait for element {"xpath":"//div[@class = 'login_logo']"}, 10</title>
                            <attachments/>
                            <steps/>
                        </step>
                        <step start='1635873251864' status='passed' stop='1635873251876'>
                            <name>I see element {"xpath":"//div[@class = 'login_logo']"}</name>
                            <title>I see element {"xpath":"//div[@class = 'login_logo']"}</title>
                            <attachments/>
                            <steps/>
                        </step>
                        <step start='1635873251876' status='passed' stop='1635873251882'>
                            <name>I wait for element {"xpath":"//*[@id = 'login-button']"}, 10</name>
                            <title>I wait for element {"xpath":"//*[@id = 'login-button']"}, 10</title>
                            <attachments/>
                            <steps/>
                        </step>
                        <step start='1635873251882' status='passed' stop='1635873251900'>
                            <name>I wait for clickable {"xpath":"//*[@id = 'login-button']"}, 10</name>
                            <title>I wait for clickable {"xpath":"//*[@id = 'login-button']"}, 10</title>
                            <attachments/>
                            <steps/>
                        </step>
                        <step start='1635873251900' status='passed' stop='1635873251911'>
                            <name>I see element {"xpath":"//*[@id = 'login-button']"}</name>
                            <title>I see element {"xpath":"//*[@id = 'login-button']"}</title>
                            <attachments/>
                            <steps/>
                        </step>
                        <step start='1635873251911' status='passed' stop='1635873251912'>
                            <name>I take screenshot "loginPageLoaded.png"</name>
                            <title>I take screenshot "loginPageLoaded.png"</title>
                            <attachments/>
                            <steps/>
                        </step>
                    </steps>
                </step>
            </steps>
            <attachments/>
        </test-case>
        <test-case start='1635873251914' status='passed' stop='1635873253366'>
            <name>User attempts to login as locked out user</name>
            <title>User attempts to login as locked out user</title>
            <labels/>
            <parameters/>
            <steps>
                <step start='1635873251915' status='passed' stop='1635873251916'>
                    <name>loginPage: roleLogin "lockedoutuser"</name>
                    <title>loginPage: roleLogin "lockedoutuser"</title>
                    <attachments/>
                    <steps>
                        <step start='1635873251915' status='passed' stop='1635873251916'>
                            <name>I get data "loginDetails.json"</name>
                            <title>I get data "loginDetails.json"</title>
                            <attachments/>
                            <steps/>
                        </step>
                    </steps>
                </step>
                <step start='1635873251916' status='passed' stop='1635873252026'>
                    <name>I am on page "https://www.saucedemo.com/"</name>
                    <title>I am on page "https://www.saucedemo.com/"</title>
                    <attachments/>
                    <steps/>
                </step>
                <step start='1635873252026' status='passed' stop='1635873252032'>
                    <name>I see in current url "https://www.saucedemo.com/"</name>
                    <title>I see in current url "https://www.saucedemo.com/"</title>
                    <attachments/>
                    <steps/>
                </step>
                <step start='1635873252032' status='passed' stop='1635873252202'>
                    <name>loginPage: checkPage </name>
                    <title>loginPage: checkPage </title>
                    <attachments/>
                    <steps>
                        <step start='1635873252032' status='passed' stop='1635873252039'>
                            <name>I wait for element {"xpath":"//div[@class = 'login_logo']"}, 10</name>
                            <title>I wait for element {"xpath":"//div[@class = 'login_logo']"}, 10</title>
                            <attachments/>
                            <steps/>
                        </step>
                        <step start='1635873252039' status='passed' stop='1635873252052'>
                            <name>I see element {"xpath":"//div[@class = 'login_logo']"}</name>
                            <title>I see element {"xpath":"//div[@class = 'login_logo']"}</title>
                            <attachments/>
                            <steps/>
                        </step>
                        <step start='1635873252052' status='passed' stop='1635873252059'>
                            <name>I wait for element {"xpath":"//*[@id = 'login-button']"}, 10</name>
                            <title>I wait for element {"xpath":"//*[@id = 'login-button']"}, 10</title>
                            <attachments/>
                            <steps/>
                        </step>
                        <step start='1635873252059' status='passed' stop='1635873252076'>
                            <name>I wait for clickable {"xpath":"//*[@id = 'login-button']"}, 10</name>
                            <title>I wait for clickable {"xpath":"//*[@id = 'login-button']"}, 10</title>
                            <attachments/>
                            <steps/>
                        </step>
                        <step start='1635873252076' status='passed' stop='1635873252086'>
                            <name>I see element {"xpath":"//*[@id = 'login-button']"}</name>
                            <title>I see element {"xpath":"//*[@id = 'login-button']"}</title>
                            <attachments/>
                            <steps/>
                        </step>
                        <step start='1635873252086' status='passed' stop='1635873252087'>
                            <name>I take screenshot "loginPageLoaded.png"</name>
                            <title>I take screenshot "loginPageLoaded.png"</title>
                            <attachments/>
                            <steps/>
                        </step>
                    </steps>
                </step>
                <step start='1635873252202' status='passed' stop='1635873252469'>
                    <name>I fill field {"xpath":"//input[@id = 'user-name']"}, "locked_out_user"</name>
                    <title>I fill field {"xpath":"//input[@id = 'user-name']"}, "locked_out_user"</title>
                    <attachments/>
                    <steps/>
                </step>
                <step start='1635873252581' status='passed' stop='1635873252832'>
                    <name>I fill field {"xpath":"//input[@id = 'password']"}, "secret_sauce"</name>
                    <title>I fill field {"xpath":"//input[@id = 'password']"}, "secret_sauce"</title>
                    <attachments/>
                    <steps/>
                </step>
                <step start='1635873252832' status='passed' stop='1635873252833'>
                    <name>I take screenshot "loginPageFilled.png"</name>
                    <title>I take screenshot "loginPageFilled.png"</title>
                    <attachments/>
                    <steps/>
                </step>
                <step start='1635873252943' status='passed' stop='1635873253179'>
                    <name>I click {"xpath":"//*[@id = 'login-button']"}</name>
                    <title>I click {"xpath":"//*[@id = 'login-button']"}</title>
                    <attachments/>
                    <steps/>
                </step>
                <step start='1635873253179' status='passed' stop='1635873253366'>
                    <name>loginPage: checkError </name>
                    <title>loginPage: checkError </title>
                    <attachments/>
                    <steps>
                        <step start='1635873253179' status='passed' stop='1635873253189'>
                            <name>I wait for element {"xpath":"//h3[@data-test = 'error']"}, 10</name>
                            <title>I wait for element {"xpath":"//h3[@data-test = 'error']"}, 10</title>
                            <attachments/>
                            <steps/>
                        </step>
                        <step start='1635873253189' status='passed' stop='1635873253200'>
                            <name>I see element {"xpath":"//h3[@data-test = 'error']"}</name>
                            <title>I see element {"xpath":"//h3[@data-test = 'error']"}</title>
                            <attachments/>
                            <steps/>
                        </step>
                        <step start='1635873253200' status='passed' stop='1635873253366'>
                            <name>I take screenshot "LoginError.png"</name>
                            <title>I take screenshot "LoginError.png"</title>
                            <attachments/>
                            <steps/>
                        </step>
                    </steps>
                </step>
            </steps>
            <attachments/>
        </test-case>
    </test-cases>
</ns2:test-suite>