<?xml version='1.0'?>
<ns2:test-suite xmlns:ns2='urn:model.allure.qatools.yandex.ru' start='1635958828124' stop='1635958839143'>
    <name>User purchases items from SauceDemo.com:</name>
    <title>User purchases items from SauceDemo.com:</title>
    <test-cases>
        <test-case start='1635958836314' status='passed' stop='1635958837830'>
            <name>User logs into website successfully</name>
            <title>User logs into website successfully</title>
            <labels/>
            <parameters/>
            <steps>
                <step start='1635958836323' status='passed' stop='1635958836325'>
                    <name>loginPage: roleLogin "standardUser"</name>
                    <title>loginPage: roleLogin "standardUser"</title>
                    <attachments/>
                    <steps>
                        <step start='1635958836323' status='passed' stop='1635958836324'>
                            <name>I get data "loginDetails.json"</name>
                            <title>I get data "loginDetails.json"</title>
                            <attachments/>
                            <steps/>
                        </step>
                    </steps>
                </step>
                <step start='1635958836325' status='passed' stop='1635958836578'>
                    <name>I am on page "https://www.saucedemo.com/"</name>
                    <title>I am on page "https://www.saucedemo.com/"</title>
                    <attachments/>
                    <steps/>
                </step>
                <step start='1635958836578' status='passed' stop='1635958836587'>
                    <name>I see in current url "https://www.saucedemo.com/"</name>
                    <title>I see in current url "https://www.saucedemo.com/"</title>
                    <attachments/>
                    <steps/>
                </step>
                <step start='1635958836587' status='passed' stop='1635958836775'>
                    <name>loginPage: checkPage </name>
                    <title>loginPage: checkPage </title>
                    <attachments/>
                    <steps>
                        <step start='1635958836587' status='passed' stop='1635958836600'>
                            <name>I wait for element {"xpath":"//div[@class = 'login_logo']"}, 10</name>
                            <title>I wait for element {"xpath":"//div[@class = 'login_logo']"}, 10</title>
                            <attachments/>
                            <steps/>
                        </step>
                        <step start='1635958836600' status='passed' stop='1635958836617'>
                            <name>I see element {"xpath":"//div[@class = 'login_logo']"}</name>
                            <title>I see element {"xpath":"//div[@class = 'login_logo']"}</title>
                            <attachments/>
                            <steps/>
                        </step>
                        <step start='1635958836617' status='passed' stop='1635958836626'>
                            <name>I wait for element {"xpath":"//*[@id = 'login-button']"}, 10</name>
                            <title>I wait for element {"xpath":"//*[@id = 'login-button']"}, 10</title>
                            <attachments/>
                            <steps/>
                        </step>
                        <step start='1635958836626' status='passed' stop='1635958836650'>
                            <name>I wait for clickable {"xpath":"//*[@id = 'login-button']"}, 10</name>
                            <title>I wait for clickable {"xpath":"//*[@id = 'login-button']"}, 10</title>
                            <attachments/>
                            <steps/>
                        </step>
                        <step start='1635958836650' status='passed' stop='1635958836663'>
                            <name>I see element {"xpath":"//*[@id = 'login-button']"}</name>
                            <title>I see element {"xpath":"//*[@id = 'login-button']"}</title>
                            <attachments/>
                            <steps/>
                        </step>
                        <step start='1635958836664' status='passed' stop='1635958836666'>
                            <name>I take screenshot "loginPageLoaded.png"</name>
                            <title>I take screenshot "loginPageLoaded.png"</title>
                            <attachments/>
                            <steps/>
                        </step>
                    </steps>
                </step>
                <step start='1635958836775' status='passed' stop='1635958837053'>
                    <name>I fill field {"xpath":"//input[@id = 'user-name']"}, "standard_user"</name>
                    <title>I fill field {"xpath":"//input[@id = 'user-name']"}, "standard_user"</title>
                    <attachments/>
                    <steps/>
                </step>
                <step start='1635958837154' status='passed' stop='1635958837413'>
                    <name>I fill field {"xpath":"//input[@id = 'password']"}, "secret_sauce"</name>
                    <title>I fill field {"xpath":"//input[@id = 'password']"}, "secret_sauce"</title>
                    <attachments/>
                    <steps/>
                </step>
                <step start='1635958837413' status='passed' stop='1635958837415'>
                    <name>I take screenshot "loginPageFilled.png"</name>
                    <title>I take screenshot "loginPageFilled.png"</title>
                    <attachments/>
                    <steps/>
                </step>
                <step start='1635958837515' status='passed' stop='1635958837778'>
                    <name>I click {"xpath":"//*[@id = 'login-button']"}</name>
                    <title>I click {"xpath":"//*[@id = 'login-button']"}</title>
                    <attachments/>
                    <steps/>
                </step>
                <step start='1635958837778' status='passed' stop='1635958837830'>
                    <name>homePage: checkPage </name>
                    <title>homePage: checkPage </title>
                    <attachments/>
                    <steps>
                        <step start='1635958837778' status='passed' stop='1635958837791'>
                            <name>I wait for element {"xpath":"//div[@class = 'app_logo']"}, 5</name>
                            <title>I wait for element {"xpath":"//div[@class = 'app_logo']"}, 5</title>
                            <attachments/>
                            <steps/>
                        </step>
                        <step start='1635958837792' status='passed' stop='1635958837807'>
                            <name>I see element {"xpath":"//div[@class = 'app_logo']"}</name>
                            <title>I see element {"xpath":"//div[@class = 'app_logo']"}</title>
                            <attachments/>
                            <steps/>
                        </step>
                        <step start='1635958837807' status='passed' stop='1635958837818'>
                            <name>I wait for element {"xpath":"//*[contains(text(), 'Products')]"}, 10</name>
                            <title>I wait for element {"xpath":"//*[contains(text(), 'Products')]"}, 10</title>
                            <attachments/>
                            <steps/>
                        </step>
                        <step start='1635958837818' status='passed' stop='1635958837830'>
                            <name>I see element {"xpath":"//*[contains(text(), 'Products')]"}</name>
                            <title>I see element {"xpath":"//*[contains(text(), 'Products')]"}</title>
                            <attachments/>
                            <steps/>
                        </step>
                    </steps>
                </step>
            </steps>
            <attachments/>
        </test-case>
        <test-case start='1635958837831' status='failed' stop='1635958838974'>
            <name>User adds items to their cart that they want to purchase</name>
            <title>User adds items to their cart that they want to purchase</title>
            <labels/>
            <parameters/>
            <steps>
                <step start='1635958837834' status='passed' stop='1635958838590'>
                    <name>homePage: addItemToCart "backpack"</name>
                    <title>homePage: addItemToCart "backpack"</title>
                    <attachments/>
                    <steps>
                        <step start='1635958837834' status='passed' stop='1635958837853'>
                            <name>I wait for clickable {"xpath":"//*[contains(@id, 'add-to-cart') and contains(@id, 'backpack')]"}, 10</name>
                            <title>I wait for clickable {"xpath":"//*[contains(@id, 'add-to-cart') and contains(@id, 'backpack')]"}, 10</title>
                            <attachments/>
                            <steps/>
                        </step>
                        <step start='1635958837853' status='passed' stop='1635958837864'>
                            <name>I see element {"xpath":"//*[contains(@id, 'add-to-cart') and contains(@id, 'backpack')]"}</name>
                            <title>I see element {"xpath":"//*[contains(@id, 'add-to-cart') and contains(@id, 'backpack')]"}</title>
                            <attachments/>
                            <steps/>
                        </step>
                        <step start='1635958837967' status='passed' stop='1635958838205'>
                            <name>I click {"xpath":"//*[contains(@id, 'add-to-cart') and contains(@id, 'backpack')]"}</name>
                            <title>I click {"xpath":"//*[contains(@id, 'add-to-cart') and contains(@id, 'backpack')]"}</title>
                            <attachments/>
                            <steps/>
                        </step>
                        <step start='1635958838205' status='passed' stop='1635958838224'>
                            <name>I see element {"xpath":"//*[contains(@id, 'remove') and contains(@id, 'backpack')]"}</name>
                            <title>I see element {"xpath":"//*[contains(@id, 'remove') and contains(@id, 'backpack')]"}</title>
                            <attachments/>
                            <steps/>
                        </step>
                        <step start='1635958838225' status='passed' stop='1635958838249'>
                            <name>I wait for clickable {"xpath":"//*[@class='shopping_cart_link']"}, 10</name>
                            <title>I wait for clickable {"xpath":"//*[@class='shopping_cart_link']"}, 10</title>
                            <attachments/>
                            <steps/>
                        </step>
                        <step start='1635958838349' status='passed' stop='1635958838589'>
                            <name>I click {"xpath":"//*[@class='shopping_cart_link']"}</name>
                            <title>I click {"xpath":"//*[@class='shopping_cart_link']"}</title>
                            <attachments/>
                            <steps/>
                        </step>
                        <step start='1635958838589' status='passed' stop='1635958838590'>
                            <name>I get data "shoppingItems.json"</name>
                            <title>I get data "shoppingItems.json"</title>
                            <attachments/>
                            <steps/>
                        </step>
                    </steps>
                </step>
                <step start='1635958838590' status='passed' stop='1635958838611'>
                    <name>I grab text from all {"xpath":"//*[@class='inventory_item_name']"}</name>
                    <title>I grab text from all {"xpath":"//*[@class='inventory_item_name']"}</title>
                    <attachments/>
                    <steps/>
                </step>
                <step start='1635958838612' status='passed' stop='1635958838612'>
                    <name>I assert equal "Sauce Labs Backpack", "Sauce Labs Backpack"</name>
                    <title>I assert equal "Sauce Labs Backpack", "Sauce Labs Backpack"</title>
                    <attachments/>
                    <steps/>
                </step>
                <step start='1635958838613' status='passed' stop='1635958838633'>
                    <name>I see text equals "$29.99", {"xpath":"//*[contains(text(), 'Sauce Labs Backpack')]//following::div[@class='inventory_item_price' and text()='29.99']"}</name>
                    <title>I see text equals "$29.99", {"xpath":"//*[contains(text(), 'Sauce Labs Backpack')]//following::div[@class='inventory_item_price' and text()='29.99']"}</title>
                    <attachments/>
                    <steps/>
                </step>
                <step start='1635958838733' status='failed' stop='1635958838974'>
                    <name>cartPage: goToHomePage </name>
                    <title>cartPage: goToHomePage </title>
                    <attachments/>
                    <steps>
                        <step start='1635958838733' status='passed' stop='1635958838973'>
                            <name>I click {"xpath":"//button[contains(text(), 'Continue')]"}</name>
                            <title>I click {"xpath":"//button[contains(text(), 'Continue')]"}</title>
                            <attachments/>
                            <steps/>
                        </step>
                    </steps>
                </step>
            </steps>
            <attachments>
                <attachment title='Last Seen Screenshot' source='5236714c-d8c8-45be-adbd-409ae3674e76-attachment.png' type='image/png' size='542382'/>
            </attachments>
            <failure>
                <message>homePage.checkPage is not a function</message>
                <stack-trace>TypeError: homePage.checkPage is not a function
                    at Object.goToHomePage (C:\Users\RAT\Framework\UI\pages\cartPage.js:78:24)
                    at MetaStep.run (C:\Users\RAT\Framework\UI\node_modules\codeceptjs\lib\step.js:218:19)
                    at Test.&lt;anonymous> (C:\Users\RAT\Framework\UI\tests\purchaseItems_test.js:11:20)
                    at processTicksAndRejections (node:internal/process/task_queues:96:5)</stack-trace>
            </failure>
        </test-case>
    </test-cases>
</ns2:test-suite>