<?xml version='1.0'?>
<ns2:test-suite xmlns:ns2='urn:model.allure.qatools.yandex.ru' start='1635872590386' stop='1635872602671'>
    <name>Validate Login Page allows successful Login:</name>
    <title>Validate Login Page allows successful Login:</title>
    <test-cases>
        <test-case start='1635872599414' status='passed' stop='1635872602670'>
            <name>User logs into website successfully and logs out</name>
            <title>User logs into website successfully and logs out</title>
            <labels/>
            <parameters/>
            <steps>
                <step start='1635872599422' status='passed' stop='1635872599424'>
                    <name>loginPage: roleLogin "standardUser"</name>
                    <title>loginPage: roleLogin "standardUser"</title>
                    <attachments/>
                    <steps>
                        <step start='1635872599423' status='passed' stop='1635872599424'>
                            <name>I get data "loginDetails.json"</name>
                            <title>I get data "loginDetails.json"</title>
                            <attachments/>
                            <steps/>
                        </step>
                    </steps>
                </step>
                <step start='1635872599425' status='passed' stop='1635872599824'>
                    <name>I am on page "https://www.saucedemo.com/"</name>
                    <title>I am on page "https://www.saucedemo.com/"</title>
                    <attachments/>
                    <steps/>
                </step>
                <step start='1635872599824' status='passed' stop='1635872599832'>
                    <name>I see in current url "https://www.saucedemo.com/"</name>
                    <title>I see in current url "https://www.saucedemo.com/"</title>
                    <attachments/>
                    <steps/>
                </step>
                <step start='1635872599832' status='passed' stop='1635872600186'>
                    <name>loginPage: checkPage </name>
                    <title>loginPage: checkPage </title>
                    <attachments/>
                    <steps>
                        <step start='1635872599832' status='passed' stop='1635872599846'>
                            <name>I wait for element {"xpath":"//div[@class = 'login_logo']"}, 10</name>
                            <title>I wait for element {"xpath":"//div[@class = 'login_logo']"}, 10</title>
                            <attachments/>
                            <steps/>
                        </step>
                        <step start='1635872599847' status='passed' stop='1635872599866'>
                            <name>I see element {"xpath":"//div[@class = 'login_logo']"}</name>
                            <title>I see element {"xpath":"//div[@class = 'login_logo']"}</title>
                            <attachments/>
                            <steps/>
                        </step>
                        <step start='1635872599866' status='passed' stop='1635872599879'>
                            <name>I wait for element {"xpath":"//*[@id = 'login-button']"}, 10</name>
                            <title>I wait for element {"xpath":"//*[@id = 'login-button']"}, 10</title>
                            <attachments/>
                            <steps/>
                        </step>
                        <step start='1635872599879' status='passed' stop='1635872599903'>
                            <name>I wait for clickable {"xpath":"//*[@id = 'login-button']"}, 10</name>
                            <title>I wait for clickable {"xpath":"//*[@id = 'login-button']"}, 10</title>
                            <attachments/>
                            <steps/>
                        </step>
                        <step start='1635872599903' status='passed' stop='1635872599919'>
                            <name>I see element {"xpath":"//*[@id = 'login-button']"}</name>
                            <title>I see element {"xpath":"//*[@id = 'login-button']"}</title>
                            <attachments/>
                            <steps/>
                        </step>
                        <step start='1635872599919' status='passed' stop='1635872600076'>
                            <name>I take screenshot "loginPageLoaded.png"</name>
                            <title>I take screenshot "loginPageLoaded.png"</title>
                            <attachments/>
                            <steps/>
                        </step>
                    </steps>
                </step>
                <step start='1635872600186' status='passed' stop='1635872600452'>
                    <name>I fill field {"xpath":"//input[@id = 'user-name']"}, "standard_user"</name>
                    <title>I fill field {"xpath":"//input[@id = 'user-name']"}, "standard_user"</title>
                    <attachments/>
                    <steps/>
                </step>
                <step start='1635872600561' status='passed' stop='1635872600829'>
                    <name>I fill field {"xpath":"//input[@id = 'password']"}, "secret_sauce"</name>
                    <title>I fill field {"xpath":"//input[@id = 'password']"}, "secret_sauce"</title>
                    <attachments/>
                    <steps/>
                </step>
                <step start='1635872600829' status='passed' stop='1635872600989'>
                    <name>I take screenshot "loginPageFilled.png"</name>
                    <title>I take screenshot "loginPageFilled.png"</title>
                    <attachments/>
                    <steps/>
                </step>
                <step start='1635872601100' status='passed' stop='1635872601370'>
                    <name>I click {"xpath":"//*[@id = 'login-button']"}</name>
                    <title>I click {"xpath":"//*[@id = 'login-button']"}</title>
                    <attachments/>
                    <steps/>
                </step>
                <step start='1635872601370' status='passed' stop='1635872601423'>
                    <name>homePage: checkPage </name>
                    <title>homePage: checkPage </title>
                    <attachments/>
                    <steps>
                        <step start='1635872601370' status='passed' stop='1635872601382'>
                            <name>I wait for element {"xpath":"//div[@class = 'app_logo']"}, 10</name>
                            <title>I wait for element {"xpath":"//div[@class = 'app_logo']"}, 10</title>
                            <attachments/>
                            <steps/>
                        </step>
                        <step start='1635872601382' status='passed' stop='1635872601396'>
                            <name>I see element {"xpath":"//div[@class = 'app_logo']"}</name>
                            <title>I see element {"xpath":"//div[@class = 'app_logo']"}</title>
                            <attachments/>
                            <steps/>
                        </step>
                        <step start='1635872601396' status='passed' stop='1635872601407'>
                            <name>I wait for element {"xpath":"//*[contains(text(), 'Products')]"}, 10</name>
                            <title>I wait for element {"xpath":"//*[contains(text(), 'Products')]"}, 10</title>
                            <attachments/>
                            <steps/>
                        </step>
                        <step start='1635872601407' status='passed' stop='1635872601423'>
                            <name>I see element {"xpath":"//*[contains(text(), 'Products')]"}</name>
                            <title>I see element {"xpath":"//*[contains(text(), 'Products')]"}</title>
                            <attachments/>
                            <steps/>
                        </step>
                    </steps>
                </step>
                <step start='1635872601423' status='passed' stop='1635872602670'>
                    <name>homePage: logOut </name>
                    <title>homePage: logOut </title>
                    <attachments/>
                    <steps>
                        <step start='1635872601423' status='passed' stop='1635872601934'>
                            <name>I dont see element {"xpath":"//a[@id='logout_sidebar_link']"}</name>
                            <title>I dont see element {"xpath":"//a[@id='logout_sidebar_link']"}</title>
                            <attachments/>
                            <steps/>
                        </step>
                        <step start='1635872601934' status='passed' stop='1635872601943'>
                            <name>I wait for element {"xpath":"//button[contains(@id, 'menu-btn')]"}, 10</name>
                            <title>I wait for element {"xpath":"//button[contains(@id, 'menu-btn')]"}, 10</title>
                            <attachments/>
                            <steps/>
                        </step>
                        <step start='1635872601943' status='passed' stop='1635872601963'>
                            <name>I wait for clickable {"xpath":"//button[contains(@id, 'menu-btn')]"}, 5</name>
                            <title>I wait for clickable {"xpath":"//button[contains(@id, 'menu-btn')]"}, 5</title>
                            <attachments/>
                            <steps/>
                        </step>
                        <step start='1635872601963' status='passed' stop='1635872601975'>
                            <name>I see element {"xpath":"//button[contains(@id, 'menu-btn')]"}</name>
                            <title>I see element {"xpath":"//button[contains(@id, 'menu-btn')]"}</title>
                            <attachments/>
                            <steps/>
                        </step>
                        <step start='1635872602078' status='passed' stop='1635872602312'>
                            <name>I click {"xpath":"//button[contains(@id, 'menu-btn')]"}</name>
                            <title>I click {"xpath":"//button[contains(@id, 'menu-btn')]"}</title>
                            <attachments/>
                            <steps/>
                        </step>
                        <step start='1635872602312' status='passed' stop='1635872602320'>
                            <name>I wait for element {"xpath":"//a[@id='logout_sidebar_link']"}, 10</name>
                            <title>I wait for element {"xpath":"//a[@id='logout_sidebar_link']"}, 10</title>
                            <attachments/>
                            <steps/>
                        </step>
                        <step start='1635872602320' status='passed' stop='1635872602334'>
                            <name>I see element {"xpath":"//a[@id='logout_sidebar_link']"}</name>
                            <title>I see element {"xpath":"//a[@id='logout_sidebar_link']"}</title>
                            <attachments/>
                            <steps/>
                        </step>
                        <step start='1635872602436' status='passed' stop='1635872602670'>
                            <name>I click {"xpath":"//a[@id='logout_sidebar_link']"}</name>
                            <title>I click {"xpath":"//a[@id='logout_sidebar_link']"}</title>
                            <attachments/>
                            <steps/>
                        </step>
                    </steps>
                </step>
            </steps>
            <attachments/>
        </test-case>
    </test-cases>
</ns2:test-suite>