<?xml version='1.0'?>
<ns2:test-suite xmlns:ns2='urn:model.allure.qatools.yandex.ru' start='1636477044530' stop='1636477063852'>
    <name>User purchases items from SauceDemo.com:</name>
    <title>User purchases items from SauceDemo.com:</title>
    <test-cases>
        <test-case start='1636477052401' status='passed' stop='1636477054022'>
            <name>User logs into website successfully @regression</name>
            <title>User logs into website successfully @regression</title>
            <labels>
                <label name='tag' value='@regression'/>
            </labels>
            <parameters/>
            <steps>
                <step start='1636477052407' status='passed' stop='1636477052409'>
                    <name>loginPage: roleLogin "standardUser"</name>
                    <title>loginPage: roleLogin "standardUser"</title>
                    <attachments/>
                    <steps>
                        <step start='1636477052407' status='passed' stop='1636477052408'>
                            <name>I get data "loginDetails.json"</name>
                            <title>I get data "loginDetails.json"</title>
                            <attachments/>
                            <steps/>
                        </step>
                    </steps>
                </step>
                <step start='1636477052409' status='passed' stop='1636477052738'>
                    <name>I am on page "https://www.saucedemo.com/"</name>
                    <title>I am on page "https://www.saucedemo.com/"</title>
                    <attachments/>
                    <steps/>
                </step>
                <step start='1636477052738' status='passed' stop='1636477052746'>
                    <name>I see in current url "https://www.saucedemo.com/"</name>
                    <title>I see in current url "https://www.saucedemo.com/"</title>
                    <attachments/>
                    <steps/>
                </step>
                <step start='1636477052746' status='passed' stop='1636477052931'>
                    <name>loginPage: checkPage </name>
                    <title>loginPage: checkPage </title>
                    <attachments/>
                    <steps>
                        <step start='1636477052746' status='passed' stop='1636477052759'>
                            <name>I wait for element {"xpath":"//div[@class = 'login_logo']"}, 10</name>
                            <title>I wait for element {"xpath":"//div[@class = 'login_logo']"}, 10</title>
                            <attachments/>
                            <steps/>
                        </step>
                        <step start='1636477052759' status='passed' stop='1636477052776'>
                            <name>I see element {"xpath":"//div[@class = 'login_logo']"}</name>
                            <title>I see element {"xpath":"//div[@class = 'login_logo']"}</title>
                            <attachments/>
                            <steps/>
                        </step>
                        <step start='1636477052776' status='passed' stop='1636477052786'>
                            <name>I wait for element {"xpath":"//*[@id = 'login-button']"}, 10</name>
                            <title>I wait for element {"xpath":"//*[@id = 'login-button']"}, 10</title>
                            <attachments/>
                            <steps/>
                        </step>
                        <step start='1636477052786' status='passed' stop='1636477052808'>
                            <name>I wait for clickable {"xpath":"//*[@id = 'login-button']"}, 10</name>
                            <title>I wait for clickable {"xpath":"//*[@id = 'login-button']"}, 10</title>
                            <attachments/>
                            <steps/>
                        </step>
                        <step start='1636477052808' status='passed' stop='1636477052821'>
                            <name>I see element {"xpath":"//*[@id = 'login-button']"}</name>
                            <title>I see element {"xpath":"//*[@id = 'login-button']"}</title>
                            <attachments/>
                            <steps/>
                        </step>
                        <step start='1636477052822' status='passed' stop='1636477052823'>
                            <name>I take screenshot "loginPageLoaded.png"</name>
                            <title>I take screenshot "loginPageLoaded.png"</title>
                            <attachments/>
                            <steps/>
                        </step>
                    </steps>
                </step>
                <step start='1636477052931' status='passed' stop='1636477053212'>
                    <name>I fill field {"xpath":"//input[@id = 'user-name']"}, "standard_user"</name>
                    <title>I fill field {"xpath":"//input[@id = 'user-name']"}, "standard_user"</title>
                    <attachments/>
                    <steps/>
                </step>
                <step start='1636477053323' status='passed' stop='1636477053592'>
                    <name>I fill field {"xpath":"//input[@id = 'password']"}, "secret_sauce"</name>
                    <title>I fill field {"xpath":"//input[@id = 'password']"}, "secret_sauce"</title>
                    <attachments/>
                    <steps/>
                </step>
                <step start='1636477053593' status='passed' stop='1636477053594'>
                    <name>I take screenshot "loginPageFilled.png"</name>
                    <title>I take screenshot "loginPageFilled.png"</title>
                    <attachments/>
                    <steps/>
                </step>
                <step start='1636477053703' status='passed' stop='1636477053974'>
                    <name>I click {"xpath":"//*[@id = 'login-button']"}</name>
                    <title>I click {"xpath":"//*[@id = 'login-button']"}</title>
                    <attachments/>
                    <steps/>
                </step>
                <step start='1636477053974' status='passed' stop='1636477054022'>
                    <name>homePage: checkPage </name>
                    <title>homePage: checkPage </title>
                    <attachments/>
                    <steps>
                        <step start='1636477053974' status='passed' stop='1636477053985'>
                            <name>I wait for element {"xpath":"//div[@class = 'app_logo']"}, 5</name>
                            <title>I wait for element {"xpath":"//div[@class = 'app_logo']"}, 5</title>
                            <attachments/>
                            <steps/>
                        </step>
                        <step start='1636477053985' status='passed' stop='1636477053998'>
                            <name>I see element {"xpath":"//div[@class = 'app_logo']"}</name>
                            <title>I see element {"xpath":"//div[@class = 'app_logo']"}</title>
                            <attachments/>
                            <steps/>
                        </step>
                        <step start='1636477053998' status='passed' stop='1636477054010'>
                            <name>I wait for element {"xpath":"//*[contains(text(), 'Products')]"}, 10</name>
                            <title>I wait for element {"xpath":"//*[contains(text(), 'Products')]"}, 10</title>
                            <attachments/>
                            <steps/>
                        </step>
                        <step start='1636477054010' status='passed' stop='1636477054022'>
                            <name>I see element {"xpath":"//*[contains(text(), 'Products')]"}</name>
                            <title>I see element {"xpath":"//*[contains(text(), 'Products')]"}</title>
                            <attachments/>
                            <steps/>
                        </step>
                    </steps>
                </step>
            </steps>
            <attachments/>
        </test-case>
        <test-case start='1636477054023' status='passed' stop='1636477061170'>
            <name>User adds items to their cart that they want to purchase @regression</name>
            <title>User adds items to their cart that they want to purchase @regression</title>
            <labels>
                <label name='tag' value='@regression'/>
            </labels>
            <parameters/>
            <steps>
                <step start='1636477054026' status='passed' stop='1636477054780'>
                    <name>homePage: addItemToCart "backpack"</name>
                    <title>homePage: addItemToCart "backpack"</title>
                    <attachments/>
                    <steps>
                        <step start='1636477054026' status='passed' stop='1636477054048'>
                            <name>I wait for clickable {"xpath":"//*[contains(@id, 'add-to-cart') and contains(@id, 'backpack')]"}, 10</name>
                            <title>I wait for clickable {"xpath":"//*[contains(@id, 'add-to-cart') and contains(@id, 'backpack')]"}, 10</title>
                            <attachments/>
                            <steps/>
                        </step>
                        <step start='1636477054048' status='passed' stop='1636477054059'>
                            <name>I see element {"xpath":"//*[contains(@id, 'add-to-cart') and contains(@id, 'backpack')]"}</name>
                            <title>I see element {"xpath":"//*[contains(@id, 'add-to-cart') and contains(@id, 'backpack')]"}</title>
                            <attachments/>
                            <steps/>
                        </step>
                        <step start='1636477054162' status='passed' stop='1636477054400'>
                            <name>I click {"xpath":"//*[contains(@id, 'add-to-cart') and contains(@id, 'backpack')]"}</name>
                            <title>I click {"xpath":"//*[contains(@id, 'add-to-cart') and contains(@id, 'backpack')]"}</title>
                            <attachments/>
                            <steps/>
                        </step>
                        <step start='1636477054400' status='passed' stop='1636477054415'>
                            <name>I see element {"xpath":"//*[contains(@id, 'remove') and contains(@id, 'backpack')]"}</name>
                            <title>I see element {"xpath":"//*[contains(@id, 'remove') and contains(@id, 'backpack')]"}</title>
                            <attachments/>
                            <steps/>
                        </step>
                        <step start='1636477054415' status='passed' stop='1636477054433'>
                            <name>I wait for clickable {"xpath":"//*[@class='shopping_cart_link']"}, 10</name>
                            <title>I wait for clickable {"xpath":"//*[@class='shopping_cart_link']"}, 10</title>
                            <attachments/>
                            <steps/>
                        </step>
                        <step start='1636477054542' status='passed' stop='1636477054779'>
                            <name>I click {"xpath":"//*[@class='shopping_cart_link']"}</name>
                            <title>I click {"xpath":"//*[@class='shopping_cart_link']"}</title>
                            <attachments/>
                            <steps/>
                        </step>
                        <step start='1636477054780' status='passed' stop='1636477054780'>
                            <name>I get data "shoppingItems.json"</name>
                            <title>I get data "shoppingItems.json"</title>
                            <attachments/>
                            <steps/>
                        </step>
                    </steps>
                </step>
                <step start='1636477054780' status='passed' stop='1636477054800'>
                    <name>I grab text from all {"xpath":"//*[@class='inventory_item_name']"}</name>
                    <title>I grab text from all {"xpath":"//*[@class='inventory_item_name']"}</title>
                    <attachments/>
                    <steps/>
                </step>
                <step start='1636477054801' status='passed' stop='1636477054801'>
                    <name>I assert equal "Sauce Labs Backpack", "Sauce Labs Backpack"</name>
                    <title>I assert equal "Sauce Labs Backpack", "Sauce Labs Backpack"</title>
                    <attachments/>
                    <steps/>
                </step>
                <step start='1636477054801' status='passed' stop='1636477054819'>
                    <name>I see text equals "$29.99", {"xpath":"//*[contains(text(), 'Sauce Labs Backpack')]//following::div[@class='inventory_item_price' and text()='29.99']"}</name>
                    <title>I see text equals "$29.99", {"xpath":"//*[contains(text(), 'Sauce Labs Backpack')]//following::div[@class='inventory_item_price' and text()='29.99']"}</title>
                    <attachments/>
                    <steps/>
                </step>
                <step start='1636477054819' status='passed' stop='1636477055192'>
                    <name>cartPage: goToHomePage </name>
                    <title>cartPage: goToHomePage </title>
                    <attachments/>
                    <steps>
                        <step start='1636477054819' status='passed' stop='1636477054837'>
                            <name>I wait for clickable {"xpath":"//button[contains(text(), 'Continue')]"}, 10</name>
                            <title>I wait for clickable {"xpath":"//button[contains(text(), 'Continue')]"}, 10</title>
                            <attachments/>
                            <steps/>
                        </step>
                        <step start='1636477054837' status='passed' stop='1636477054849'>
                            <name>I see element {"xpath":"//button[contains(text(), 'Continue')]"}</name>
                            <title>I see element {"xpath":"//button[contains(text(), 'Continue')]"}</title>
                            <attachments/>
                            <steps/>
                        </step>
                        <step start='1636477054954' status='passed' stop='1636477055192'>
                            <name>I click {"xpath":"//button[contains(text(), 'Continue')]"}</name>
                            <title>I click {"xpath":"//button[contains(text(), 'Continue')]"}</title>
                            <attachments/>
                            <steps/>
                        </step>
                    </steps>
                </step>
                <step start='1636477055192' status='passed' stop='1636477055228'>
                    <name>homePage: checkPage </name>
                    <title>homePage: checkPage </title>
                    <attachments/>
                    <steps>
                        <step start='1636477055192' status='passed' stop='1636477055200'>
                            <name>I wait for element {"xpath":"//div[@class = 'app_logo']"}, 5</name>
                            <title>I wait for element {"xpath":"//div[@class = 'app_logo']"}, 5</title>
                            <attachments/>
                            <steps/>
                        </step>
                        <step start='1636477055200' status='passed' stop='1636477055211'>
                            <name>I see element {"xpath":"//div[@class = 'app_logo']"}</name>
                            <title>I see element {"xpath":"//div[@class = 'app_logo']"}</title>
                            <attachments/>
                            <steps/>
                        </step>
                        <step start='1636477055211' status='passed' stop='1636477055216'>
                            <name>I wait for element {"xpath":"//*[contains(text(), 'Products')]"}, 10</name>
                            <title>I wait for element {"xpath":"//*[contains(text(), 'Products')]"}, 10</title>
                            <attachments/>
                            <steps/>
                        </step>
                        <step start='1636477055216' status='passed' stop='1636477055228'>
                            <name>I see element {"xpath":"//*[contains(text(), 'Products')]"}</name>
                            <title>I see element {"xpath":"//*[contains(text(), 'Products')]"}</title>
                            <attachments/>
                            <steps/>
                        </step>
                    </steps>
                </step>
                <step start='1636477055228' status='passed' stop='1636477055984'>
                    <name>homePage: addItemToCart "bike"</name>
                    <title>homePage: addItemToCart "bike"</title>
                    <attachments/>
                    <steps>
                        <step start='1636477055228' status='passed' stop='1636477055246'>
                            <name>I wait for clickable {"xpath":"//*[contains(@id, 'add-to-cart') and contains(@id, 'bike')]"}, 10</name>
                            <title>I wait for clickable {"xpath":"//*[contains(@id, 'add-to-cart') and contains(@id, 'bike')]"}, 10</title>
                            <attachments/>
                            <steps/>
                        </step>
                        <step start='1636477055246' status='passed' stop='1636477055256'>
                            <name>I see element {"xpath":"//*[contains(@id, 'add-to-cart') and contains(@id, 'bike')]"}</name>
                            <title>I see element {"xpath":"//*[contains(@id, 'add-to-cart') and contains(@id, 'bike')]"}</title>
                            <attachments/>
                            <steps/>
                        </step>
                        <step start='1636477055366' status='passed' stop='1636477055604'>
                            <name>I click {"xpath":"//*[contains(@id, 'add-to-cart') and contains(@id, 'bike')]"}</name>
                            <title>I click {"xpath":"//*[contains(@id, 'add-to-cart') and contains(@id, 'bike')]"}</title>
                            <attachments/>
                            <steps/>
                        </step>
                        <step start='1636477055604' status='passed' stop='1636477055619'>
                            <name>I see element {"xpath":"//*[contains(@id, 'remove') and contains(@id, 'bike')]"}</name>
                            <title>I see element {"xpath":"//*[contains(@id, 'remove') and contains(@id, 'bike')]"}</title>
                            <attachments/>
                            <steps/>
                        </step>
                        <step start='1636477055619' status='passed' stop='1636477055636'>
                            <name>I wait for clickable {"xpath":"//*[@class='shopping_cart_link']"}, 10</name>
                            <title>I wait for clickable {"xpath":"//*[@class='shopping_cart_link']"}, 10</title>
                            <attachments/>
                            <steps/>
                        </step>
                        <step start='1636477055748' status='passed' stop='1636477055983'>
                            <name>I click {"xpath":"//*[@class='shopping_cart_link']"}</name>
                            <title>I click {"xpath":"//*[@class='shopping_cart_link']"}</title>
                            <attachments/>
                            <steps/>
                        </step>
                        <step start='1636477055983' status='passed' stop='1636477055983'>
                            <name>I get data "shoppingItems.json"</name>
                            <title>I get data "shoppingItems.json"</title>
                            <attachments/>
                            <steps/>
                        </step>
                    </steps>
                </step>
                <step start='1636477055984' status='passed' stop='1636477056008'>
                    <name>I grab text from all {"xpath":"//*[@class='inventory_item_name']"}</name>
                    <title>I grab text from all {"xpath":"//*[@class='inventory_item_name']"}</title>
                    <attachments/>
                    <steps/>
                </step>
                <step start='1636477056009' status='passed' stop='1636477056009'>
                    <name>I assert equal "Sauce Labs Bike Light", "Sauce Labs Bike Light"</name>
                    <title>I assert equal "Sauce Labs Bike Light", "Sauce Labs Bike Light"</title>
                    <attachments/>
                    <steps/>
                </step>
                <step start='1636477056009' status='passed' stop='1636477056025'>
                    <name>I see text equals "$9.99", {"xpath":"//*[contains(text(), 'Sauce Labs Bike Light')]//following::div[@class='inventory_item_price' and text()='9.99']"}</name>
                    <title>I see text equals "$9.99", {"xpath":"//*[contains(text(), 'Sauce Labs Bike Light')]//following::div[@class='inventory_item_price' and text()='9.99']"}</title>
                    <attachments/>
                    <steps/>
                </step>
                <step start='1636477056025' status='passed' stop='1636477056395'>
                    <name>cartPage: goToHomePage </name>
                    <title>cartPage: goToHomePage </title>
                    <attachments/>
                    <steps>
                        <step start='1636477056025' status='passed' stop='1636477056038'>
                            <name>I wait for clickable {"xpath":"//button[contains(text(), 'Continue')]"}, 10</name>
                            <title>I wait for clickable {"xpath":"//button[contains(text(), 'Continue')]"}, 10</title>
                            <attachments/>
                            <steps/>
                        </step>
                        <step start='1636477056038' status='passed' stop='1636477056049'>
                            <name>I see element {"xpath":"//button[contains(text(), 'Continue')]"}</name>
                            <title>I see element {"xpath":"//button[contains(text(), 'Continue')]"}</title>
                            <attachments/>
                            <steps/>
                        </step>
                        <step start='1636477056159' status='passed' stop='1636477056395'>
                            <name>I click {"xpath":"//button[contains(text(), 'Continue')]"}</name>
                            <title>I click {"xpath":"//button[contains(text(), 'Continue')]"}</title>
                            <attachments/>
                            <steps/>
                        </step>
                    </steps>
                </step>
                <step start='1636477056395' status='passed' stop='1636477056428'>
                    <name>homePage: checkPage </name>
                    <title>homePage: checkPage </title>
                    <attachments/>
                    <steps>
                        <step start='1636477056395' status='passed' stop='1636477056403'>
                            <name>I wait for element {"xpath":"//div[@class = 'app_logo']"}, 5</name>
                            <title>I wait for element {"xpath":"//div[@class = 'app_logo']"}, 5</title>
                            <attachments/>
                            <steps/>
                        </step>
                        <step start='1636477056403' status='passed' stop='1636477056412'>
                            <name>I see element {"xpath":"//div[@class = 'app_logo']"}</name>
                            <title>I see element {"xpath":"//div[@class = 'app_logo']"}</title>
                            <attachments/>
                            <steps/>
                        </step>
                        <step start='1636477056412' status='passed' stop='1636477056418'>
                            <name>I wait for element {"xpath":"//*[contains(text(), 'Products')]"}, 10</name>
                            <title>I wait for element {"xpath":"//*[contains(text(), 'Products')]"}, 10</title>
                            <attachments/>
                            <steps/>
                        </step>
                        <step start='1636477056418' status='passed' stop='1636477056428'>
                            <name>I see element {"xpath":"//*[contains(text(), 'Products')]"}</name>
                            <title>I see element {"xpath":"//*[contains(text(), 'Products')]"}</title>
                            <attachments/>
                            <steps/>
                        </step>
                    </steps>
                </step>
                <step start='1636477056428' status='passed' stop='1636477057168'>
                    <name>homePage: addItemToCart "bolt"</name>
                    <title>homePage: addItemToCart "bolt"</title>
                    <attachments/>
                    <steps>
                        <step start='1636477056428' status='passed' stop='1636477056444'>
                            <name>I wait for clickable {"xpath":"//*[contains(@id, 'add-to-cart') and contains(@id, 'bolt')]"}, 10</name>
                            <title>I wait for clickable {"xpath":"//*[contains(@id, 'add-to-cart') and contains(@id, 'bolt')]"}, 10</title>
                            <attachments/>
                            <steps/>
                        </step>
                        <step start='1636477056445' status='passed' stop='1636477056455'>
                            <name>I see element {"xpath":"//*[contains(@id, 'add-to-cart') and contains(@id, 'bolt')]"}</name>
                            <title>I see element {"xpath":"//*[contains(@id, 'add-to-cart') and contains(@id, 'bolt')]"}</title>
                            <attachments/>
                            <steps/>
                        </step>
                        <step start='1636477056570' status='passed' stop='1636477056804'>
                            <name>I click {"xpath":"//*[contains(@id, 'add-to-cart') and contains(@id, 'bolt')]"}</name>
                            <title>I click {"xpath":"//*[contains(@id, 'add-to-cart') and contains(@id, 'bolt')]"}</title>
                            <attachments/>
                            <steps/>
                        </step>
                        <step start='1636477056804' status='passed' stop='1636477056818'>
                            <name>I see element {"xpath":"//*[contains(@id, 'remove') and contains(@id, 'bolt')]"}</name>
                            <title>I see element {"xpath":"//*[contains(@id, 'remove') and contains(@id, 'bolt')]"}</title>
                            <attachments/>
                            <steps/>
                        </step>
                        <step start='1636477056818' status='passed' stop='1636477056831'>
                            <name>I wait for clickable {"xpath":"//*[@class='shopping_cart_link']"}, 10</name>
                            <title>I wait for clickable {"xpath":"//*[@class='shopping_cart_link']"}, 10</title>
                            <attachments/>
                            <steps/>
                        </step>
                        <step start='1636477056931' status='passed' stop='1636477057167'>
                            <name>I click {"xpath":"//*[@class='shopping_cart_link']"}</name>
                            <title>I click {"xpath":"//*[@class='shopping_cart_link']"}</title>
                            <attachments/>
                            <steps/>
                        </step>
                        <step start='1636477057167' status='passed' stop='1636477057168'>
                            <name>I get data "shoppingItems.json"</name>
                            <title>I get data "shoppingItems.json"</title>
                            <attachments/>
                            <steps/>
                        </step>
                    </steps>
                </step>
                <step start='1636477057168' status='passed' stop='1636477057199'>
                    <name>I grab text from all {"xpath":"//*[@class='inventory_item_name']"}</name>
                    <title>I grab text from all {"xpath":"//*[@class='inventory_item_name']"}</title>
                    <attachments/>
                    <steps/>
                </step>
                <step start='1636477057199' status='passed' stop='1636477057199'>
                    <name>I assert equal "Sauce Labs Bolt T-Shirt", "Sauce Labs Bolt T-Shirt"</name>
                    <title>I assert equal "Sauce Labs Bolt T-Shirt", "Sauce Labs Bolt T-Shirt"</title>
                    <attachments/>
                    <steps/>
                </step>
                <step start='1636477057199' status='passed' stop='1636477057215'>
                    <name>I see text equals "$15.99", {"xpath":"//*[contains(text(), 'Sauce Labs Bolt T-Shirt')]//following::div[@class='inventory_item_price' and text()='15.99']"}</name>
                    <title>I see text equals "$15.99", {"xpath":"//*[contains(text(), 'Sauce Labs Bolt T-Shirt')]//following::div[@class='inventory_item_price' and text()='15.99']"}</title>
                    <attachments/>
                    <steps/>
                </step>
                <step start='1636477057215' status='passed' stop='1636477057578'>
                    <name>cartPage: goToHomePage </name>
                    <title>cartPage: goToHomePage </title>
                    <attachments/>
                    <steps>
                        <step start='1636477057215' status='passed' stop='1636477057229'>
                            <name>I wait for clickable {"xpath":"//button[contains(text(), 'Continue')]"}, 10</name>
                            <title>I wait for clickable {"xpath":"//button[contains(text(), 'Continue')]"}, 10</title>
                            <attachments/>
                            <steps/>
                        </step>
                        <step start='1636477057229' status='passed' stop='1636477057237'>
                            <name>I see element {"xpath":"//button[contains(text(), 'Continue')]"}</name>
                            <title>I see element {"xpath":"//button[contains(text(), 'Continue')]"}</title>
                            <attachments/>
                            <steps/>
                        </step>
                        <step start='1636477057342' status='passed' stop='1636477057578'>
                            <name>I click {"xpath":"//button[contains(text(), 'Continue')]"}</name>
                            <title>I click {"xpath":"//button[contains(text(), 'Continue')]"}</title>
                            <attachments/>
                            <steps/>
                        </step>
                    </steps>
                </step>
                <step start='1636477057578' status='passed' stop='1636477057609'>
                    <name>homePage: checkPage </name>
                    <title>homePage: checkPage </title>
                    <attachments/>
                    <steps>
                        <step start='1636477057578' status='passed' stop='1636477057585'>
                            <name>I wait for element {"xpath":"//div[@class = 'app_logo']"}, 5</name>
                            <title>I wait for element {"xpath":"//div[@class = 'app_logo']"}, 5</title>
                            <attachments/>
                            <steps/>
                        </step>
                        <step start='1636477057585' status='passed' stop='1636477057594'>
                            <name>I see element {"xpath":"//div[@class = 'app_logo']"}</name>
                            <title>I see element {"xpath":"//div[@class = 'app_logo']"}</title>
                            <attachments/>
                            <steps/>
                        </step>
                        <step start='1636477057594' status='passed' stop='1636477057600'>
                            <name>I wait for element {"xpath":"//*[contains(text(), 'Products')]"}, 10</name>
                            <title>I wait for element {"xpath":"//*[contains(text(), 'Products')]"}, 10</title>
                            <attachments/>
                            <steps/>
                        </step>
                        <step start='1636477057600' status='passed' stop='1636477057609'>
                            <name>I see element {"xpath":"//*[contains(text(), 'Products')]"}</name>
                            <title>I see element {"xpath":"//*[contains(text(), 'Products')]"}</title>
                            <attachments/>
                            <steps/>
                        </step>
                    </steps>
                </step>
                <step start='1636477057609' status='passed' stop='1636477058363'>
                    <name>homePage: addItemToCart "jacket"</name>
                    <title>homePage: addItemToCart "jacket"</title>
                    <attachments/>
                    <steps>
                        <step start='1636477057609' status='passed' stop='1636477057629'>
                            <name>I wait for clickable {"xpath":"//*[contains(@id, 'add-to-cart') and contains(@id, 'jacket')]"}, 10</name>
                            <title>I wait for clickable {"xpath":"//*[contains(@id, 'add-to-cart') and contains(@id, 'jacket')]"}, 10</title>
                            <attachments/>
                            <steps/>
                        </step>
                        <step start='1636477057629' status='passed' stop='1636477057639'>
                            <name>I see element {"xpath":"//*[contains(@id, 'add-to-cart') and contains(@id, 'jacket')]"}</name>
                            <title>I see element {"xpath":"//*[contains(@id, 'add-to-cart') and contains(@id, 'jacket')]"}</title>
                            <attachments/>
                            <steps/>
                        </step>
                        <step start='1636477057752' status='passed' stop='1636477057987'>
                            <name>I click {"xpath":"//*[contains(@id, 'add-to-cart') and contains(@id, 'jacket')]"}</name>
                            <title>I click {"xpath":"//*[contains(@id, 'add-to-cart') and contains(@id, 'jacket')]"}</title>
                            <attachments/>
                            <steps/>
                        </step>
                        <step start='1636477057987' status='passed' stop='1636477058000'>
                            <name>I see element {"xpath":"//*[contains(@id, 'remove') and contains(@id, 'jacket')]"}</name>
                            <title>I see element {"xpath":"//*[contains(@id, 'remove') and contains(@id, 'jacket')]"}</title>
                            <attachments/>
                            <steps/>
                        </step>
                        <step start='1636477058000' status='passed' stop='1636477058014'>
                            <name>I wait for clickable {"xpath":"//*[@class='shopping_cart_link']"}, 10</name>
                            <title>I wait for clickable {"xpath":"//*[@class='shopping_cart_link']"}, 10</title>
                            <attachments/>
                            <steps/>
                        </step>
                        <step start='1636477058129' status='passed' stop='1636477058363'>
                            <name>I click {"xpath":"//*[@class='shopping_cart_link']"}</name>
                            <title>I click {"xpath":"//*[@class='shopping_cart_link']"}</title>
                            <attachments/>
                            <steps/>
                        </step>
                        <step start='1636477058363' status='passed' stop='1636477058363'>
                            <name>I get data "shoppingItems.json"</name>
                            <title>I get data "shoppingItems.json"</title>
                            <attachments/>
                            <steps/>
                        </step>
                    </steps>
                </step>
                <step start='1636477058363' status='passed' stop='1636477058401'>
                    <name>I grab text from all {"xpath":"//*[@class='inventory_item_name']"}</name>
                    <title>I grab text from all {"xpath":"//*[@class='inventory_item_name']"}</title>
                    <attachments/>
                    <steps/>
                </step>
                <step start='1636477058401' status='passed' stop='1636477058401'>
                    <name>I assert equal "Sauce Labs Fleece Jacket", "Sauce Labs Fleece Jacket"</name>
                    <title>I assert equal "Sauce Labs Fleece Jacket", "Sauce Labs Fleece Jacket"</title>
                    <attachments/>
                    <steps/>
                </step>
                <step start='1636477058401' status='passed' stop='1636477058416'>
                    <name>I see text equals "$49.99", {"xpath":"//*[contains(text(), 'Sauce Labs Fleece Jacket')]//following::div[@class='inventory_item_price' and text()='49.99']"}</name>
                    <title>I see text equals "$49.99", {"xpath":"//*[contains(text(), 'Sauce Labs Fleece Jacket')]//following::div[@class='inventory_item_price' and text()='49.99']"}</title>
                    <attachments/>
                    <steps/>
                </step>
                <step start='1636477058416' status='passed' stop='1636477058788'>
                    <name>cartPage: goToHomePage </name>
                    <title>cartPage: goToHomePage </title>
                    <attachments/>
                    <steps>
                        <step start='1636477058416' status='passed' stop='1636477058429'>
                            <name>I wait for clickable {"xpath":"//button[contains(text(), 'Continue')]"}, 10</name>
                            <title>I wait for clickable {"xpath":"//button[contains(text(), 'Continue')]"}, 10</title>
                            <attachments/>
                            <steps/>
                        </step>
                        <step start='1636477058429' status='passed' stop='1636477058438'>
                            <name>I see element {"xpath":"//button[contains(text(), 'Continue')]"}</name>
                            <title>I see element {"xpath":"//button[contains(text(), 'Continue')]"}</title>
                            <attachments/>
                            <steps/>
                        </step>
                        <step start='1636477058550' status='passed' stop='1636477058788'>
                            <name>I click {"xpath":"//button[contains(text(), 'Continue')]"}</name>
                            <title>I click {"xpath":"//button[contains(text(), 'Continue')]"}</title>
                            <attachments/>
                            <steps/>
                        </step>
                    </steps>
                </step>
                <step start='1636477058788' status='passed' stop='1636477058821'>
                    <name>homePage: checkPage </name>
                    <title>homePage: checkPage </title>
                    <attachments/>
                    <steps>
                        <step start='1636477058788' status='passed' stop='1636477058795'>
                            <name>I wait for element {"xpath":"//div[@class = 'app_logo']"}, 5</name>
                            <title>I wait for element {"xpath":"//div[@class = 'app_logo']"}, 5</title>
                            <attachments/>
                            <steps/>
                        </step>
                        <step start='1636477058796' status='passed' stop='1636477058806'>
                            <name>I see element {"xpath":"//div[@class = 'app_logo']"}</name>
                            <title>I see element {"xpath":"//div[@class = 'app_logo']"}</title>
                            <attachments/>
                            <steps/>
                        </step>
                        <step start='1636477058806' status='passed' stop='1636477058811'>
                            <name>I wait for element {"xpath":"//*[contains(text(), 'Products')]"}, 10</name>
                            <title>I wait for element {"xpath":"//*[contains(text(), 'Products')]"}, 10</title>
                            <attachments/>
                            <steps/>
                        </step>
                        <step start='1636477058811' status='passed' stop='1636477058821'>
                            <name>I see element {"xpath":"//*[contains(text(), 'Products')]"}</name>
                            <title>I see element {"xpath":"//*[contains(text(), 'Products')]"}</title>
                            <attachments/>
                            <steps/>
                        </step>
                    </steps>
                </step>
                <step start='1636477058821' status='passed' stop='1636477059544'>
                    <name>homePage: addItemToCart "onesie"</name>
                    <title>homePage: addItemToCart "onesie"</title>
                    <attachments/>
                    <steps>
                        <step start='1636477058821' status='passed' stop='1636477058836'>
                            <name>I wait for clickable {"xpath":"//*[contains(@id, 'add-to-cart') and contains(@id, 'onesie')]"}, 10</name>
                            <title>I wait for clickable {"xpath":"//*[contains(@id, 'add-to-cart') and contains(@id, 'onesie')]"}, 10</title>
                            <attachments/>
                            <steps/>
                        </step>
                        <step start='1636477058836' status='passed' stop='1636477058846'>
                            <name>I see element {"xpath":"//*[contains(@id, 'add-to-cart') and contains(@id, 'onesie')]"}</name>
                            <title>I see element {"xpath":"//*[contains(@id, 'add-to-cart') and contains(@id, 'onesie')]"}</title>
                            <attachments/>
                            <steps/>
                        </step>
                        <step start='1636477058946' status='passed' stop='1636477059181'>
                            <name>I click {"xpath":"//*[contains(@id, 'add-to-cart') and contains(@id, 'onesie')]"}</name>
                            <title>I click {"xpath":"//*[contains(@id, 'add-to-cart') and contains(@id, 'onesie')]"}</title>
                            <attachments/>
                            <steps/>
                        </step>
                        <step start='1636477059181' status='passed' stop='1636477059196'>
                            <name>I see element {"xpath":"//*[contains(@id, 'remove') and contains(@id, 'onesie')]"}</name>
                            <title>I see element {"xpath":"//*[contains(@id, 'remove') and contains(@id, 'onesie')]"}</title>
                            <attachments/>
                            <steps/>
                        </step>
                        <step start='1636477059196' status='passed' stop='1636477059209'>
                            <name>I wait for clickable {"xpath":"//*[@class='shopping_cart_link']"}, 10</name>
                            <title>I wait for clickable {"xpath":"//*[@class='shopping_cart_link']"}, 10</title>
                            <attachments/>
                            <steps/>
                        </step>
                        <step start='1636477059309' status='passed' stop='1636477059544'>
                            <name>I click {"xpath":"//*[@class='shopping_cart_link']"}</name>
                            <title>I click {"xpath":"//*[@class='shopping_cart_link']"}</title>
                            <attachments/>
                            <steps/>
                        </step>
                        <step start='1636477059544' status='passed' stop='1636477059544'>
                            <name>I get data "shoppingItems.json"</name>
                            <title>I get data "shoppingItems.json"</title>
                            <attachments/>
                            <steps/>
                        </step>
                    </steps>
                </step>
                <step start='1636477059544' status='passed' stop='1636477059590'>
                    <name>I grab text from all {"xpath":"//*[@class='inventory_item_name']"}</name>
                    <title>I grab text from all {"xpath":"//*[@class='inventory_item_name']"}</title>
                    <attachments/>
                    <steps/>
                </step>
                <step start='1636477059591' status='passed' stop='1636477059591'>
                    <name>I assert equal "Sauce Labs Onesie", "Sauce Labs Onesie"</name>
                    <title>I assert equal "Sauce Labs Onesie", "Sauce Labs Onesie"</title>
                    <attachments/>
                    <steps/>
                </step>
                <step start='1636477059591' status='passed' stop='1636477059606'>
                    <name>I see text equals "$7.99", {"xpath":"//*[contains(text(), 'Sauce Labs Onesie')]//following::div[@class='inventory_item_price' and text()='7.99']"}</name>
                    <title>I see text equals "$7.99", {"xpath":"//*[contains(text(), 'Sauce Labs Onesie')]//following::div[@class='inventory_item_price' and text()='7.99']"}</title>
                    <attachments/>
                    <steps/>
                </step>
                <step start='1636477059606' status='passed' stop='1636477059965'>
                    <name>cartPage: goToHomePage </name>
                    <title>cartPage: goToHomePage </title>
                    <attachments/>
                    <steps>
                        <step start='1636477059606' status='passed' stop='1636477059619'>
                            <name>I wait for clickable {"xpath":"//button[contains(text(), 'Continue')]"}, 10</name>
                            <title>I wait for clickable {"xpath":"//button[contains(text(), 'Continue')]"}, 10</title>
                            <attachments/>
                            <steps/>
                        </step>
                        <step start='1636477059619' status='passed' stop='1636477059629'>
                            <name>I see element {"xpath":"//button[contains(text(), 'Continue')]"}</name>
                            <title>I see element {"xpath":"//button[contains(text(), 'Continue')]"}</title>
                            <attachments/>
                            <steps/>
                        </step>
                        <step start='1636477059733' status='passed' stop='1636477059965'>
                            <name>I click {"xpath":"//button[contains(text(), 'Continue')]"}</name>
                            <title>I click {"xpath":"//button[contains(text(), 'Continue')]"}</title>
                            <attachments/>
                            <steps/>
                        </step>
                    </steps>
                </step>
                <step start='1636477059965' status='passed' stop='1636477059996'>
                    <name>homePage: checkPage </name>
                    <title>homePage: checkPage </title>
                    <attachments/>
                    <steps>
                        <step start='1636477059965' status='passed' stop='1636477059972'>
                            <name>I wait for element {"xpath":"//div[@class = 'app_logo']"}, 5</name>
                            <title>I wait for element {"xpath":"//div[@class = 'app_logo']"}, 5</title>
                            <attachments/>
                            <steps/>
                        </step>
                        <step start='1636477059972' status='passed' stop='1636477059982'>
                            <name>I see element {"xpath":"//div[@class = 'app_logo']"}</name>
                            <title>I see element {"xpath":"//div[@class = 'app_logo']"}</title>
                            <attachments/>
                            <steps/>
                        </step>
                        <step start='1636477059982' status='passed' stop='1636477059987'>
                            <name>I wait for element {"xpath":"//*[contains(text(), 'Products')]"}, 10</name>
                            <title>I wait for element {"xpath":"//*[contains(text(), 'Products')]"}, 10</title>
                            <attachments/>
                            <steps/>
                        </step>
                        <step start='1636477059987' status='passed' stop='1636477059996'>
                            <name>I see element {"xpath":"//*[contains(text(), 'Products')]"}</name>
                            <title>I see element {"xpath":"//*[contains(text(), 'Products')]"}</title>
                            <attachments/>
                            <steps/>
                        </step>
                    </steps>
                </step>
                <step start='1636477059996' status='passed' stop='1636477060730'>
                    <name>homePage: addItemToCart "red"</name>
                    <title>homePage: addItemToCart "red"</title>
                    <attachments/>
                    <steps>
                        <step start='1636477059996' status='passed' stop='1636477060011'>
                            <name>I wait for clickable {"xpath":"//*[contains(@id, 'add-to-cart') and contains(@id, 'red')]"}, 10</name>
                            <title>I wait for clickable {"xpath":"//*[contains(@id, 'add-to-cart') and contains(@id, 'red')]"}, 10</title>
                            <attachments/>
                            <steps/>
                        </step>
                        <step start='1636477060011' status='passed' stop='1636477060020'>
                            <name>I see element {"xpath":"//*[contains(@id, 'add-to-cart') and contains(@id, 'red')]"}</name>
                            <title>I see element {"xpath":"//*[contains(@id, 'add-to-cart') and contains(@id, 'red')]"}</title>
                            <attachments/>
                            <steps/>
                        </step>
                        <step start='1636477060121' status='passed' stop='1636477060355'>
                            <name>I click {"xpath":"//*[contains(@id, 'add-to-cart') and contains(@id, 'red')]"}</name>
                            <title>I click {"xpath":"//*[contains(@id, 'add-to-cart') and contains(@id, 'red')]"}</title>
                            <attachments/>
                            <steps/>
                        </step>
                        <step start='1636477060355' status='passed' stop='1636477060370'>
                            <name>I see element {"xpath":"//*[contains(@id, 'remove') and contains(@id, 'red')]"}</name>
                            <title>I see element {"xpath":"//*[contains(@id, 'remove') and contains(@id, 'red')]"}</title>
                            <attachments/>
                            <steps/>
                        </step>
                        <step start='1636477060370' status='passed' stop='1636477060384'>
                            <name>I wait for clickable {"xpath":"//*[@class='shopping_cart_link']"}, 10</name>
                            <title>I wait for clickable {"xpath":"//*[@class='shopping_cart_link']"}, 10</title>
                            <attachments/>
                            <steps/>
                        </step>
                        <step start='1636477060494' status='passed' stop='1636477060729'>
                            <name>I click {"xpath":"//*[@class='shopping_cart_link']"}</name>
                            <title>I click {"xpath":"//*[@class='shopping_cart_link']"}</title>
                            <attachments/>
                            <steps/>
                        </step>
                        <step start='1636477060730' status='passed' stop='1636477060730'>
                            <name>I get data "shoppingItems.json"</name>
                            <title>I get data "shoppingItems.json"</title>
                            <attachments/>
                            <steps/>
                        </step>
                    </steps>
                </step>
                <step start='1636477060730' status='passed' stop='1636477060784'>
                    <name>I grab text from all {"xpath":"//*[@class='inventory_item_name']"}</name>
                    <title>I grab text from all {"xpath":"//*[@class='inventory_item_name']"}</title>
                    <attachments/>
                    <steps/>
                </step>
                <step start='1636477060785' status='passed' stop='1636477060785'>
                    <name>I assert equal "Test.allTheThings() T-Shirt (Red)", "Test.allTheThings() T-Shirt (Red)"</name>
                    <title>I assert equal "Test.allTheThings() T-Shirt (Red)", "Test.allTheThings() T-Shirt (Red)"</title>
                    <attachments/>
                    <steps/>
                </step>
                <step start='1636477060785' status='passed' stop='1636477060799'>
                    <name>I see text equals "$15.99", {"xpath":"//*[contains(text(), 'Test.allTheThings() T-Shirt (Red)')]//following::div[@class='inventory_item_price' and text()='15.99']"}</name>
                    <title>I see text equals "$15.99", {"xpath":"//*[contains(text(), 'Test.allTheThings() T-Shirt (Red)')]//following::div[@class='inventory_item_price' and text()='15.99']"}</title>
                    <attachments/>
                    <steps/>
                </step>
                <step start='1636477060799' status='passed' stop='1636477061170'>
                    <name>cartPage: goToCheckout </name>
                    <title>cartPage: goToCheckout </title>
                    <attachments/>
                    <steps>
                        <step start='1636477060799' status='passed' stop='1636477060815'>
                            <name>I wait for clickable {"xpath":"//button[contains(text(), 'Checkout')]"}, 10</name>
                            <title>I wait for clickable {"xpath":"//button[contains(text(), 'Checkout')]"}, 10</title>
                            <attachments/>
                            <steps/>
                        </step>
                        <step start='1636477060815' status='passed' stop='1636477060824'>
                            <name>I see element {"xpath":"//button[contains(text(), 'Checkout')]"}</name>
                            <title>I see element {"xpath":"//button[contains(text(), 'Checkout')]"}</title>
                            <attachments/>
                            <steps/>
                        </step>
                        <step start='1636477060933' status='passed' stop='1636477061170'>
                            <name>I click {"xpath":"//button[contains(text(), 'Checkout')]"}</name>
                            <title>I click {"xpath":"//button[contains(text(), 'Checkout')]"}</title>
                            <attachments/>
                            <steps/>
                        </step>
                    </steps>
                </step>
            </steps>
            <attachments/>
        </test-case>
        <test-case start='1636477061171' status='passed' stop='1636477063851'>
            <name>User fills in information and finishes shopping @regression</name>
            <title>User fills in information and finishes shopping @regression</title>
            <labels>
                <label name='tag' value='@regression'/>
            </labels>
            <parameters/>
            <steps>
                <step start='1636477061172' status='passed' stop='1636477061190'>
                    <name>checkOutPage: checkPage </name>
                    <title>checkOutPage: checkPage </title>
                    <attachments/>
                    <steps>
                        <step start='1636477061172' status='passed' stop='1636477061181'>
                            <name>I wait for element {"xpath":"//input[@id = 'first-name']"}, 10</name>
                            <title>I wait for element {"xpath":"//input[@id = 'first-name']"}, 10</title>
                            <attachments/>
                            <steps/>
                        </step>
                        <step start='1636477061181' status='passed' stop='1636477061190'>
                            <name>I see element {"xpath":"//input[@id = 'first-name']"}</name>
                            <title>I see element {"xpath":"//input[@id = 'first-name']"}</title>
                            <attachments/>
                            <steps/>
                        </step>
                    </steps>
                </step>
                <step start='1636477061190' status='passed' stop='1636477061297'>
                    <name>checkOutPage: fillShippingInfo </name>
                    <title>checkOutPage: fillShippingInfo </title>
                    <attachments/>
                    <steps>
                        <step start='1636477061190' status='passed' stop='1636477061191'>
                            <name>I get data "loginDetails.json"</name>
                            <title>I get data "loginDetails.json"</title>
                            <attachments/>
                            <steps/>
                        </step>
                    </steps>
                </step>
                <step start='1636477061297' status='passed' stop='1636477061550'>
                    <name>I fill field {"xpath":"//input[@id = 'first-name']"}, "Sofie"</name>
                    <title>I fill field {"xpath":"//input[@id = 'first-name']"}, "Sofie"</title>
                    <attachments/>
                    <steps/>
                </step>
                <step start='1636477061660' status='passed' stop='1636477061929'>
                    <name>I fill field {"xpath":"//input[@id = 'last-name']"}, "SaysHello:)"</name>
                    <title>I fill field {"xpath":"//input[@id = 'last-name']"}, "SaysHello:)"</title>
                    <attachments/>
                    <steps/>
                </step>
                <step start='1636477062039' status='passed' stop='1636477062290'>
                    <name>I fill field {"xpath":"//input[@id = 'postal-code']"}, "01111"</name>
                    <title>I fill field {"xpath":"//input[@id = 'postal-code']"}, "01111"</title>
                    <attachments/>
                    <steps/>
                </step>
                <step start='1636477062290' status='passed' stop='1636477062310'>
                    <name>I see in field {"xpath":"//input[@id = 'first-name']"}, "Sofie"</name>
                    <title>I see in field {"xpath":"//input[@id = 'first-name']"}, "Sofie"</title>
                    <attachments/>
                    <steps/>
                </step>
                <step start='1636477062310' status='passed' stop='1636477062329'>
                    <name>I see in field {"xpath":"//input[@id = 'last-name']"}, "SaysHello:)"</name>
                    <title>I see in field {"xpath":"//input[@id = 'last-name']"}, "SaysHello:)"</title>
                    <attachments/>
                    <steps/>
                </step>
                <step start='1636477062329' status='passed' stop='1636477062345'>
                    <name>I see in field {"xpath":"//input[@id = 'postal-code']"}, "01111"</name>
                    <title>I see in field {"xpath":"//input[@id = 'postal-code']"}, "01111"</title>
                    <attachments/>
                    <steps/>
                </step>
                <step start='1636477062450' status='passed' stop='1636477062688'>
                    <name>I click {"xpath":"//*[@id = 'continue']"}</name>
                    <title>I click {"xpath":"//*[@id = 'continue']"}</title>
                    <attachments/>
                    <steps/>
                </step>
                <step start='1636477062688' status='passed' stop='1636477063070'>
                    <name>checkOutPage: checkOut </name>
                    <title>checkOutPage: checkOut </title>
                    <attachments/>
                    <steps>
                        <step start='1636477062688' status='passed' stop='1636477062706'>
                            <name>I wait for clickable {"xpath":"//*[@id = 'finish']"}, 10</name>
                            <title>I wait for clickable {"xpath":"//*[@id = 'finish']"}, 10</title>
                            <attachments/>
                            <steps/>
                        </step>
                        <step start='1636477062814' status='passed' stop='1636477063052'>
                            <name>I click {"xpath":"//*[@id = 'finish']"}</name>
                            <title>I click {"xpath":"//*[@id = 'finish']"}</title>
                            <attachments/>
                            <steps/>
                        </step>
                        <step start='1636477063052' status='passed' stop='1636477063061'>
                            <name>I wait for element {"xpath":"//span[contains(text(), 'Complete')]"}, 10</name>
                            <title>I wait for element {"xpath":"//span[contains(text(), 'Complete')]"}, 10</title>
                            <attachments/>
                            <steps/>
                        </step>
                        <step start='1636477063061' status='passed' stop='1636477063070'>
                            <name>I see element {"xpath":"//span[contains(text(), 'Complete')]"}</name>
                            <title>I see element {"xpath":"//span[contains(text(), 'Complete')]"}</title>
                            <attachments/>
                            <steps/>
                        </step>
                    </steps>
                </step>
                <step start='1636477063070' status='passed' stop='1636477063851'>
                    <name>homePage: logOut </name>
                    <title>homePage: logOut </title>
                    <attachments/>
                    <steps>
                        <step start='1636477063070' status='passed' stop='1636477063082'>
                            <name>I dont see element {"xpath":"//a[@id='logout_sidebar_link']"}</name>
                            <title>I dont see element {"xpath":"//a[@id='logout_sidebar_link']"}</title>
                            <attachments/>
                            <steps/>
                        </step>
                        <step start='1636477063082' status='passed' stop='1636477063089'>
                            <name>I wait for element {"xpath":"//button[contains(@id, 'menu-btn')]"}, 10</name>
                            <title>I wait for element {"xpath":"//button[contains(@id, 'menu-btn')]"}, 10</title>
                            <attachments/>
                            <steps/>
                        </step>
                        <step start='1636477063089' status='passed' stop='1636477063102'>
                            <name>I wait for clickable {"xpath":"//button[contains(@id, 'menu-btn')]"}, 5</name>
                            <title>I wait for clickable {"xpath":"//button[contains(@id, 'menu-btn')]"}, 5</title>
                            <attachments/>
                            <steps/>
                        </step>
                        <step start='1636477063102' status='passed' stop='1636477063110'>
                            <name>I see element {"xpath":"//button[contains(@id, 'menu-btn')]"}</name>
                            <title>I see element {"xpath":"//button[contains(@id, 'menu-btn')]"}</title>
                            <attachments/>
                            <steps/>
                        </step>
                        <step start='1636477063210' status='passed' stop='1636477063442'>
                            <name>I click {"xpath":"//button[contains(@id, 'menu-btn')]"}</name>
                            <title>I click {"xpath":"//button[contains(@id, 'menu-btn')]"}</title>
                            <attachments/>
                            <steps/>
                        </step>
                        <step start='1636477063442' status='passed' stop='1636477063448'>
                            <name>I wait for element {"xpath":"//a[@id='logout_sidebar_link']"}, 10</name>
                            <title>I wait for element {"xpath":"//a[@id='logout_sidebar_link']"}, 10</title>
                            <attachments/>
                            <steps/>
                        </step>
                        <step start='1636477063448' status='passed' stop='1636477063458'>
                            <name>I see element {"xpath":"//a[@id='logout_sidebar_link']"}</name>
                            <title>I see element {"xpath":"//a[@id='logout_sidebar_link']"}</title>
                            <attachments/>
                            <steps/>
                        </step>
                        <step start='1636477063570' status='passed' stop='1636477063807'>
                            <name>I click {"xpath":"//a[@id='logout_sidebar_link']"}</name>
                            <title>I click {"xpath":"//a[@id='logout_sidebar_link']"}</title>
                            <attachments/>
                            <steps/>
                        </step>
                        <step start='1636477063807' status='passed' stop='1636477063813'>
                            <name>I wait for element {"xpath":"//div[@class = 'login_logo']"}, 10</name>
                            <title>I wait for element {"xpath":"//div[@class = 'login_logo']"}, 10</title>
                            <attachments/>
                            <steps/>
                        </step>
                        <step start='1636477063813' status='passed' stop='1636477063823'>
                            <name>I see element {"xpath":"//div[@class = 'login_logo']"}</name>
                            <title>I see element {"xpath":"//div[@class = 'login_logo']"}</title>
                            <attachments/>
                            <steps/>
                        </step>
                        <step start='1636477063823' status='passed' stop='1636477063828'>
                            <name>I wait for element {"xpath":"//*[@id = 'login-button']"}, 10</name>
                            <title>I wait for element {"xpath":"//*[@id = 'login-button']"}, 10</title>
                            <attachments/>
                            <steps/>
                        </step>
                        <step start='1636477063828' status='passed' stop='1636477063841'>
                            <name>I wait for clickable {"xpath":"//*[@id = 'login-button']"}, 10</name>
                            <title>I wait for clickable {"xpath":"//*[@id = 'login-button']"}, 10</title>
                            <attachments/>
                            <steps/>
                        </step>
                        <step start='1636477063841' status='passed' stop='1636477063849'>
                            <name>I see element {"xpath":"//*[@id = 'login-button']"}</name>
                            <title>I see element {"xpath":"//*[@id = 'login-button']"}</title>
                            <attachments/>
                            <steps/>
                        </step>
                        <step start='1636477063849' status='passed' stop='1636477063851'>
                            <name>I take screenshot "loginPageLoaded.png"</name>
                            <title>I take screenshot "loginPageLoaded.png"</title>
                            <attachments/>
                            <steps/>
                        </step>
                    </steps>
                </step>
            </steps>
            <attachments/>
        </test-case>
    </test-cases>
</ns2:test-suite>