<?xml version='1.0'?>
<ns2:test-suite xmlns:ns2='urn:model.allure.qatools.yandex.ru' start='1635878297333' stop='1635878309951'>
    <name>Validate Login Page allows successful Login:</name>
    <title>Validate Login Page allows successful Login:</title>
    <test-cases>
        <test-case start='1635878305623' status='passed' stop='1635878308531'>
            <name>User logs into website successfully and logs out</name>
            <title>User logs into website successfully and logs out</title>
            <labels/>
            <parameters/>
            <steps>
                <step start='1635878305632' status='passed' stop='1635878305634'>
                    <name>loginPage: roleLogin "standardUser"</name>
                    <title>loginPage: roleLogin "standardUser"</title>
                    <attachments/>
                    <steps>
                        <step start='1635878305632' status='passed' stop='1635878305633'>
                            <name>I get data "loginDetails.json"</name>
                            <title>I get data "loginDetails.json"</title>
                            <attachments/>
                            <steps/>
                        </step>
                    </steps>
                </step>
                <step start='1635878305634' status='passed' stop='1635878305957'>
                    <name>I am on page "https://www.saucedemo.com/"</name>
                    <title>I am on page "https://www.saucedemo.com/"</title>
                    <attachments/>
                    <steps/>
                </step>
                <step start='1635878305957' status='passed' stop='1635878305965'>
                    <name>I see in current url "https://www.saucedemo.com/"</name>
                    <title>I see in current url "https://www.saucedemo.com/"</title>
                    <attachments/>
                    <steps/>
                </step>
                <step start='1635878305965' status='passed' stop='1635878306150'>
                    <name>loginPage: checkPage </name>
                    <title>loginPage: checkPage </title>
                    <attachments/>
                    <steps>
                        <step start='1635878305965' status='passed' stop='1635878305978'>
                            <name>I wait for element {"xpath":"//div[@class = 'login_logo']"}, 10</name>
                            <title>I wait for element {"xpath":"//div[@class = 'login_logo']"}, 10</title>
                            <attachments/>
                            <steps/>
                        </step>
                        <step start='1635878305978' status='passed' stop='1635878305996'>
                            <name>I see element {"xpath":"//div[@class = 'login_logo']"}</name>
                            <title>I see element {"xpath":"//div[@class = 'login_logo']"}</title>
                            <attachments/>
                            <steps/>
                        </step>
                        <step start='1635878305996' status='passed' stop='1635878306006'>
                            <name>I wait for element {"xpath":"//*[@id = 'login-button']"}, 10</name>
                            <title>I wait for element {"xpath":"//*[@id = 'login-button']"}, 10</title>
                            <attachments/>
                            <steps/>
                        </step>
                        <step start='1635878306006' status='passed' stop='1635878306028'>
                            <name>I wait for clickable {"xpath":"//*[@id = 'login-button']"}, 10</name>
                            <title>I wait for clickable {"xpath":"//*[@id = 'login-button']"}, 10</title>
                            <attachments/>
                            <steps/>
                        </step>
                        <step start='1635878306028' status='passed' stop='1635878306043'>
                            <name>I see element {"xpath":"//*[@id = 'login-button']"}</name>
                            <title>I see element {"xpath":"//*[@id = 'login-button']"}</title>
                            <attachments/>
                            <steps/>
                        </step>
                        <step start='1635878306043' status='passed' stop='1635878306045'>
                            <name>I take screenshot "loginPageLoaded.png"</name>
                            <title>I take screenshot "loginPageLoaded.png"</title>
                            <attachments/>
                            <steps/>
                        </step>
                    </steps>
                </step>
                <step start='1635878306150' status='passed' stop='1635878306420'>
                    <name>I fill field {"xpath":"//input[@id = 'user-name']"}, "standard_user"</name>
                    <title>I fill field {"xpath":"//input[@id = 'user-name']"}, "standard_user"</title>
                    <attachments/>
                    <steps/>
                </step>
                <step start='1635878306530' status='passed' stop='1635878306796'>
                    <name>I fill field {"xpath":"//input[@id = 'password']"}, "secret_sauce"</name>
                    <title>I fill field {"xpath":"//input[@id = 'password']"}, "secret_sauce"</title>
                    <attachments/>
                    <steps/>
                </step>
                <step start='1635878306796' status='passed' stop='1635878306797'>
                    <name>I take screenshot "loginPageFilled.png"</name>
                    <title>I take screenshot "loginPageFilled.png"</title>
                    <attachments/>
                    <steps/>
                </step>
                <step start='1635878306905' status='passed' stop='1635878307166'>
                    <name>I click {"xpath":"//*[@id = 'login-button']"}</name>
                    <title>I click {"xpath":"//*[@id = 'login-button']"}</title>
                    <attachments/>
                    <steps/>
                </step>
                <step start='1635878307166' status='passed' stop='1635878307215'>
                    <name>homePage: checkPage </name>
                    <title>homePage: checkPage </title>
                    <attachments/>
                    <steps>
                        <step start='1635878307166' status='passed' stop='1635878307178'>
                            <name>I wait for element {"xpath":"//div[@class = 'app_logo']"}, 5</name>
                            <title>I wait for element {"xpath":"//div[@class = 'app_logo']"}, 5</title>
                            <attachments/>
                            <steps/>
                        </step>
                        <step start='1635878307178' status='passed' stop='1635878307193'>
                            <name>I see element {"xpath":"//div[@class = 'app_logo']"}</name>
                            <title>I see element {"xpath":"//div[@class = 'app_logo']"}</title>
                            <attachments/>
                            <steps/>
                        </step>
                        <step start='1635878307193' status='passed' stop='1635878307204'>
                            <name>I wait for element {"xpath":"//*[contains(text(), 'Products')]"}, 10</name>
                            <title>I wait for element {"xpath":"//*[contains(text(), 'Products')]"}, 10</title>
                            <attachments/>
                            <steps/>
                        </step>
                        <step start='1635878307204' status='passed' stop='1635878307215'>
                            <name>I see element {"xpath":"//*[contains(text(), 'Products')]"}</name>
                            <title>I see element {"xpath":"//*[contains(text(), 'Products')]"}</title>
                            <attachments/>
                            <steps/>
                        </step>
                    </steps>
                </step>
                <step start='1635878307215' status='passed' stop='1635878308477'>
                    <name>homePage: logOut </name>
                    <title>homePage: logOut </title>
                    <attachments/>
                    <steps>
                        <step start='1635878307215' status='passed' stop='1635878307720'>
                            <name>I dont see element {"xpath":"//a[@id='logout_sidebar_link']"}</name>
                            <title>I dont see element {"xpath":"//a[@id='logout_sidebar_link']"}</title>
                            <attachments/>
                            <steps/>
                        </step>
                        <step start='1635878307721' status='passed' stop='1635878307731'>
                            <name>I wait for element {"xpath":"//button[contains(@id, 'menu-btn')]"}, 10</name>
                            <title>I wait for element {"xpath":"//button[contains(@id, 'menu-btn')]"}, 10</title>
                            <attachments/>
                            <steps/>
                        </step>
                        <step start='1635878307731' status='passed' stop='1635878307750'>
                            <name>I wait for clickable {"xpath":"//button[contains(@id, 'menu-btn')]"}, 5</name>
                            <title>I wait for clickable {"xpath":"//button[contains(@id, 'menu-btn')]"}, 5</title>
                            <attachments/>
                            <steps/>
                        </step>
                        <step start='1635878307750' status='passed' stop='1635878307762'>
                            <name>I see element {"xpath":"//button[contains(@id, 'menu-btn')]"}</name>
                            <title>I see element {"xpath":"//button[contains(@id, 'menu-btn')]"}</title>
                            <attachments/>
                            <steps/>
                        </step>
                        <step start='1635878307875' status='passed' stop='1635878308112'>
                            <name>I click {"xpath":"//button[contains(@id, 'menu-btn')]"}</name>
                            <title>I click {"xpath":"//button[contains(@id, 'menu-btn')]"}</title>
                            <attachments/>
                            <steps/>
                        </step>
                        <step start='1635878308112' status='passed' stop='1635878308120'>
                            <name>I wait for element {"xpath":"//a[@id='logout_sidebar_link']"}, 10</name>
                            <title>I wait for element {"xpath":"//a[@id='logout_sidebar_link']"}, 10</title>
                            <attachments/>
                            <steps/>
                        </step>
                        <step start='1635878308120' status='passed' stop='1635878308130'>
                            <name>I see element {"xpath":"//a[@id='logout_sidebar_link']"}</name>
                            <title>I see element {"xpath":"//a[@id='logout_sidebar_link']"}</title>
                            <attachments/>
                            <steps/>
                        </step>
                        <step start='1635878308239' status='passed' stop='1635878308477'>
                            <name>I click {"xpath":"//a[@id='logout_sidebar_link']"}</name>
                            <title>I click {"xpath":"//a[@id='logout_sidebar_link']"}</title>
                            <attachments/>
                            <steps/>
                        </step>
                    </steps>
                </step>
                <step start='1635878308477' status='passed' stop='1635878308531'>
                    <name>loginPage: checkPage </name>
                    <title>loginPage: checkPage </title>
                    <attachments/>
                    <steps>
                        <step start='1635878308477' status='passed' stop='1635878308485'>
                            <name>I wait for element {"xpath":"//div[@class = 'login_logo']"}, 10</name>
                            <title>I wait for element {"xpath":"//div[@class = 'login_logo']"}, 10</title>
                            <attachments/>
                            <steps/>
                        </step>
                        <step start='1635878308485' status='passed' stop='1635878308497'>
                            <name>I see element {"xpath":"//div[@class = 'login_logo']"}</name>
                            <title>I see element {"xpath":"//div[@class = 'login_logo']"}</title>
                            <attachments/>
                            <steps/>
                        </step>
                        <step start='1635878308497' status='passed' stop='1635878308503'>
                            <name>I wait for element {"xpath":"//*[@id = 'login-button']"}, 10</name>
                            <title>I wait for element {"xpath":"//*[@id = 'login-button']"}, 10</title>
                            <attachments/>
                            <steps/>
                        </step>
                        <step start='1635878308503' status='passed' stop='1635878308519'>
                            <name>I wait for clickable {"xpath":"//*[@id = 'login-button']"}, 10</name>
                            <title>I wait for clickable {"xpath":"//*[@id = 'login-button']"}, 10</title>
                            <attachments/>
                            <steps/>
                        </step>
                        <step start='1635878308519' status='passed' stop='1635878308529'>
                            <name>I see element {"xpath":"//*[@id = 'login-button']"}</name>
                            <title>I see element {"xpath":"//*[@id = 'login-button']"}</title>
                            <attachments/>
                            <steps/>
                        </step>
                        <step start='1635878308529' status='passed' stop='1635878308531'>
                            <name>I take screenshot "loginPageLoaded.png"</name>
                            <title>I take screenshot "loginPageLoaded.png"</title>
                            <attachments/>
                            <steps/>
                        </step>
                    </steps>
                </step>
            </steps>
            <attachments/>
        </test-case>
        <test-case start='1635878308532' status='passed' stop='1635878309950'>
            <name>User attempts to login as locked out user</name>
            <title>User attempts to login as locked out user</title>
            <labels/>
            <parameters/>
            <steps>
                <step start='1635878308534' status='passed' stop='1635878308535'>
                    <name>loginPage: roleLogin "lockedoutuser"</name>
                    <title>loginPage: roleLogin "lockedoutuser"</title>
                    <attachments/>
                    <steps>
                        <step start='1635878308534' status='passed' stop='1635878308534'>
                            <name>I get data "loginDetails.json"</name>
                            <title>I get data "loginDetails.json"</title>
                            <attachments/>
                            <steps/>
                        </step>
                    </steps>
                </step>
                <step start='1635878308535' status='passed' stop='1635878308641'>
                    <name>I am on page "https://www.saucedemo.com/"</name>
                    <title>I am on page "https://www.saucedemo.com/"</title>
                    <attachments/>
                    <steps/>
                </step>
                <step start='1635878308641' status='passed' stop='1635878308647'>
                    <name>I see in current url "https://www.saucedemo.com/"</name>
                    <title>I see in current url "https://www.saucedemo.com/"</title>
                    <attachments/>
                    <steps/>
                </step>
                <step start='1635878308647' status='passed' stop='1635878308813'>
                    <name>loginPage: checkPage </name>
                    <title>loginPage: checkPage </title>
                    <attachments/>
                    <steps>
                        <step start='1635878308647' status='passed' stop='1635878308655'>
                            <name>I wait for element {"xpath":"//div[@class = 'login_logo']"}, 10</name>
                            <title>I wait for element {"xpath":"//div[@class = 'login_logo']"}, 10</title>
                            <attachments/>
                            <steps/>
                        </step>
                        <step start='1635878308656' status='passed' stop='1635878308668'>
                            <name>I see element {"xpath":"//div[@class = 'login_logo']"}</name>
                            <title>I see element {"xpath":"//div[@class = 'login_logo']"}</title>
                            <attachments/>
                            <steps/>
                        </step>
                        <step start='1635878308668' status='passed' stop='1635878308674'>
                            <name>I wait for element {"xpath":"//*[@id = 'login-button']"}, 10</name>
                            <title>I wait for element {"xpath":"//*[@id = 'login-button']"}, 10</title>
                            <attachments/>
                            <steps/>
                        </step>
                        <step start='1635878308674' status='passed' stop='1635878308692'>
                            <name>I wait for clickable {"xpath":"//*[@id = 'login-button']"}, 10</name>
                            <title>I wait for clickable {"xpath":"//*[@id = 'login-button']"}, 10</title>
                            <attachments/>
                            <steps/>
                        </step>
                        <step start='1635878308692' status='passed' stop='1635878308706'>
                            <name>I see element {"xpath":"//*[@id = 'login-button']"}</name>
                            <title>I see element {"xpath":"//*[@id = 'login-button']"}</title>
                            <attachments/>
                            <steps/>
                        </step>
                        <step start='1635878308706' status='passed' stop='1635878308708'>
                            <name>I take screenshot "loginPageLoaded.png"</name>
                            <title>I take screenshot "loginPageLoaded.png"</title>
                            <attachments/>
                            <steps/>
                        </step>
                    </steps>
                </step>
                <step start='1635878308813' status='passed' stop='1635878309069'>
                    <name>I fill field {"xpath":"//input[@id = 'user-name']"}, "locked_out_user"</name>
                    <title>I fill field {"xpath":"//input[@id = 'user-name']"}, "locked_out_user"</title>
                    <attachments/>
                    <steps/>
                </step>
                <step start='1635878309180' status='passed' stop='1635878309429'>
                    <name>I fill field {"xpath":"//input[@id = 'password']"}, "secret_sauce"</name>
                    <title>I fill field {"xpath":"//input[@id = 'password']"}, "secret_sauce"</title>
                    <attachments/>
                    <steps/>
                </step>
                <step start='1635878309429' status='passed' stop='1635878309431'>
                    <name>I take screenshot "loginPageFilled.png"</name>
                    <title>I take screenshot "loginPageFilled.png"</title>
                    <attachments/>
                    <steps/>
                </step>
                <step start='1635878309541' status='passed' stop='1635878309778'>
                    <name>I click {"xpath":"//*[@id = 'login-button']"}</name>
                    <title>I click {"xpath":"//*[@id = 'login-button']"}</title>
                    <attachments/>
                    <steps/>
                </step>
                <step start='1635878309778' status='passed' stop='1635878309800'>
                    <name>loginPage: checkError </name>
                    <title>loginPage: checkError </title>
                    <attachments/>
                    <steps>
                        <step start='1635878309778' status='passed' stop='1635878309788'>
                            <name>I wait for element {"xpath":"//h3[@data-test = 'error']"}, 10</name>
                            <title>I wait for element {"xpath":"//h3[@data-test = 'error']"}, 10</title>
                            <attachments/>
                            <steps/>
                        </step>
                        <step start='1635878309788' status='passed' stop='1635878309798'>
                            <name>I see element {"xpath":"//h3[@data-test = 'error']"}</name>
                            <title>I see element {"xpath":"//h3[@data-test = 'error']"}</title>
                            <attachments/>
                            <steps/>
                        </step>
                        <step start='1635878309798' status='passed' stop='1635878309799'>
                            <name>I take screenshot "LoginError.png"</name>
                            <title>I take screenshot "LoginError.png"</title>
                            <attachments/>
                            <steps/>
                        </step>
                    </steps>
                </step>
                <step start='1635878309800' status='passed' stop='1635878309950'>
                    <name>loginPage: clearLoginFields </name>
                    <title>loginPage: clearLoginFields </title>
                    <attachments/>
                    <steps>
                        <step start='1635878309800' status='passed' stop='1635878309898'>
                            <name>I clear field {"xpath":"//input[@id = 'user-name']"}</name>
                            <title>I clear field {"xpath":"//input[@id = 'user-name']"}</title>
                            <attachments/>
                            <steps/>
                        </step>
                        <step start='1635878309898' status='passed' stop='1635878309916'>
                            <name>I clear field {"xpath":"//input[@id = 'password']"}</name>
                            <title>I clear field {"xpath":"//input[@id = 'password']"}</title>
                            <attachments/>
                            <steps/>
                        </step>
                        <step start='1635878309916' status='passed' stop='1635878309934'>
                            <name>I see in field {"xpath":"//input[@id = 'user-name']"}, </name>
                            <title>I see in field {"xpath":"//input[@id = 'user-name']"}, </title>
                            <attachments/>
                            <steps/>
                        </step>
                        <step start='1635878309934' status='passed' stop='1635878309950'>
                            <name>I see in field {"xpath":"//input[@id = 'password']"}, </name>
                            <title>I see in field {"xpath":"//input[@id = 'password']"}, </title>
                            <attachments/>
                            <steps/>
                        </step>
                    </steps>
                </step>
            </steps>
            <attachments/>
        </test-case>
    </test-cases>
</ns2:test-suite>