<?xml version='1.0'?>
<ns2:test-suite xmlns:ns2='urn:model.allure.qatools.yandex.ru' start='1635873391572' stop='1635873410596'>
    <name>Validate Login Page allows successful Login:</name>
    <title>Validate Login Page allows successful Login:</title>
    <test-cases>
        <test-case start='1635873399784' status='passed' stop='1635873402590'>
            <name>User logs into website successfully and logs out</name>
            <title>User logs into website successfully and logs out</title>
            <labels/>
            <parameters/>
            <steps>
                <step start='1635873399792' status='passed' stop='1635873399794'>
                    <name>loginPage: roleLogin "standardUser"</name>
                    <title>loginPage: roleLogin "standardUser"</title>
                    <attachments/>
                    <steps>
                        <step start='1635873399792' status='passed' stop='1635873399793'>
                            <name>I get data "loginDetails.json"</name>
                            <title>I get data "loginDetails.json"</title>
                            <attachments/>
                            <steps/>
                        </step>
                    </steps>
                </step>
                <step start='1635873399794' status='passed' stop='1635873400026'>
                    <name>I am on page "https://www.saucedemo.com/"</name>
                    <title>I am on page "https://www.saucedemo.com/"</title>
                    <attachments/>
                    <steps/>
                </step>
                <step start='1635873400026' status='passed' stop='1635873400034'>
                    <name>I see in current url "https://www.saucedemo.com/"</name>
                    <title>I see in current url "https://www.saucedemo.com/"</title>
                    <attachments/>
                    <steps/>
                </step>
                <step start='1635873400034' status='passed' stop='1635873400218'>
                    <name>loginPage: checkPage </name>
                    <title>loginPage: checkPage </title>
                    <attachments/>
                    <steps>
                        <step start='1635873400034' status='passed' stop='1635873400048'>
                            <name>I wait for element {"xpath":"//div[@class = 'login_logo']"}, 10</name>
                            <title>I wait for element {"xpath":"//div[@class = 'login_logo']"}, 10</title>
                            <attachments/>
                            <steps/>
                        </step>
                        <step start='1635873400048' status='passed' stop='1635873400067'>
                            <name>I see element {"xpath":"//div[@class = 'login_logo']"}</name>
                            <title>I see element {"xpath":"//div[@class = 'login_logo']"}</title>
                            <attachments/>
                            <steps/>
                        </step>
                        <step start='1635873400067' status='passed' stop='1635873400078'>
                            <name>I wait for element {"xpath":"//*[@id = 'login-button']"}, 10</name>
                            <title>I wait for element {"xpath":"//*[@id = 'login-button']"}, 10</title>
                            <attachments/>
                            <steps/>
                        </step>
                        <step start='1635873400078' status='passed' stop='1635873400101'>
                            <name>I wait for clickable {"xpath":"//*[@id = 'login-button']"}, 10</name>
                            <title>I wait for clickable {"xpath":"//*[@id = 'login-button']"}, 10</title>
                            <attachments/>
                            <steps/>
                        </step>
                        <step start='1635873400101' status='passed' stop='1635873400115'>
                            <name>I see element {"xpath":"//*[@id = 'login-button']"}</name>
                            <title>I see element {"xpath":"//*[@id = 'login-button']"}</title>
                            <attachments/>
                            <steps/>
                        </step>
                        <step start='1635873400115' status='passed' stop='1635873400117'>
                            <name>I take screenshot "loginPageLoaded.png"</name>
                            <title>I take screenshot "loginPageLoaded.png"</title>
                            <attachments/>
                            <steps/>
                        </step>
                    </steps>
                </step>
                <step start='1635873400218' status='passed' stop='1635873400491'>
                    <name>I fill field {"xpath":"//input[@id = 'user-name']"}, "standard_user"</name>
                    <title>I fill field {"xpath":"//input[@id = 'user-name']"}, "standard_user"</title>
                    <attachments/>
                    <steps/>
                </step>
                <step start='1635873400602' status='passed' stop='1635873400872'>
                    <name>I fill field {"xpath":"//input[@id = 'password']"}, "secret_sauce"</name>
                    <title>I fill field {"xpath":"//input[@id = 'password']"}, "secret_sauce"</title>
                    <attachments/>
                    <steps/>
                </step>
                <step start='1635873400872' status='passed' stop='1635873400874'>
                    <name>I take screenshot "loginPageFilled.png"</name>
                    <title>I take screenshot "loginPageFilled.png"</title>
                    <attachments/>
                    <steps/>
                </step>
                <step start='1635873400982' status='passed' stop='1635873401241'>
                    <name>I click {"xpath":"//*[@id = 'login-button']"}</name>
                    <title>I click {"xpath":"//*[@id = 'login-button']"}</title>
                    <attachments/>
                    <steps/>
                </step>
                <step start='1635873401242' status='passed' stop='1635873401291'>
                    <name>homePage: checkPage </name>
                    <title>homePage: checkPage </title>
                    <attachments/>
                    <steps>
                        <step start='1635873401242' status='passed' stop='1635873401254'>
                            <name>I wait for element {"xpath":"//div[@class = 'app_logo']"}, 10</name>
                            <title>I wait for element {"xpath":"//div[@class = 'app_logo']"}, 10</title>
                            <attachments/>
                            <steps/>
                        </step>
                        <step start='1635873401254' status='passed' stop='1635873401268'>
                            <name>I see element {"xpath":"//div[@class = 'app_logo']"}</name>
                            <title>I see element {"xpath":"//div[@class = 'app_logo']"}</title>
                            <attachments/>
                            <steps/>
                        </step>
                        <step start='1635873401268' status='passed' stop='1635873401279'>
                            <name>I wait for element {"xpath":"//*[contains(text(), 'Products')]"}, 10</name>
                            <title>I wait for element {"xpath":"//*[contains(text(), 'Products')]"}, 10</title>
                            <attachments/>
                            <steps/>
                        </step>
                        <step start='1635873401279' status='passed' stop='1635873401291'>
                            <name>I see element {"xpath":"//*[contains(text(), 'Products')]"}</name>
                            <title>I see element {"xpath":"//*[contains(text(), 'Products')]"}</title>
                            <attachments/>
                            <steps/>
                        </step>
                    </steps>
                </step>
                <step start='1635873401291' status='passed' stop='1635873402537'>
                    <name>homePage: logOut </name>
                    <title>homePage: logOut </title>
                    <attachments/>
                    <steps>
                        <step start='1635873401291' status='passed' stop='1635873401789'>
                            <name>I dont see element {"xpath":"//a[@id='logout_sidebar_link']"}</name>
                            <title>I dont see element {"xpath":"//a[@id='logout_sidebar_link']"}</title>
                            <attachments/>
                            <steps/>
                        </step>
                        <step start='1635873401789' status='passed' stop='1635873401798'>
                            <name>I wait for element {"xpath":"//button[contains(@id, 'menu-btn')]"}, 10</name>
                            <title>I wait for element {"xpath":"//button[contains(@id, 'menu-btn')]"}, 10</title>
                            <attachments/>
                            <steps/>
                        </step>
                        <step start='1635873401798' status='passed' stop='1635873401815'>
                            <name>I wait for clickable {"xpath":"//button[contains(@id, 'menu-btn')]"}, 5</name>
                            <title>I wait for clickable {"xpath":"//button[contains(@id, 'menu-btn')]"}, 5</title>
                            <attachments/>
                            <steps/>
                        </step>
                        <step start='1635873401815' status='passed' stop='1635873401827'>
                            <name>I see element {"xpath":"//button[contains(@id, 'menu-btn')]"}</name>
                            <title>I see element {"xpath":"//button[contains(@id, 'menu-btn')]"}</title>
                            <attachments/>
                            <steps/>
                        </step>
                        <step start='1635873401933' status='passed' stop='1635873402170'>
                            <name>I click {"xpath":"//button[contains(@id, 'menu-btn')]"}</name>
                            <title>I click {"xpath":"//button[contains(@id, 'menu-btn')]"}</title>
                            <attachments/>
                            <steps/>
                        </step>
                        <step start='1635873402170' status='passed' stop='1635873402178'>
                            <name>I wait for element {"xpath":"//a[@id='logout_sidebar_link']"}, 10</name>
                            <title>I wait for element {"xpath":"//a[@id='logout_sidebar_link']"}, 10</title>
                            <attachments/>
                            <steps/>
                        </step>
                        <step start='1635873402178' status='passed' stop='1635873402189'>
                            <name>I see element {"xpath":"//a[@id='logout_sidebar_link']"}</name>
                            <title>I see element {"xpath":"//a[@id='logout_sidebar_link']"}</title>
                            <attachments/>
                            <steps/>
                        </step>
                        <step start='1635873402297' status='passed' stop='1635873402536'>
                            <name>I click {"xpath":"//a[@id='logout_sidebar_link']"}</name>
                            <title>I click {"xpath":"//a[@id='logout_sidebar_link']"}</title>
                            <attachments/>
                            <steps/>
                        </step>
                    </steps>
                </step>
                <step start='1635873402537' status='passed' stop='1635873402590'>
                    <name>loginPage: checkPage </name>
                    <title>loginPage: checkPage </title>
                    <attachments/>
                    <steps>
                        <step start='1635873402537' status='passed' stop='1635873402544'>
                            <name>I wait for element {"xpath":"//div[@class = 'login_logo']"}, 10</name>
                            <title>I wait for element {"xpath":"//div[@class = 'login_logo']"}, 10</title>
                            <attachments/>
                            <steps/>
                        </step>
                        <step start='1635873402544' status='passed' stop='1635873402556'>
                            <name>I see element {"xpath":"//div[@class = 'login_logo']"}</name>
                            <title>I see element {"xpath":"//div[@class = 'login_logo']"}</title>
                            <attachments/>
                            <steps/>
                        </step>
                        <step start='1635873402556' status='passed' stop='1635873402562'>
                            <name>I wait for element {"xpath":"//*[@id = 'login-button']"}, 10</name>
                            <title>I wait for element {"xpath":"//*[@id = 'login-button']"}, 10</title>
                            <attachments/>
                            <steps/>
                        </step>
                        <step start='1635873402562' status='passed' stop='1635873402578'>
                            <name>I wait for clickable {"xpath":"//*[@id = 'login-button']"}, 10</name>
                            <title>I wait for clickable {"xpath":"//*[@id = 'login-button']"}, 10</title>
                            <attachments/>
                            <steps/>
                        </step>
                        <step start='1635873402578' status='passed' stop='1635873402589'>
                            <name>I see element {"xpath":"//*[@id = 'login-button']"}</name>
                            <title>I see element {"xpath":"//*[@id = 'login-button']"}</title>
                            <attachments/>
                            <steps/>
                        </step>
                        <step start='1635873402589' status='passed' stop='1635873402590'>
                            <name>I take screenshot "loginPageLoaded.png"</name>
                            <title>I take screenshot "loginPageLoaded.png"</title>
                            <attachments/>
                            <steps/>
                        </step>
                    </steps>
                </step>
            </steps>
            <attachments/>
        </test-case>
        <test-case start='1635873402592' status='failed' stop='1635873408803'>
            <name>User attempts to login as locked out user</name>
            <title>User attempts to login as locked out user</title>
            <labels/>
            <parameters/>
            <steps>
                <step start='1635873402593' status='passed' stop='1635873402594'>
                    <name>loginPage: roleLogin "lockedoutuser"</name>
                    <title>loginPage: roleLogin "lockedoutuser"</title>
                    <attachments/>
                    <steps>
                        <step start='1635873402593' status='passed' stop='1635873402594'>
                            <name>I get data "loginDetails.json"</name>
                            <title>I get data "loginDetails.json"</title>
                            <attachments/>
                            <steps/>
                        </step>
                    </steps>
                </step>
                <step start='1635873402594' status='passed' stop='1635873402706'>
                    <name>I am on page "https://www.saucedemo.com/"</name>
                    <title>I am on page "https://www.saucedemo.com/"</title>
                    <attachments/>
                    <steps/>
                </step>
                <step start='1635873402706' status='passed' stop='1635873402711'>
                    <name>I see in current url "https://www.saucedemo.com/"</name>
                    <title>I see in current url "https://www.saucedemo.com/"</title>
                    <attachments/>
                    <steps/>
                </step>
                <step start='1635873402711' status='passed' stop='1635873402873'>
                    <name>loginPage: checkPage </name>
                    <title>loginPage: checkPage </title>
                    <attachments/>
                    <steps>
                        <step start='1635873402711' status='passed' stop='1635873402720'>
                            <name>I wait for element {"xpath":"//div[@class = 'login_logo']"}, 10</name>
                            <title>I wait for element {"xpath":"//div[@class = 'login_logo']"}, 10</title>
                            <attachments/>
                            <steps/>
                        </step>
                        <step start='1635873402720' status='passed' stop='1635873402732'>
                            <name>I see element {"xpath":"//div[@class = 'login_logo']"}</name>
                            <title>I see element {"xpath":"//div[@class = 'login_logo']"}</title>
                            <attachments/>
                            <steps/>
                        </step>
                        <step start='1635873402732' status='passed' stop='1635873402738'>
                            <name>I wait for element {"xpath":"//*[@id = 'login-button']"}, 10</name>
                            <title>I wait for element {"xpath":"//*[@id = 'login-button']"}, 10</title>
                            <attachments/>
                            <steps/>
                        </step>
                        <step start='1635873402738' status='passed' stop='1635873402756'>
                            <name>I wait for clickable {"xpath":"//*[@id = 'login-button']"}, 10</name>
                            <title>I wait for clickable {"xpath":"//*[@id = 'login-button']"}, 10</title>
                            <attachments/>
                            <steps/>
                        </step>
                        <step start='1635873402756' status='passed' stop='1635873402768'>
                            <name>I see element {"xpath":"//*[@id = 'login-button']"}</name>
                            <title>I see element {"xpath":"//*[@id = 'login-button']"}</title>
                            <attachments/>
                            <steps/>
                        </step>
                        <step start='1635873402768' status='passed' stop='1635873402769'>
                            <name>I take screenshot "loginPageLoaded.png"</name>
                            <title>I take screenshot "loginPageLoaded.png"</title>
                            <attachments/>
                            <steps/>
                        </step>
                    </steps>
                </step>
                <step start='1635873402873' status='passed' stop='1635873403127'>
                    <name>I fill field {"xpath":"//input[@id = 'user-name']"}, "locked_out_user"</name>
                    <title>I fill field {"xpath":"//input[@id = 'user-name']"}, "locked_out_user"</title>
                    <attachments/>
                    <steps/>
                </step>
                <step start='1635873403238' status='passed' stop='1635873403492'>
                    <name>I fill field {"xpath":"//input[@id = 'password']"}, "secret_sauce"</name>
                    <title>I fill field {"xpath":"//input[@id = 'password']"}, "secret_sauce"</title>
                    <attachments/>
                    <steps/>
                </step>
                <step start='1635873403492' status='passed' stop='1635873403494'>
                    <name>I take screenshot "loginPageFilled.png"</name>
                    <title>I take screenshot "loginPageFilled.png"</title>
                    <attachments/>
                    <steps/>
                </step>
                <step start='1635873403604' status='passed' stop='1635873403839'>
                    <name>I click {"xpath":"//*[@id = 'login-button']"}</name>
                    <title>I click {"xpath":"//*[@id = 'login-button']"}</title>
                    <attachments/>
                    <steps/>
                </step>
                <step start='1635873403839' status='passed' stop='1635873403860'>
                    <name>loginPage: checkError </name>
                    <title>loginPage: checkError </title>
                    <attachments/>
                    <steps>
                        <step start='1635873403839' status='passed' stop='1635873403849'>
                            <name>I wait for element {"xpath":"//h3[@data-test = 'error']"}, 10</name>
                            <title>I wait for element {"xpath":"//h3[@data-test = 'error']"}, 10</title>
                            <attachments/>
                            <steps/>
                        </step>
                        <step start='1635873403849' status='passed' stop='1635873403859'>
                            <name>I see element {"xpath":"//h3[@data-test = 'error']"}</name>
                            <title>I see element {"xpath":"//h3[@data-test = 'error']"}</title>
                            <attachments/>
                            <steps/>
                        </step>
                        <step start='1635873403859' status='passed' stop='1635873403860'>
                            <name>I take screenshot "LoginError.png"</name>
                            <title>I take screenshot "LoginError.png"</title>
                            <attachments/>
                            <steps/>
                        </step>
                    </steps>
                </step>
                <step start='1635873403860' status='failed' stop='1635873408803'>
                    <name>loginPage: clearFields </name>
                    <title>loginPage: clearFields </title>
                    <attachments/>
                    <steps>
                        <step start='1635873403860' status='passed' stop='1635873403983'>
                            <name>I clear field {"xpath":"//input[@id = 'user-name']"}</name>
                            <title>I clear field {"xpath":"//input[@id = 'user-name']"}</title>
                            <attachments/>
                            <steps/>
                        </step>
                        <step start='1635873403983' status='passed' stop='1635873404000'>
                            <name>I clear field {"xpath":"//input[@id = 'password']"}</name>
                            <title>I clear field {"xpath":"//input[@id = 'password']"}</title>
                            <attachments/>
                            <steps/>
                        </step>
                        <step start='1635873404000' status='failed' stop='1635873408803'>
                            <name>I see in field {"xpath":"//input[@id = 'user-name']"}, </name>
                            <title>I see in field {"xpath":"//input[@id = 'user-name']"}, </title>
                            <attachments/>
                            <steps/>
                        </step>
                    </steps>
                </step>
            </steps>
            <attachments>
                <attachment title='Last Seen Screenshot' source='3ceafa20-bcf9-41d1-9864-ba668139c804-attachment.png' type='image/png' size='57909'/>
            </attachments>
            <failure>
                <message></message>
                <stack-trace>undefined</stack-trace>
            </failure>
        </test-case>
    </test-cases>
</ns2:test-suite>