<?xml version='1.0'?>
<ns2:test-suite xmlns:ns2='urn:model.allure.qatools.yandex.ru' start='1636474025696' stop='1636474056680'>
    <name>User purchases items from SauceDemo.com:</name>
    <title>User purchases items from SauceDemo.com:</title>
    <test-cases>
        <test-case start='1636474033539' status='passed' stop='1636474035050'>
            <name>User logs into website successfully</name>
            <title>User logs into website successfully</title>
            <labels/>
            <parameters/>
            <steps>
                <step start='1636474033545' status='passed' stop='1636474033547'>
                    <name>loginPage: roleLogin "standardUser"</name>
                    <title>loginPage: roleLogin "standardUser"</title>
                    <attachments/>
                    <steps>
                        <step start='1636474033546' status='passed' stop='1636474033547'>
                            <name>I get data "loginDetails.json"</name>
                            <title>I get data "loginDetails.json"</title>
                            <attachments/>
                            <steps/>
                        </step>
                    </steps>
                </step>
                <step start='1636474033547' status='passed' stop='1636474033778'>
                    <name>I am on page "https://www.saucedemo.com/"</name>
                    <title>I am on page "https://www.saucedemo.com/"</title>
                    <attachments/>
                    <steps/>
                </step>
                <step start='1636474033778' status='passed' stop='1636474033786'>
                    <name>I see in current url "https://www.saucedemo.com/"</name>
                    <title>I see in current url "https://www.saucedemo.com/"</title>
                    <attachments/>
                    <steps/>
                </step>
                <step start='1636474033786' status='passed' stop='1636474033973'>
                    <name>loginPage: checkPage </name>
                    <title>loginPage: checkPage </title>
                    <attachments/>
                    <steps>
                        <step start='1636474033786' status='passed' stop='1636474033799'>
                            <name>I wait for element {"xpath":"//div[@class = 'login_logo']"}, 10</name>
                            <title>I wait for element {"xpath":"//div[@class = 'login_logo']"}, 10</title>
                            <attachments/>
                            <steps/>
                        </step>
                        <step start='1636474033799' status='passed' stop='1636474033816'>
                            <name>I see element {"xpath":"//div[@class = 'login_logo']"}</name>
                            <title>I see element {"xpath":"//div[@class = 'login_logo']"}</title>
                            <attachments/>
                            <steps/>
                        </step>
                        <step start='1636474033817' status='passed' stop='1636474033828'>
                            <name>I wait for element {"xpath":"//*[@id = 'login-button']"}, 10</name>
                            <title>I wait for element {"xpath":"//*[@id = 'login-button']"}, 10</title>
                            <attachments/>
                            <steps/>
                        </step>
                        <step start='1636474033828' status='passed' stop='1636474033851'>
                            <name>I wait for clickable {"xpath":"//*[@id = 'login-button']"}, 10</name>
                            <title>I wait for clickable {"xpath":"//*[@id = 'login-button']"}, 10</title>
                            <attachments/>
                            <steps/>
                        </step>
                        <step start='1636474033851' status='passed' stop='1636474033867'>
                            <name>I see element {"xpath":"//*[@id = 'login-button']"}</name>
                            <title>I see element {"xpath":"//*[@id = 'login-button']"}</title>
                            <attachments/>
                            <steps/>
                        </step>
                        <step start='1636474033867' status='passed' stop='1636474033869'>
                            <name>I take screenshot "loginPageLoaded.png"</name>
                            <title>I take screenshot "loginPageLoaded.png"</title>
                            <attachments/>
                            <steps/>
                        </step>
                    </steps>
                </step>
                <step start='1636474033973' status='passed' stop='1636474034244'>
                    <name>I fill field {"xpath":"//input[@id = 'user-name']"}, "standard_user"</name>
                    <title>I fill field {"xpath":"//input[@id = 'user-name']"}, "standard_user"</title>
                    <attachments/>
                    <steps/>
                </step>
                <step start='1636474034353' status='passed' stop='1636474034622'>
                    <name>I fill field {"xpath":"//input[@id = 'password']"}, "secret_sauce"</name>
                    <title>I fill field {"xpath":"//input[@id = 'password']"}, "secret_sauce"</title>
                    <attachments/>
                    <steps/>
                </step>
                <step start='1636474034622' status='passed' stop='1636474034624'>
                    <name>I take screenshot "loginPageFilled.png"</name>
                    <title>I take screenshot "loginPageFilled.png"</title>
                    <attachments/>
                    <steps/>
                </step>
                <step start='1636474034731' status='passed' stop='1636474035002'>
                    <name>I click {"xpath":"//*[@id = 'login-button']"}</name>
                    <title>I click {"xpath":"//*[@id = 'login-button']"}</title>
                    <attachments/>
                    <steps/>
                </step>
                <step start='1636474035002' status='passed' stop='1636474035050'>
                    <name>homePage: checkPage </name>
                    <title>homePage: checkPage </title>
                    <attachments/>
                    <steps>
                        <step start='1636474035002' status='passed' stop='1636474035015'>
                            <name>I wait for element {"xpath":"//div[@class = 'app_logo']"}, 5</name>
                            <title>I wait for element {"xpath":"//div[@class = 'app_logo']"}, 5</title>
                            <attachments/>
                            <steps/>
                        </step>
                        <step start='1636474035015' status='passed' stop='1636474035028'>
                            <name>I see element {"xpath":"//div[@class = 'app_logo']"}</name>
                            <title>I see element {"xpath":"//div[@class = 'app_logo']"}</title>
                            <attachments/>
                            <steps/>
                        </step>
                        <step start='1636474035029' status='passed' stop='1636474035038'>
                            <name>I wait for element {"xpath":"//*[contains(text(), 'Products')]"}, 10</name>
                            <title>I wait for element {"xpath":"//*[contains(text(), 'Products')]"}, 10</title>
                            <attachments/>
                            <steps/>
                        </step>
                        <step start='1636474035038' status='passed' stop='1636474035050'>
                            <name>I see element {"xpath":"//*[contains(text(), 'Products')]"}</name>
                            <title>I see element {"xpath":"//*[contains(text(), 'Products')]"}</title>
                            <attachments/>
                            <steps/>
                        </step>
                    </steps>
                </step>
            </steps>
            <attachments/>
        </test-case>
        <test-case start='1636474035051' status='failed' stop='1636474041066'>
            <name>User adds items to their cart that they want to purchase</name>
            <title>User adds items to their cart that they want to purchase</title>
            <labels/>
            <parameters/>
            <steps>
                <step start='1636474035054' status='passed' stop='1636474035810'>
                    <name>homePage: addItemToCart "backpack"</name>
                    <title>homePage: addItemToCart "backpack"</title>
                    <attachments/>
                    <steps>
                        <step start='1636474035054' status='passed' stop='1636474035075'>
                            <name>I wait for clickable {"xpath":"//*[contains(@id, 'add-to-cart') and contains(@id, 'backpack')]"}, 10</name>
                            <title>I wait for clickable {"xpath":"//*[contains(@id, 'add-to-cart') and contains(@id, 'backpack')]"}, 10</title>
                            <attachments/>
                            <steps/>
                        </step>
                        <step start='1636474035075' status='passed' stop='1636474035087'>
                            <name>I see element {"xpath":"//*[contains(@id, 'add-to-cart') and contains(@id, 'backpack')]"}</name>
                            <title>I see element {"xpath":"//*[contains(@id, 'add-to-cart') and contains(@id, 'backpack')]"}</title>
                            <attachments/>
                            <steps/>
                        </step>
                        <step start='1636474035192' status='passed' stop='1636474035431'>
                            <name>I click {"xpath":"//*[contains(@id, 'add-to-cart') and contains(@id, 'backpack')]"}</name>
                            <title>I click {"xpath":"//*[contains(@id, 'add-to-cart') and contains(@id, 'backpack')]"}</title>
                            <attachments/>
                            <steps/>
                        </step>
                        <step start='1636474035431' status='passed' stop='1636474035449'>
                            <name>I see element {"xpath":"//*[contains(@id, 'remove') and contains(@id, 'backpack')]"}</name>
                            <title>I see element {"xpath":"//*[contains(@id, 'remove') and contains(@id, 'backpack')]"}</title>
                            <attachments/>
                            <steps/>
                        </step>
                        <step start='1636474035449' status='passed' stop='1636474035467'>
                            <name>I wait for clickable {"xpath":"//*[@class='shopping_cart_link']"}, 10</name>
                            <title>I wait for clickable {"xpath":"//*[@class='shopping_cart_link']"}, 10</title>
                            <attachments/>
                            <steps/>
                        </step>
                        <step start='1636474035574' status='passed' stop='1636474035809'>
                            <name>I click {"xpath":"//*[@class='shopping_cart_link']"}</name>
                            <title>I click {"xpath":"//*[@class='shopping_cart_link']"}</title>
                            <attachments/>
                            <steps/>
                        </step>
                        <step start='1636474035809' status='passed' stop='1636474035810'>
                            <name>I get data "shoppingItems.json"</name>
                            <title>I get data "shoppingItems.json"</title>
                            <attachments/>
                            <steps/>
                        </step>
                    </steps>
                </step>
                <step start='1636474035810' status='passed' stop='1636474035830'>
                    <name>I grab text from all {"xpath":"//*[@class='inventory_item_name']"}</name>
                    <title>I grab text from all {"xpath":"//*[@class='inventory_item_name']"}</title>
                    <attachments/>
                    <steps/>
                </step>
                <step start='1636474035831' status='passed' stop='1636474035831'>
                    <name>I assert equal "Sauce Labs Backpack", "Sauce Labs Backpack"</name>
                    <title>I assert equal "Sauce Labs Backpack", "Sauce Labs Backpack"</title>
                    <attachments/>
                    <steps/>
                </step>
                <step start='1636474035831' status='passed' stop='1636474035852'>
                    <name>I see text equals "$29.99", {"xpath":"//*[contains(text(), 'Sauce Labs Backpack')]//following::div[@class='inventory_item_price' and text()='29.99']"}</name>
                    <title>I see text equals "$29.99", {"xpath":"//*[contains(text(), 'Sauce Labs Backpack')]//following::div[@class='inventory_item_price' and text()='29.99']"}</title>
                    <attachments/>
                    <steps/>
                </step>
                <step start='1636474035852' status='passed' stop='1636474036219'>
                    <name>cartPage: goToHomePage </name>
                    <title>cartPage: goToHomePage </title>
                    <attachments/>
                    <steps>
                        <step start='1636474035852' status='passed' stop='1636474035872'>
                            <name>I wait for clickable {"xpath":"//button[contains(text(), 'Continue')]"}, 10</name>
                            <title>I wait for clickable {"xpath":"//button[contains(text(), 'Continue')]"}, 10</title>
                            <attachments/>
                            <steps/>
                        </step>
                        <step start='1636474035872' status='passed' stop='1636474035883'>
                            <name>I see element {"xpath":"//button[contains(text(), 'Continue')]"}</name>
                            <title>I see element {"xpath":"//button[contains(text(), 'Continue')]"}</title>
                            <attachments/>
                            <steps/>
                        </step>
                        <step start='1636474035983' status='passed' stop='1636474036219'>
                            <name>I click {"xpath":"//button[contains(text(), 'Continue')]"}</name>
                            <title>I click {"xpath":"//button[contains(text(), 'Continue')]"}</title>
                            <attachments/>
                            <steps/>
                        </step>
                    </steps>
                </step>
                <step start='1636474036219' status='passed' stop='1636474036258'>
                    <name>homePage: checkPage </name>
                    <title>homePage: checkPage </title>
                    <attachments/>
                    <steps>
                        <step start='1636474036219' status='passed' stop='1636474036227'>
                            <name>I wait for element {"xpath":"//div[@class = 'app_logo']"}, 5</name>
                            <title>I wait for element {"xpath":"//div[@class = 'app_logo']"}, 5</title>
                            <attachments/>
                            <steps/>
                        </step>
                        <step start='1636474036227' status='passed' stop='1636474036238'>
                            <name>I see element {"xpath":"//div[@class = 'app_logo']"}</name>
                            <title>I see element {"xpath":"//div[@class = 'app_logo']"}</title>
                            <attachments/>
                            <steps/>
                        </step>
                        <step start='1636474036238' status='passed' stop='1636474036246'>
                            <name>I wait for element {"xpath":"//*[contains(text(), 'Products')]"}, 10</name>
                            <title>I wait for element {"xpath":"//*[contains(text(), 'Products')]"}, 10</title>
                            <attachments/>
                            <steps/>
                        </step>
                        <step start='1636474036246' status='passed' stop='1636474036258'>
                            <name>I see element {"xpath":"//*[contains(text(), 'Products')]"}</name>
                            <title>I see element {"xpath":"//*[contains(text(), 'Products')]"}</title>
                            <attachments/>
                            <steps/>
                        </step>
                    </steps>
                </step>
                <step start='1636474036258' status='passed' stop='1636474037008'>
                    <name>homePage: addItemToCart "bike"</name>
                    <title>homePage: addItemToCart "bike"</title>
                    <attachments/>
                    <steps>
                        <step start='1636474036258' status='passed' stop='1636474036277'>
                            <name>I wait for clickable {"xpath":"//*[contains(@id, 'add-to-cart') and contains(@id, 'bike')]"}, 10</name>
                            <title>I wait for clickable {"xpath":"//*[contains(@id, 'add-to-cart') and contains(@id, 'bike')]"}, 10</title>
                            <attachments/>
                            <steps/>
                        </step>
                        <step start='1636474036277' status='passed' stop='1636474036287'>
                            <name>I see element {"xpath":"//*[contains(@id, 'add-to-cart') and contains(@id, 'bike')]"}</name>
                            <title>I see element {"xpath":"//*[contains(@id, 'add-to-cart') and contains(@id, 'bike')]"}</title>
                            <attachments/>
                            <steps/>
                        </step>
                        <step start='1636474036394' status='passed' stop='1636474036628'>
                            <name>I click {"xpath":"//*[contains(@id, 'add-to-cart') and contains(@id, 'bike')]"}</name>
                            <title>I click {"xpath":"//*[contains(@id, 'add-to-cart') and contains(@id, 'bike')]"}</title>
                            <attachments/>
                            <steps/>
                        </step>
                        <step start='1636474036629' status='passed' stop='1636474036644'>
                            <name>I see element {"xpath":"//*[contains(@id, 'remove') and contains(@id, 'bike')]"}</name>
                            <title>I see element {"xpath":"//*[contains(@id, 'remove') and contains(@id, 'bike')]"}</title>
                            <attachments/>
                            <steps/>
                        </step>
                        <step start='1636474036644' status='passed' stop='1636474036660'>
                            <name>I wait for clickable {"xpath":"//*[@class='shopping_cart_link']"}, 10</name>
                            <title>I wait for clickable {"xpath":"//*[@class='shopping_cart_link']"}, 10</title>
                            <attachments/>
                            <steps/>
                        </step>
                        <step start='1636474036773' status='passed' stop='1636474037008'>
                            <name>I click {"xpath":"//*[@class='shopping_cart_link']"}</name>
                            <title>I click {"xpath":"//*[@class='shopping_cart_link']"}</title>
                            <attachments/>
                            <steps/>
                        </step>
                        <step start='1636474037008' status='passed' stop='1636474037008'>
                            <name>I get data "shoppingItems.json"</name>
                            <title>I get data "shoppingItems.json"</title>
                            <attachments/>
                            <steps/>
                        </step>
                    </steps>
                </step>
                <step start='1636474037008' status='passed' stop='1636474037033'>
                    <name>I grab text from all {"xpath":"//*[@class='inventory_item_name']"}</name>
                    <title>I grab text from all {"xpath":"//*[@class='inventory_item_name']"}</title>
                    <attachments/>
                    <steps/>
                </step>
                <step start='1636474037033' status='passed' stop='1636474037034'>
                    <name>I assert equal "Sauce Labs Bike Light", "Sauce Labs Bike Light"</name>
                    <title>I assert equal "Sauce Labs Bike Light", "Sauce Labs Bike Light"</title>
                    <attachments/>
                    <steps/>
                </step>
                <step start='1636474037034' status='passed' stop='1636474037050'>
                    <name>I see text equals "$9.99", {"xpath":"//*[contains(text(), 'Sauce Labs Bike Light')]//following::div[@class='inventory_item_price' and text()='9.99']"}</name>
                    <title>I see text equals "$9.99", {"xpath":"//*[contains(text(), 'Sauce Labs Bike Light')]//following::div[@class='inventory_item_price' and text()='9.99']"}</title>
                    <attachments/>
                    <steps/>
                </step>
                <step start='1636474037050' status='passed' stop='1636474037418'>
                    <name>cartPage: goToHomePage </name>
                    <title>cartPage: goToHomePage </title>
                    <attachments/>
                    <steps>
                        <step start='1636474037050' status='passed' stop='1636474037066'>
                            <name>I wait for clickable {"xpath":"//button[contains(text(), 'Continue')]"}, 10</name>
                            <title>I wait for clickable {"xpath":"//button[contains(text(), 'Continue')]"}, 10</title>
                            <attachments/>
                            <steps/>
                        </step>
                        <step start='1636474037066' status='passed' stop='1636474037078'>
                            <name>I see element {"xpath":"//button[contains(text(), 'Continue')]"}</name>
                            <title>I see element {"xpath":"//button[contains(text(), 'Continue')]"}</title>
                            <attachments/>
                            <steps/>
                        </step>
                        <step start='1636474037182' status='passed' stop='1636474037418'>
                            <name>I click {"xpath":"//button[contains(text(), 'Continue')]"}</name>
                            <title>I click {"xpath":"//button[contains(text(), 'Continue')]"}</title>
                            <attachments/>
                            <steps/>
                        </step>
                    </steps>
                </step>
                <step start='1636474037418' status='passed' stop='1636474037452'>
                    <name>homePage: checkPage </name>
                    <title>homePage: checkPage </title>
                    <attachments/>
                    <steps>
                        <step start='1636474037418' status='passed' stop='1636474037426'>
                            <name>I wait for element {"xpath":"//div[@class = 'app_logo']"}, 5</name>
                            <title>I wait for element {"xpath":"//div[@class = 'app_logo']"}, 5</title>
                            <attachments/>
                            <steps/>
                        </step>
                        <step start='1636474037426' status='passed' stop='1636474037436'>
                            <name>I see element {"xpath":"//div[@class = 'app_logo']"}</name>
                            <title>I see element {"xpath":"//div[@class = 'app_logo']"}</title>
                            <attachments/>
                            <steps/>
                        </step>
                        <step start='1636474037436' status='passed' stop='1636474037443'>
                            <name>I wait for element {"xpath":"//*[contains(text(), 'Products')]"}, 10</name>
                            <title>I wait for element {"xpath":"//*[contains(text(), 'Products')]"}, 10</title>
                            <attachments/>
                            <steps/>
                        </step>
                        <step start='1636474037443' status='passed' stop='1636474037452'>
                            <name>I see element {"xpath":"//*[contains(text(), 'Products')]"}</name>
                            <title>I see element {"xpath":"//*[contains(text(), 'Products')]"}</title>
                            <attachments/>
                            <steps/>
                        </step>
                    </steps>
                </step>
                <step start='1636474037452' status='passed' stop='1636474038198'>
                    <name>homePage: addItemToCart "bolt"</name>
                    <title>homePage: addItemToCart "bolt"</title>
                    <attachments/>
                    <steps>
                        <step start='1636474037452' status='passed' stop='1636474037470'>
                            <name>I wait for clickable {"xpath":"//*[contains(@id, 'add-to-cart') and contains(@id, 'bolt')]"}, 10</name>
                            <title>I wait for clickable {"xpath":"//*[contains(@id, 'add-to-cart') and contains(@id, 'bolt')]"}, 10</title>
                            <attachments/>
                            <steps/>
                        </step>
                        <step start='1636474037470' status='passed' stop='1636474037480'>
                            <name>I see element {"xpath":"//*[contains(@id, 'add-to-cart') and contains(@id, 'bolt')]"}</name>
                            <title>I see element {"xpath":"//*[contains(@id, 'add-to-cart') and contains(@id, 'bolt')]"}</title>
                            <attachments/>
                            <steps/>
                        </step>
                        <step start='1636474037588' status='passed' stop='1636474037824'>
                            <name>I click {"xpath":"//*[contains(@id, 'add-to-cart') and contains(@id, 'bolt')]"}</name>
                            <title>I click {"xpath":"//*[contains(@id, 'add-to-cart') and contains(@id, 'bolt')]"}</title>
                            <attachments/>
                            <steps/>
                        </step>
                        <step start='1636474037824' status='passed' stop='1636474037837'>
                            <name>I see element {"xpath":"//*[contains(@id, 'remove') and contains(@id, 'bolt')]"}</name>
                            <title>I see element {"xpath":"//*[contains(@id, 'remove') and contains(@id, 'bolt')]"}</title>
                            <attachments/>
                            <steps/>
                        </step>
                        <step start='1636474037837' status='passed' stop='1636474037852'>
                            <name>I wait for clickable {"xpath":"//*[@class='shopping_cart_link']"}, 10</name>
                            <title>I wait for clickable {"xpath":"//*[@class='shopping_cart_link']"}, 10</title>
                            <attachments/>
                            <steps/>
                        </step>
                        <step start='1636474037963' status='passed' stop='1636474038197'>
                            <name>I click {"xpath":"//*[@class='shopping_cart_link']"}</name>
                            <title>I click {"xpath":"//*[@class='shopping_cart_link']"}</title>
                            <attachments/>
                            <steps/>
                        </step>
                        <step start='1636474038197' status='passed' stop='1636474038198'>
                            <name>I get data "shoppingItems.json"</name>
                            <title>I get data "shoppingItems.json"</title>
                            <attachments/>
                            <steps/>
                        </step>
                    </steps>
                </step>
                <step start='1636474038198' status='passed' stop='1636474038230'>
                    <name>I grab text from all {"xpath":"//*[@class='inventory_item_name']"}</name>
                    <title>I grab text from all {"xpath":"//*[@class='inventory_item_name']"}</title>
                    <attachments/>
                    <steps/>
                </step>
                <step start='1636474038230' status='passed' stop='1636474038230'>
                    <name>I assert equal "Sauce Labs Bolt T-Shirt", "Sauce Labs Bolt T-Shirt"</name>
                    <title>I assert equal "Sauce Labs Bolt T-Shirt", "Sauce Labs Bolt T-Shirt"</title>
                    <attachments/>
                    <steps/>
                </step>
                <step start='1636474038231' status='passed' stop='1636474038246'>
                    <name>I see text equals "$15.99", {"xpath":"//*[contains(text(), 'Sauce Labs Bolt T-Shirt')]//following::div[@class='inventory_item_price' and text()='15.99']"}</name>
                    <title>I see text equals "$15.99", {"xpath":"//*[contains(text(), 'Sauce Labs Bolt T-Shirt')]//following::div[@class='inventory_item_price' and text()='15.99']"}</title>
                    <attachments/>
                    <steps/>
                </step>
                <step start='1636474038246' status='passed' stop='1636474038611'>
                    <name>cartPage: goToHomePage </name>
                    <title>cartPage: goToHomePage </title>
                    <attachments/>
                    <steps>
                        <step start='1636474038246' status='passed' stop='1636474038261'>
                            <name>I wait for clickable {"xpath":"//button[contains(text(), 'Continue')]"}, 10</name>
                            <title>I wait for clickable {"xpath":"//button[contains(text(), 'Continue')]"}, 10</title>
                            <attachments/>
                            <steps/>
                        </step>
                        <step start='1636474038261' status='passed' stop='1636474038270'>
                            <name>I see element {"xpath":"//button[contains(text(), 'Continue')]"}</name>
                            <title>I see element {"xpath":"//button[contains(text(), 'Continue')]"}</title>
                            <attachments/>
                            <steps/>
                        </step>
                        <step start='1636474038373' status='passed' stop='1636474038611'>
                            <name>I click {"xpath":"//button[contains(text(), 'Continue')]"}</name>
                            <title>I click {"xpath":"//button[contains(text(), 'Continue')]"}</title>
                            <attachments/>
                            <steps/>
                        </step>
                    </steps>
                </step>
                <step start='1636474038611' status='passed' stop='1636474038644'>
                    <name>homePage: checkPage </name>
                    <title>homePage: checkPage </title>
                    <attachments/>
                    <steps>
                        <step start='1636474038611' status='passed' stop='1636474038618'>
                            <name>I wait for element {"xpath":"//div[@class = 'app_logo']"}, 5</name>
                            <title>I wait for element {"xpath":"//div[@class = 'app_logo']"}, 5</title>
                            <attachments/>
                            <steps/>
                        </step>
                        <step start='1636474038618' status='passed' stop='1636474038629'>
                            <name>I see element {"xpath":"//div[@class = 'app_logo']"}</name>
                            <title>I see element {"xpath":"//div[@class = 'app_logo']"}</title>
                            <attachments/>
                            <steps/>
                        </step>
                        <step start='1636474038629' status='passed' stop='1636474038634'>
                            <name>I wait for element {"xpath":"//*[contains(text(), 'Products')]"}, 10</name>
                            <title>I wait for element {"xpath":"//*[contains(text(), 'Products')]"}, 10</title>
                            <attachments/>
                            <steps/>
                        </step>
                        <step start='1636474038634' status='passed' stop='1636474038644'>
                            <name>I see element {"xpath":"//*[contains(text(), 'Products')]"}</name>
                            <title>I see element {"xpath":"//*[contains(text(), 'Products')]"}</title>
                            <attachments/>
                            <steps/>
                        </step>
                    </steps>
                </step>
                <step start='1636474038644' status='passed' stop='1636474039397'>
                    <name>homePage: addItemToCart "onesie"</name>
                    <title>homePage: addItemToCart "onesie"</title>
                    <attachments/>
                    <steps>
                        <step start='1636474038644' status='passed' stop='1636474038661'>
                            <name>I wait for clickable {"xpath":"//*[contains(@id, 'add-to-cart') and contains(@id, 'onesie')]"}, 10</name>
                            <title>I wait for clickable {"xpath":"//*[contains(@id, 'add-to-cart') and contains(@id, 'onesie')]"}, 10</title>
                            <attachments/>
                            <steps/>
                        </step>
                        <step start='1636474038661' status='passed' stop='1636474038671'>
                            <name>I see element {"xpath":"//*[contains(@id, 'add-to-cart') and contains(@id, 'onesie')]"}</name>
                            <title>I see element {"xpath":"//*[contains(@id, 'add-to-cart') and contains(@id, 'onesie')]"}</title>
                            <attachments/>
                            <steps/>
                        </step>
                        <step start='1636474038783' status='passed' stop='1636474039019'>
                            <name>I click {"xpath":"//*[contains(@id, 'add-to-cart') and contains(@id, 'onesie')]"}</name>
                            <title>I click {"xpath":"//*[contains(@id, 'add-to-cart') and contains(@id, 'onesie')]"}</title>
                            <attachments/>
                            <steps/>
                        </step>
                        <step start='1636474039020' status='passed' stop='1636474039034'>
                            <name>I see element {"xpath":"//*[contains(@id, 'remove') and contains(@id, 'onesie')]"}</name>
                            <title>I see element {"xpath":"//*[contains(@id, 'remove') and contains(@id, 'onesie')]"}</title>
                            <attachments/>
                            <steps/>
                        </step>
                        <step start='1636474039034' status='passed' stop='1636474039048'>
                            <name>I wait for clickable {"xpath":"//*[@class='shopping_cart_link']"}, 10</name>
                            <title>I wait for clickable {"xpath":"//*[@class='shopping_cart_link']"}, 10</title>
                            <attachments/>
                            <steps/>
                        </step>
                        <step start='1636474039159' status='passed' stop='1636474039396'>
                            <name>I click {"xpath":"//*[@class='shopping_cart_link']"}</name>
                            <title>I click {"xpath":"//*[@class='shopping_cart_link']"}</title>
                            <attachments/>
                            <steps/>
                        </step>
                        <step start='1636474039397' status='passed' stop='1636474039397'>
                            <name>I get data "shoppingItems.json"</name>
                            <title>I get data "shoppingItems.json"</title>
                            <attachments/>
                            <steps/>
                        </step>
                    </steps>
                </step>
                <step start='1636474039397' status='passed' stop='1636474039436'>
                    <name>I grab text from all {"xpath":"//*[@class='inventory_item_name']"}</name>
                    <title>I grab text from all {"xpath":"//*[@class='inventory_item_name']"}</title>
                    <attachments/>
                    <steps/>
                </step>
                <step start='1636474039436' status='passed' stop='1636474039436'>
                    <name>I assert equal "Sauce Labs Onesie", "Sauce Labs Onesie"</name>
                    <title>I assert equal "Sauce Labs Onesie", "Sauce Labs Onesie"</title>
                    <attachments/>
                    <steps/>
                </step>
                <step start='1636474039437' status='passed' stop='1636474039452'>
                    <name>I see text equals "$7.99", {"xpath":"//*[contains(text(), 'Sauce Labs Onesie')]//following::div[@class='inventory_item_price' and text()='7.99']"}</name>
                    <title>I see text equals "$7.99", {"xpath":"//*[contains(text(), 'Sauce Labs Onesie')]//following::div[@class='inventory_item_price' and text()='7.99']"}</title>
                    <attachments/>
                    <steps/>
                </step>
                <step start='1636474039452' status='passed' stop='1636474039820'>
                    <name>cartPage: goToHomePage </name>
                    <title>cartPage: goToHomePage </title>
                    <attachments/>
                    <steps>
                        <step start='1636474039452' status='passed' stop='1636474039466'>
                            <name>I wait for clickable {"xpath":"//button[contains(text(), 'Continue')]"}, 10</name>
                            <title>I wait for clickable {"xpath":"//button[contains(text(), 'Continue')]"}, 10</title>
                            <attachments/>
                            <steps/>
                        </step>
                        <step start='1636474039466' status='passed' stop='1636474039475'>
                            <name>I see element {"xpath":"//button[contains(text(), 'Continue')]"}</name>
                            <title>I see element {"xpath":"//button[contains(text(), 'Continue')]"}</title>
                            <attachments/>
                            <steps/>
                        </step>
                        <step start='1636474039586' status='passed' stop='1636474039820'>
                            <name>I click {"xpath":"//button[contains(text(), 'Continue')]"}</name>
                            <title>I click {"xpath":"//button[contains(text(), 'Continue')]"}</title>
                            <attachments/>
                            <steps/>
                        </step>
                    </steps>
                </step>
                <step start='1636474039820' status='passed' stop='1636474039854'>
                    <name>homePage: checkPage </name>
                    <title>homePage: checkPage </title>
                    <attachments/>
                    <steps>
                        <step start='1636474039820' status='passed' stop='1636474039828'>
                            <name>I wait for element {"xpath":"//div[@class = 'app_logo']"}, 5</name>
                            <title>I wait for element {"xpath":"//div[@class = 'app_logo']"}, 5</title>
                            <attachments/>
                            <steps/>
                        </step>
                        <step start='1636474039829' status='passed' stop='1636474039838'>
                            <name>I see element {"xpath":"//div[@class = 'app_logo']"}</name>
                            <title>I see element {"xpath":"//div[@class = 'app_logo']"}</title>
                            <attachments/>
                            <steps/>
                        </step>
                        <step start='1636474039838' status='passed' stop='1636474039844'>
                            <name>I wait for element {"xpath":"//*[contains(text(), 'Products')]"}, 10</name>
                            <title>I wait for element {"xpath":"//*[contains(text(), 'Products')]"}, 10</title>
                            <attachments/>
                            <steps/>
                        </step>
                        <step start='1636474039844' status='passed' stop='1636474039854'>
                            <name>I see element {"xpath":"//*[contains(text(), 'Products')]"}</name>
                            <title>I see element {"xpath":"//*[contains(text(), 'Products')]"}</title>
                            <attachments/>
                            <steps/>
                        </step>
                    </steps>
                </step>
                <step start='1636474039854' status='passed' stop='1636474040603'>
                    <name>homePage: addItemToCart "red"</name>
                    <title>homePage: addItemToCart "red"</title>
                    <attachments/>
                    <steps>
                        <step start='1636474039854' status='passed' stop='1636474039871'>
                            <name>I wait for clickable {"xpath":"//*[contains(@id, 'add-to-cart') and contains(@id, 'red')]"}, 10</name>
                            <title>I wait for clickable {"xpath":"//*[contains(@id, 'add-to-cart') and contains(@id, 'red')]"}, 10</title>
                            <attachments/>
                            <steps/>
                        </step>
                        <step start='1636474039871' status='passed' stop='1636474039881'>
                            <name>I see element {"xpath":"//*[contains(@id, 'add-to-cart') and contains(@id, 'red')]"}</name>
                            <title>I see element {"xpath":"//*[contains(@id, 'add-to-cart') and contains(@id, 'red')]"}</title>
                            <attachments/>
                            <steps/>
                        </step>
                        <step start='1636474039995' status='passed' stop='1636474040228'>
                            <name>I click {"xpath":"//*[contains(@id, 'add-to-cart') and contains(@id, 'red')]"}</name>
                            <title>I click {"xpath":"//*[contains(@id, 'add-to-cart') and contains(@id, 'red')]"}</title>
                            <attachments/>
                            <steps/>
                        </step>
                        <step start='1636474040228' status='passed' stop='1636474040242'>
                            <name>I see element {"xpath":"//*[contains(@id, 'remove') and contains(@id, 'red')]"}</name>
                            <title>I see element {"xpath":"//*[contains(@id, 'remove') and contains(@id, 'red')]"}</title>
                            <attachments/>
                            <steps/>
                        </step>
                        <step start='1636474040242' status='passed' stop='1636474040256'>
                            <name>I wait for clickable {"xpath":"//*[@class='shopping_cart_link']"}, 10</name>
                            <title>I wait for clickable {"xpath":"//*[@class='shopping_cart_link']"}, 10</title>
                            <attachments/>
                            <steps/>
                        </step>
                        <step start='1636474040369' status='passed' stop='1636474040603'>
                            <name>I click {"xpath":"//*[@class='shopping_cart_link']"}</name>
                            <title>I click {"xpath":"//*[@class='shopping_cart_link']"}</title>
                            <attachments/>
                            <steps/>
                        </step>
                        <step start='1636474040603' status='passed' stop='1636474040603'>
                            <name>I get data "shoppingItems.json"</name>
                            <title>I get data "shoppingItems.json"</title>
                            <attachments/>
                            <steps/>
                        </step>
                    </steps>
                </step>
                <step start='1636474040603' status='passed' stop='1636474040649'>
                    <name>I grab text from all {"xpath":"//*[@class='inventory_item_name']"}</name>
                    <title>I grab text from all {"xpath":"//*[@class='inventory_item_name']"}</title>
                    <attachments/>
                    <steps/>
                </step>
                <step start='1636474040650' status='passed' stop='1636474040650'>
                    <name>I assert equal "Test.allTheThings() T-Shirt (Red)", "Test.allTheThings() T-Shirt (Red)"</name>
                    <title>I assert equal "Test.allTheThings() T-Shirt (Red)", "Test.allTheThings() T-Shirt (Red)"</title>
                    <attachments/>
                    <steps/>
                </step>
                <step start='1636474040650' status='passed' stop='1636474040665'>
                    <name>I see text equals "$15.99", {"xpath":"//*[contains(text(), 'Test.allTheThings() T-Shirt (Red)')]//following::div[@class='inventory_item_price' and text()='15.99']"}</name>
                    <title>I see text equals "$15.99", {"xpath":"//*[contains(text(), 'Test.allTheThings() T-Shirt (Red)')]//following::div[@class='inventory_item_price' and text()='15.99']"}</title>
                    <attachments/>
                    <steps/>
                </step>
                <step start='1636474040665' status='passed' stop='1636474041024'>
                    <name>cartPage: goToHomePage </name>
                    <title>cartPage: goToHomePage </title>
                    <attachments/>
                    <steps>
                        <step start='1636474040665' status='passed' stop='1636474040680'>
                            <name>I wait for clickable {"xpath":"//button[contains(text(), 'Continue')]"}, 10</name>
                            <title>I wait for clickable {"xpath":"//button[contains(text(), 'Continue')]"}, 10</title>
                            <attachments/>
                            <steps/>
                        </step>
                        <step start='1636474040680' status='passed' stop='1636474040691'>
                            <name>I see element {"xpath":"//button[contains(text(), 'Continue')]"}</name>
                            <title>I see element {"xpath":"//button[contains(text(), 'Continue')]"}</title>
                            <attachments/>
                            <steps/>
                        </step>
                        <step start='1636474040791' status='passed' stop='1636474041023'>
                            <name>I click {"xpath":"//button[contains(text(), 'Continue')]"}</name>
                            <title>I click {"xpath":"//button[contains(text(), 'Continue')]"}</title>
                            <attachments/>
                            <steps/>
                        </step>
                    </steps>
                </step>
                <step start='1636474041024' status='passed' stop='1636474041057'>
                    <name>homePage: checkPage </name>
                    <title>homePage: checkPage </title>
                    <attachments/>
                    <steps>
                        <step start='1636474041024' status='passed' stop='1636474041031'>
                            <name>I wait for element {"xpath":"//div[@class = 'app_logo']"}, 5</name>
                            <title>I wait for element {"xpath":"//div[@class = 'app_logo']"}, 5</title>
                            <attachments/>
                            <steps/>
                        </step>
                        <step start='1636474041031' status='passed' stop='1636474041041'>
                            <name>I see element {"xpath":"//div[@class = 'app_logo']"}</name>
                            <title>I see element {"xpath":"//div[@class = 'app_logo']"}</title>
                            <attachments/>
                            <steps/>
                        </step>
                        <step start='1636474041041' status='passed' stop='1636474041047'>
                            <name>I wait for element {"xpath":"//*[contains(text(), 'Products')]"}, 10</name>
                            <title>I wait for element {"xpath":"//*[contains(text(), 'Products')]"}, 10</title>
                            <attachments/>
                            <steps/>
                        </step>
                        <step start='1636474041047' status='passed' stop='1636474041057'>
                            <name>I see element {"xpath":"//*[contains(text(), 'Products')]"}</name>
                            <title>I see element {"xpath":"//*[contains(text(), 'Products')]"}</title>
                            <attachments/>
                            <steps/>
                        </step>
                    </steps>
                </step>
                <step start='1636474041057' status='failed' stop='1636474041066'>
                    <name>cartPage: goToCheckout </name>
                    <title>cartPage: goToCheckout </title>
                    <attachments/>
                    <steps>
                        <step start='1636474041057' status='failed' stop='1636474041065'>
                            <name>I wait for clickable {"xpath":"//button[contains(text(), 'Checkout')]"}, 10</name>
                            <title>I wait for clickable {"xpath":"//button[contains(text(), 'Checkout')]"}, 10</title>
                            <attachments/>
                            <steps/>
                        </step>
                    </steps>
                </step>
            </steps>
            <attachments>
                <attachment title='Last Seen Screenshot' source='1733ee60-bed2-40b4-ad2f-fd60f4055e9b-attachment.png' type='image/png' size='552937'/>
            </attachments>
            <failure>
                <message>Element "{"xpath":"//button[contains(text(), 'Checkout')]"}" was not found by text|CSS|XPath</message>
                <stack-trace>Error: Element "{"xpath":"//button[contains(text(), 'Checkout')]"}" was not found by text|CSS|XPath
                    at new ElementNotFound (C:\Users\RAT\Framework\UI\node_modules\codeceptjs\lib\helper\errors\ElementNotFound.js:14:11)
                    at assertElementExists (C:\Users\RAT\Framework\UI\node_modules\codeceptjs\lib\helper\WebDriver.js:2835:11)
                    at WebDriver.waitForClickable (C:\Users\RAT\Framework\UI\node_modules\codeceptjs\lib\helper\WebDriver.js:2090:5)
                    at runMicrotasks (&lt;anonymous>)
                    at processTicksAndRejections (node:internal/process/task_queues:96:5)</stack-trace>
            </failure>
        </test-case>
        <test-case start='1636474046351' status='failed' stop='1636474056370'>
            <name>User fills in information and finishes shopping</name>
            <title>User fills in information and finishes shopping</title>
            <labels/>
            <parameters/>
            <steps>
                <step start='1636474046353' status='failed' stop='1636474056369'>
                    <name>checkOutPage: checkPage </name>
                    <title>checkOutPage: checkPage </title>
                    <attachments/>
                    <steps>
                        <step start='1636474046353' status='failed' stop='1636474056368'>
                            <name>I wait for element {"xpath":"//input[@id = 'first-name']"}, 10</name>
                            <title>I wait for element {"xpath":"//input[@id = 'first-name']"}, 10</title>
                            <attachments/>
                            <steps/>
                        </step>
                    </steps>
                </step>
            </steps>
            <attachments>
                <attachment title='Last Seen Screenshot' source='7e365e43-b0e3-40b2-8ad3-82a6692752d1-attachment.png' type='image/png' size='552937'/>
            </attachments>
            <failure>
                <message>element ([object Object]) still not present on page after 10 sec</message>
                <stack-trace>Error: element ([object Object]) still not present on page after 10 sec
                    at C:\Users\RAT\Framework\UI\node_modules\webdriverio\build\commands\browser\waitUntil.js:22:23
                    at async Browser.wrapCommandFn (C:\Users\RAT\Framework\UI\node_modules\webdriverio\node_modules\@wdio\utils\build\shim.js:63:29)
                    at async Object.fillShippingInfo (C:\Users\RAT\Framework\UI\pages\checkOutPage.js:40:27)
                    at async Test.&lt;anonymous> (C:\Users\RAT\Framework\UI\tests\purchaseItems_test.js:38:5)</stack-trace>
            </failure>
        </test-case>
    </test-cases>
</ns2:test-suite>