<?xml version='1.0'?>
<ns2:test-suite xmlns:ns2='urn:model.allure.qatools.yandex.ru' start='1636175695263' stop='1636175713216'>
    <name>User purchases items from SauceDemo.com:</name>
    <title>User purchases items from SauceDemo.com:</title>
    <test-cases>
        <test-case start='1636175703301' status='passed' stop='1636175704922'>
            <name>User logs into website successfully</name>
            <title>User logs into website successfully</title>
            <labels/>
            <parameters/>
            <steps>
                <step start='1636175703310' status='passed' stop='1636175703312'>
                    <name>loginPage: roleLogin "standardUser"</name>
                    <title>loginPage: roleLogin "standardUser"</title>
                    <attachments/>
                    <steps>
                        <step start='1636175703310' status='passed' stop='1636175703312'>
                            <name>I get data "loginDetails.json"</name>
                            <title>I get data "loginDetails.json"</title>
                            <attachments/>
                            <steps/>
                        </step>
                    </steps>
                </step>
                <step start='1636175703312' status='passed' stop='1636175703589'>
                    <name>I am on page "https://www.saucedemo.com/"</name>
                    <title>I am on page "https://www.saucedemo.com/"</title>
                    <attachments/>
                    <steps/>
                </step>
                <step start='1636175703589' status='passed' stop='1636175703598'>
                    <name>I see in current url "https://www.saucedemo.com/"</name>
                    <title>I see in current url "https://www.saucedemo.com/"</title>
                    <attachments/>
                    <steps/>
                </step>
                <step start='1636175703599' status='passed' stop='1636175703803'>
                    <name>loginPage: checkPage </name>
                    <title>loginPage: checkPage </title>
                    <attachments/>
                    <steps>
                        <step start='1636175703599' status='passed' stop='1636175703616'>
                            <name>I wait for element {"xpath":"//div[@class = 'login_logo']"}, 10</name>
                            <title>I wait for element {"xpath":"//div[@class = 'login_logo']"}, 10</title>
                            <attachments/>
                            <steps/>
                        </step>
                        <step start='1636175703616' status='passed' stop='1636175703641'>
                            <name>I see element {"xpath":"//div[@class = 'login_logo']"}</name>
                            <title>I see element {"xpath":"//div[@class = 'login_logo']"}</title>
                            <attachments/>
                            <steps/>
                        </step>
                        <step start='1636175703641' status='passed' stop='1636175703653'>
                            <name>I wait for element {"xpath":"//*[@id = 'login-button']"}, 10</name>
                            <title>I wait for element {"xpath":"//*[@id = 'login-button']"}, 10</title>
                            <attachments/>
                            <steps/>
                        </step>
                        <step start='1636175703653' status='passed' stop='1636175703683'>
                            <name>I wait for clickable {"xpath":"//*[@id = 'login-button']"}, 10</name>
                            <title>I wait for clickable {"xpath":"//*[@id = 'login-button']"}, 10</title>
                            <attachments/>
                            <steps/>
                        </step>
                        <step start='1636175703683' status='passed' stop='1636175703699'>
                            <name>I see element {"xpath":"//*[@id = 'login-button']"}</name>
                            <title>I see element {"xpath":"//*[@id = 'login-button']"}</title>
                            <attachments/>
                            <steps/>
                        </step>
                        <step start='1636175703699' status='passed' stop='1636175703702'>
                            <name>I take screenshot "loginPageLoaded.png"</name>
                            <title>I take screenshot "loginPageLoaded.png"</title>
                            <attachments/>
                            <steps/>
                        </step>
                    </steps>
                </step>
                <step start='1636175703803' status='passed' stop='1636175704093'>
                    <name>I fill field {"xpath":"//input[@id = 'user-name']"}, "standard_user"</name>
                    <title>I fill field {"xpath":"//input[@id = 'user-name']"}, "standard_user"</title>
                    <attachments/>
                    <steps/>
                </step>
                <step start='1636175704192' status='passed' stop='1636175704467'>
                    <name>I fill field {"xpath":"//input[@id = 'password']"}, "secret_sauce"</name>
                    <title>I fill field {"xpath":"//input[@id = 'password']"}, "secret_sauce"</title>
                    <attachments/>
                    <steps/>
                </step>
                <step start='1636175704467' status='passed' stop='1636175704469'>
                    <name>I take screenshot "loginPageFilled.png"</name>
                    <title>I take screenshot "loginPageFilled.png"</title>
                    <attachments/>
                    <steps/>
                </step>
                <step start='1636175704576' status='passed' stop='1636175704855'>
                    <name>I click {"xpath":"//*[@id = 'login-button']"}</name>
                    <title>I click {"xpath":"//*[@id = 'login-button']"}</title>
                    <attachments/>
                    <steps/>
                </step>
                <step start='1636175704855' status='passed' stop='1636175704921'>
                    <name>homePage: checkPage </name>
                    <title>homePage: checkPage </title>
                    <attachments/>
                    <steps>
                        <step start='1636175704856' status='passed' stop='1636175704872'>
                            <name>I wait for element {"xpath":"//div[@class = 'app_logo']"}, 5</name>
                            <title>I wait for element {"xpath":"//div[@class = 'app_logo']"}, 5</title>
                            <attachments/>
                            <steps/>
                        </step>
                        <step start='1636175704872' status='passed' stop='1636175704891'>
                            <name>I see element {"xpath":"//div[@class = 'app_logo']"}</name>
                            <title>I see element {"xpath":"//div[@class = 'app_logo']"}</title>
                            <attachments/>
                            <steps/>
                        </step>
                        <step start='1636175704891' status='passed' stop='1636175704906'>
                            <name>I wait for element {"xpath":"//*[contains(text(), 'Products')]"}, 10</name>
                            <title>I wait for element {"xpath":"//*[contains(text(), 'Products')]"}, 10</title>
                            <attachments/>
                            <steps/>
                        </step>
                        <step start='1636175704906' status='passed' stop='1636175704921'>
                            <name>I see element {"xpath":"//*[contains(text(), 'Products')]"}</name>
                            <title>I see element {"xpath":"//*[contains(text(), 'Products')]"}</title>
                            <attachments/>
                            <steps/>
                        </step>
                    </steps>
                </step>
            </steps>
            <attachments/>
        </test-case>
        <test-case start='1636175704923' status='failed' stop='1636175713108'>
            <name>User adds items to their cart that they want to purchase</name>
            <title>User adds items to their cart that they want to purchase</title>
            <labels/>
            <parameters/>
            <steps>
                <step start='1636175704926' status='passed' stop='1636175705712'>
                    <name>homePage: addItemToCart "backpack"</name>
                    <title>homePage: addItemToCart "backpack"</title>
                    <attachments/>
                    <steps>
                        <step start='1636175704926' status='passed' stop='1636175704951'>
                            <name>I wait for clickable {"xpath":"//*[contains(@id, 'add-to-cart') and contains(@id, 'backpack')]"}, 10</name>
                            <title>I wait for clickable {"xpath":"//*[contains(@id, 'add-to-cart') and contains(@id, 'backpack')]"}, 10</title>
                            <attachments/>
                            <steps/>
                        </step>
                        <step start='1636175704951' status='passed' stop='1636175704967'>
                            <name>I see element {"xpath":"//*[contains(@id, 'add-to-cart') and contains(@id, 'backpack')]"}</name>
                            <title>I see element {"xpath":"//*[contains(@id, 'add-to-cart') and contains(@id, 'backpack')]"}</title>
                            <attachments/>
                            <steps/>
                        </step>
                        <step start='1636175705072' status='passed' stop='1636175705307'>
                            <name>I click {"xpath":"//*[contains(@id, 'add-to-cart') and contains(@id, 'backpack')]"}</name>
                            <title>I click {"xpath":"//*[contains(@id, 'add-to-cart') and contains(@id, 'backpack')]"}</title>
                            <attachments/>
                            <steps/>
                        </step>
                        <step start='1636175705307' status='passed' stop='1636175705325'>
                            <name>I see element {"xpath":"//*[contains(@id, 'remove') and contains(@id, 'backpack')]"}</name>
                            <title>I see element {"xpath":"//*[contains(@id, 'remove') and contains(@id, 'backpack')]"}</title>
                            <attachments/>
                            <steps/>
                        </step>
                        <step start='1636175705325' status='passed' stop='1636175705357'>
                            <name>I wait for clickable {"xpath":"//*[@class='shopping_cart_link']"}, 10</name>
                            <title>I wait for clickable {"xpath":"//*[@class='shopping_cart_link']"}, 10</title>
                            <attachments/>
                            <steps/>
                        </step>
                        <step start='1636175705463' status='passed' stop='1636175705711'>
                            <name>I click {"xpath":"//*[@class='shopping_cart_link']"}</name>
                            <title>I click {"xpath":"//*[@class='shopping_cart_link']"}</title>
                            <attachments/>
                            <steps/>
                        </step>
                        <step start='1636175705711' status='passed' stop='1636175705712'>
                            <name>I get data "shoppingItems.json"</name>
                            <title>I get data "shoppingItems.json"</title>
                            <attachments/>
                            <steps/>
                        </step>
                    </steps>
                </step>
                <step start='1636175705712' status='passed' stop='1636175705735'>
                    <name>I grab text from all {"xpath":"//*[@class='inventory_item_name']"}</name>
                    <title>I grab text from all {"xpath":"//*[@class='inventory_item_name']"}</title>
                    <attachments/>
                    <steps/>
                </step>
                <step start='1636175705736' status='passed' stop='1636175705736'>
                    <name>I assert equal "Sauce Labs Backpack", "Sauce Labs Backpack"</name>
                    <title>I assert equal "Sauce Labs Backpack", "Sauce Labs Backpack"</title>
                    <attachments/>
                    <steps/>
                </step>
                <step start='1636175705736' status='passed' stop='1636175705757'>
                    <name>I see text equals "$29.99", {"xpath":"//*[contains(text(), 'Sauce Labs Backpack')]//following::div[@class='inventory_item_price' and text()='29.99']"}</name>
                    <title>I see text equals "$29.99", {"xpath":"//*[contains(text(), 'Sauce Labs Backpack')]//following::div[@class='inventory_item_price' and text()='29.99']"}</title>
                    <attachments/>
                    <steps/>
                </step>
                <step start='1636175705757' status='passed' stop='1636175706149'>
                    <name>cartPage: goToHomePage </name>
                    <title>cartPage: goToHomePage </title>
                    <attachments/>
                    <steps>
                        <step start='1636175705757' status='passed' stop='1636175705780'>
                            <name>I wait for clickable {"xpath":"//button[contains(text(), 'Continue')]"}, 10</name>
                            <title>I wait for clickable {"xpath":"//button[contains(text(), 'Continue')]"}, 10</title>
                            <attachments/>
                            <steps/>
                        </step>
                        <step start='1636175705780' status='passed' stop='1636175705795'>
                            <name>I see element {"xpath":"//button[contains(text(), 'Continue')]"}</name>
                            <title>I see element {"xpath":"//button[contains(text(), 'Continue')]"}</title>
                            <attachments/>
                            <steps/>
                        </step>
                        <step start='1636175705898' status='passed' stop='1636175706149'>
                            <name>I click {"xpath":"//button[contains(text(), 'Continue')]"}</name>
                            <title>I click {"xpath":"//button[contains(text(), 'Continue')]"}</title>
                            <attachments/>
                            <steps/>
                        </step>
                    </steps>
                </step>
                <step start='1636175706149' status='passed' stop='1636175706195'>
                    <name>homePage: checkPage </name>
                    <title>homePage: checkPage </title>
                    <attachments/>
                    <steps>
                        <step start='1636175706149' status='passed' stop='1636175706159'>
                            <name>I wait for element {"xpath":"//div[@class = 'app_logo']"}, 5</name>
                            <title>I wait for element {"xpath":"//div[@class = 'app_logo']"}, 5</title>
                            <attachments/>
                            <steps/>
                        </step>
                        <step start='1636175706159' status='passed' stop='1636175706174'>
                            <name>I see element {"xpath":"//div[@class = 'app_logo']"}</name>
                            <title>I see element {"xpath":"//div[@class = 'app_logo']"}</title>
                            <attachments/>
                            <steps/>
                        </step>
                        <step start='1636175706174' status='passed' stop='1636175706181'>
                            <name>I wait for element {"xpath":"//*[contains(text(), 'Products')]"}, 10</name>
                            <title>I wait for element {"xpath":"//*[contains(text(), 'Products')]"}, 10</title>
                            <attachments/>
                            <steps/>
                        </step>
                        <step start='1636175706181' status='passed' stop='1636175706195'>
                            <name>I see element {"xpath":"//*[contains(text(), 'Products')]"}</name>
                            <title>I see element {"xpath":"//*[contains(text(), 'Products')]"}</title>
                            <attachments/>
                            <steps/>
                        </step>
                    </steps>
                </step>
                <step start='1636175706195' status='passed' stop='1636175706949'>
                    <name>homePage: addItemToCart "bike"</name>
                    <title>homePage: addItemToCart "bike"</title>
                    <attachments/>
                    <steps>
                        <step start='1636175706195' status='passed' stop='1636175706216'>
                            <name>I wait for clickable {"xpath":"//*[contains(@id, 'add-to-cart') and contains(@id, 'bike')]"}, 10</name>
                            <title>I wait for clickable {"xpath":"//*[contains(@id, 'add-to-cart') and contains(@id, 'bike')]"}, 10</title>
                            <attachments/>
                            <steps/>
                        </step>
                        <step start='1636175706217' status='passed' stop='1636175706231'>
                            <name>I see element {"xpath":"//*[contains(@id, 'add-to-cart') and contains(@id, 'bike')]"}</name>
                            <title>I see element {"xpath":"//*[contains(@id, 'add-to-cart') and contains(@id, 'bike')]"}</title>
                            <attachments/>
                            <steps/>
                        </step>
                        <step start='1636175706339' status='passed' stop='1636175706573'>
                            <name>I click {"xpath":"//*[contains(@id, 'add-to-cart') and contains(@id, 'bike')]"}</name>
                            <title>I click {"xpath":"//*[contains(@id, 'add-to-cart') and contains(@id, 'bike')]"}</title>
                            <attachments/>
                            <steps/>
                        </step>
                        <step start='1636175706573' status='passed' stop='1636175706590'>
                            <name>I see element {"xpath":"//*[contains(@id, 'remove') and contains(@id, 'bike')]"}</name>
                            <title>I see element {"xpath":"//*[contains(@id, 'remove') and contains(@id, 'bike')]"}</title>
                            <attachments/>
                            <steps/>
                        </step>
                        <step start='1636175706590' status='passed' stop='1636175706609'>
                            <name>I wait for clickable {"xpath":"//*[@class='shopping_cart_link']"}, 10</name>
                            <title>I wait for clickable {"xpath":"//*[@class='shopping_cart_link']"}, 10</title>
                            <attachments/>
                            <steps/>
                        </step>
                        <step start='1636175706713' status='passed' stop='1636175706948'>
                            <name>I click {"xpath":"//*[@class='shopping_cart_link']"}</name>
                            <title>I click {"xpath":"//*[@class='shopping_cart_link']"}</title>
                            <attachments/>
                            <steps/>
                        </step>
                        <step start='1636175706948' status='passed' stop='1636175706949'>
                            <name>I get data "shoppingItems.json"</name>
                            <title>I get data "shoppingItems.json"</title>
                            <attachments/>
                            <steps/>
                        </step>
                    </steps>
                </step>
                <step start='1636175706949' status='passed' stop='1636175706978'>
                    <name>I grab text from all {"xpath":"//*[@class='inventory_item_name']"}</name>
                    <title>I grab text from all {"xpath":"//*[@class='inventory_item_name']"}</title>
                    <attachments/>
                    <steps/>
                </step>
                <step start='1636175706979' status='passed' stop='1636175706979'>
                    <name>I assert equal "Sauce Labs Bike Light", "Sauce Labs Bike Light"</name>
                    <title>I assert equal "Sauce Labs Bike Light", "Sauce Labs Bike Light"</title>
                    <attachments/>
                    <steps/>
                </step>
                <step start='1636175706979' status='passed' stop='1636175706999'>
                    <name>I see text equals "$9.99", {"xpath":"//*[contains(text(), 'Sauce Labs Bike Light')]//following::div[@class='inventory_item_price' and text()='9.99']"}</name>
                    <title>I see text equals "$9.99", {"xpath":"//*[contains(text(), 'Sauce Labs Bike Light')]//following::div[@class='inventory_item_price' and text()='9.99']"}</title>
                    <attachments/>
                    <steps/>
                </step>
                <step start='1636175706999' status='passed' stop='1636175707386'>
                    <name>cartPage: goToHomePage </name>
                    <title>cartPage: goToHomePage </title>
                    <attachments/>
                    <steps>
                        <step start='1636175706999' status='passed' stop='1636175707019'>
                            <name>I wait for clickable {"xpath":"//button[contains(text(), 'Continue')]"}, 10</name>
                            <title>I wait for clickable {"xpath":"//button[contains(text(), 'Continue')]"}, 10</title>
                            <attachments/>
                            <steps/>
                        </step>
                        <step start='1636175707019' status='passed' stop='1636175707031'>
                            <name>I see element {"xpath":"//button[contains(text(), 'Continue')]"}</name>
                            <title>I see element {"xpath":"//button[contains(text(), 'Continue')]"}</title>
                            <attachments/>
                            <steps/>
                        </step>
                        <step start='1636175707134' status='passed' stop='1636175707385'>
                            <name>I click {"xpath":"//button[contains(text(), 'Continue')]"}</name>
                            <title>I click {"xpath":"//button[contains(text(), 'Continue')]"}</title>
                            <attachments/>
                            <steps/>
                        </step>
                    </steps>
                </step>
                <step start='1636175707386' status='passed' stop='1636175707430'>
                    <name>homePage: checkPage </name>
                    <title>homePage: checkPage </title>
                    <attachments/>
                    <steps>
                        <step start='1636175707386' status='passed' stop='1636175707395'>
                            <name>I wait for element {"xpath":"//div[@class = 'app_logo']"}, 5</name>
                            <title>I wait for element {"xpath":"//div[@class = 'app_logo']"}, 5</title>
                            <attachments/>
                            <steps/>
                        </step>
                        <step start='1636175707395' status='passed' stop='1636175707409'>
                            <name>I see element {"xpath":"//div[@class = 'app_logo']"}</name>
                            <title>I see element {"xpath":"//div[@class = 'app_logo']"}</title>
                            <attachments/>
                            <steps/>
                        </step>
                        <step start='1636175707409' status='passed' stop='1636175707417'>
                            <name>I wait for element {"xpath":"//*[contains(text(), 'Products')]"}, 10</name>
                            <title>I wait for element {"xpath":"//*[contains(text(), 'Products')]"}, 10</title>
                            <attachments/>
                            <steps/>
                        </step>
                        <step start='1636175707417' status='passed' stop='1636175707430'>
                            <name>I see element {"xpath":"//*[contains(text(), 'Products')]"}</name>
                            <title>I see element {"xpath":"//*[contains(text(), 'Products')]"}</title>
                            <attachments/>
                            <steps/>
                        </step>
                    </steps>
                </step>
                <step start='1636175707430' status='passed' stop='1636175708183'>
                    <name>homePage: addItemToCart "bolt"</name>
                    <title>homePage: addItemToCart "bolt"</title>
                    <attachments/>
                    <steps>
                        <step start='1636175707430' status='passed' stop='1636175707451'>
                            <name>I wait for clickable {"xpath":"//*[contains(@id, 'add-to-cart') and contains(@id, 'bolt')]"}, 10</name>
                            <title>I wait for clickable {"xpath":"//*[contains(@id, 'add-to-cart') and contains(@id, 'bolt')]"}, 10</title>
                            <attachments/>
                            <steps/>
                        </step>
                        <step start='1636175707451' status='passed' stop='1636175707462'>
                            <name>I see element {"xpath":"//*[contains(@id, 'add-to-cart') and contains(@id, 'bolt')]"}</name>
                            <title>I see element {"xpath":"//*[contains(@id, 'add-to-cart') and contains(@id, 'bolt')]"}</title>
                            <attachments/>
                            <steps/>
                        </step>
                        <step start='1636175707572' status='passed' stop='1636175707805'>
                            <name>I click {"xpath":"//*[contains(@id, 'add-to-cart') and contains(@id, 'bolt')]"}</name>
                            <title>I click {"xpath":"//*[contains(@id, 'add-to-cart') and contains(@id, 'bolt')]"}</title>
                            <attachments/>
                            <steps/>
                        </step>
                        <step start='1636175707805' status='passed' stop='1636175707822'>
                            <name>I see element {"xpath":"//*[contains(@id, 'remove') and contains(@id, 'bolt')]"}</name>
                            <title>I see element {"xpath":"//*[contains(@id, 'remove') and contains(@id, 'bolt')]"}</title>
                            <attachments/>
                            <steps/>
                        </step>
                        <step start='1636175707822' status='passed' stop='1636175707840'>
                            <name>I wait for clickable {"xpath":"//*[@class='shopping_cart_link']"}, 10</name>
                            <title>I wait for clickable {"xpath":"//*[@class='shopping_cart_link']"}, 10</title>
                            <attachments/>
                            <steps/>
                        </step>
                        <step start='1636175707946' status='passed' stop='1636175708182'>
                            <name>I click {"xpath":"//*[@class='shopping_cart_link']"}</name>
                            <title>I click {"xpath":"//*[@class='shopping_cart_link']"}</title>
                            <attachments/>
                            <steps/>
                        </step>
                        <step start='1636175708182' status='passed' stop='1636175708183'>
                            <name>I get data "shoppingItems.json"</name>
                            <title>I get data "shoppingItems.json"</title>
                            <attachments/>
                            <steps/>
                        </step>
                    </steps>
                </step>
                <step start='1636175708183' status='passed' stop='1636175708226'>
                    <name>I grab text from all {"xpath":"//*[@class='inventory_item_name']"}</name>
                    <title>I grab text from all {"xpath":"//*[@class='inventory_item_name']"}</title>
                    <attachments/>
                    <steps/>
                </step>
                <step start='1636175708227' status='passed' stop='1636175708227'>
                    <name>I assert equal "Sauce Labs Bolt T-Shirt", "Sauce Labs Bolt T-Shirt"</name>
                    <title>I assert equal "Sauce Labs Bolt T-Shirt", "Sauce Labs Bolt T-Shirt"</title>
                    <attachments/>
                    <steps/>
                </step>
                <step start='1636175708227' status='passed' stop='1636175708246'>
                    <name>I see text equals "$15.99", {"xpath":"//*[contains(text(), 'Sauce Labs Bolt T-Shirt')]//following::div[@class='inventory_item_price' and text()='15.99']"}</name>
                    <title>I see text equals "$15.99", {"xpath":"//*[contains(text(), 'Sauce Labs Bolt T-Shirt')]//following::div[@class='inventory_item_price' and text()='15.99']"}</title>
                    <attachments/>
                    <steps/>
                </step>
                <step start='1636175708246' status='passed' stop='1636175708635'>
                    <name>cartPage: goToHomePage </name>
                    <title>cartPage: goToHomePage </title>
                    <attachments/>
                    <steps>
                        <step start='1636175708246' status='passed' stop='1636175708264'>
                            <name>I wait for clickable {"xpath":"//button[contains(text(), 'Continue')]"}, 10</name>
                            <title>I wait for clickable {"xpath":"//button[contains(text(), 'Continue')]"}, 10</title>
                            <attachments/>
                            <steps/>
                        </step>
                        <step start='1636175708264' status='passed' stop='1636175708275'>
                            <name>I see element {"xpath":"//button[contains(text(), 'Continue')]"}</name>
                            <title>I see element {"xpath":"//button[contains(text(), 'Continue')]"}</title>
                            <attachments/>
                            <steps/>
                        </step>
                        <step start='1636175708385' status='passed' stop='1636175708635'>
                            <name>I click {"xpath":"//button[contains(text(), 'Continue')]"}</name>
                            <title>I click {"xpath":"//button[contains(text(), 'Continue')]"}</title>
                            <attachments/>
                            <steps/>
                        </step>
                    </steps>
                </step>
                <step start='1636175708635' status='passed' stop='1636175712312'>
                    <name>homePage: checkPage </name>
                    <title>homePage: checkPage </title>
                    <attachments/>
                    <steps>
                        <step start='1636175708635' status='passed' stop='1636175708642'>
                            <name>I wait for element {"xpath":"//div[@class = 'app_logo']"}, 5</name>
                            <title>I wait for element {"xpath":"//div[@class = 'app_logo']"}, 5</title>
                            <attachments/>
                            <steps/>
                        </step>
                        <step start='1636175708642' status='passed' stop='1636175708654'>
                            <name>I see element {"xpath":"//div[@class = 'app_logo']"}</name>
                            <title>I see element {"xpath":"//div[@class = 'app_logo']"}</title>
                            <attachments/>
                            <steps/>
                        </step>
                        <step start='1636175708654' status='passed' stop='1636175708661'>
                            <name>I wait for element {"xpath":"//*[contains(text(), 'Products')]"}, 10</name>
                            <title>I wait for element {"xpath":"//*[contains(text(), 'Products')]"}, 10</title>
                            <attachments/>
                            <steps/>
                        </step>
                        <step start='1636175708661' status='passed' stop='1636175708673'>
                            <name>I see element {"xpath":"//*[contains(text(), 'Products')]"}</name>
                            <title>I see element {"xpath":"//*[contains(text(), 'Products')]"}</title>
                            <attachments/>
                            <steps/>
                        </step>
                    </steps>
                </step>
                <step start='1636175712312' status='passed' stop='1636175713056'>
                    <name>homePage: addItemToCart "onesie"</name>
                    <title>homePage: addItemToCart "onesie"</title>
                    <attachments/>
                    <steps>
                        <step start='1636175712312' status='passed' stop='1636175712336'>
                            <name>I wait for clickable {"xpath":"//*[contains(@id, 'add-to-cart') and contains(@id, 'onesie')]"}, 10</name>
                            <title>I wait for clickable {"xpath":"//*[contains(@id, 'add-to-cart') and contains(@id, 'onesie')]"}, 10</title>
                            <attachments/>
                            <steps/>
                        </step>
                        <step start='1636175712336' status='passed' stop='1636175712348'>
                            <name>I see element {"xpath":"//*[contains(@id, 'add-to-cart') and contains(@id, 'onesie')]"}</name>
                            <title>I see element {"xpath":"//*[contains(@id, 'add-to-cart') and contains(@id, 'onesie')]"}</title>
                            <attachments/>
                            <steps/>
                        </step>
                        <step start='1636175712449' status='passed' stop='1636175712680'>
                            <name>I click {"xpath":"//*[contains(@id, 'add-to-cart') and contains(@id, 'onesie')]"}</name>
                            <title>I click {"xpath":"//*[contains(@id, 'add-to-cart') and contains(@id, 'onesie')]"}</title>
                            <attachments/>
                            <steps/>
                        </step>
                        <step start='1636175712681' status='passed' stop='1636175712698'>
                            <name>I see element {"xpath":"//*[contains(@id, 'remove') and contains(@id, 'onesie')]"}</name>
                            <title>I see element {"xpath":"//*[contains(@id, 'remove') and contains(@id, 'onesie')]"}</title>
                            <attachments/>
                            <steps/>
                        </step>
                        <step start='1636175712698' status='passed' stop='1636175712715'>
                            <name>I wait for clickable {"xpath":"//*[@class='shopping_cart_link']"}, 10</name>
                            <title>I wait for clickable {"xpath":"//*[@class='shopping_cart_link']"}, 10</title>
                            <attachments/>
                            <steps/>
                        </step>
                        <step start='1636175712821' status='passed' stop='1636175713055'>
                            <name>I click {"xpath":"//*[@class='shopping_cart_link']"}</name>
                            <title>I click {"xpath":"//*[@class='shopping_cart_link']"}</title>
                            <attachments/>
                            <steps/>
                        </step>
                        <step start='1636175713055' status='passed' stop='1636175713056'>
                            <name>I get data "shoppingItems.json"</name>
                            <title>I get data "shoppingItems.json"</title>
                            <attachments/>
                            <steps/>
                        </step>
                    </steps>
                </step>
                <step start='1636175713056' status='passed' stop='1636175713107'>
                    <name>I grab text from all {"xpath":"//*[@class='inventory_item_name']"}</name>
                    <title>I grab text from all {"xpath":"//*[@class='inventory_item_name']"}</title>
                    <attachments/>
                    <steps/>
                </step>
            </steps>
            <attachments>
                <attachment title='Last Seen Screenshot' source='4cf2849a-bc32-4ff3-a88f-7b901f8950ae-attachment.png' type='image/png' size='72408'/>
            </attachments>
            <failure>
                <message>Cannot read properties of undefined (reading 'name')</message>
                <stack-trace>TypeError: Cannot read properties of undefined (reading 'name')
                    at Object.validateItemAddedToCart (C:\Users\RAT\Framework\UI\pages\cartPage.js:64:44)
                    at processTicksAndRejections (node:internal/process/task_queues:96:5)
                    at async Object.addItemToCart (C:\Users\RAT\Framework\UI\pages\homePage.js:70:9)
                    at async Test.&lt;anonymous> (C:\Users\RAT\Framework\UI\tests\purchaseItems_test.js:23:5)</stack-trace>
            </failure>
        </test-case>
    </test-cases>
</ns2:test-suite>