[
    {
        "name" : "Coffee1",
        "sugar" : 1,
        "milk" : 1,
        "water" : 1,
        "price" : 1
    },
    {
        "name" : "Coffee2",
        "sugar" : 2,
        "milk" : 2,
        "water" : 2,
        "price" : 2
    },
    {
        "name" : "Coffee3",
        "sugar" : 3,
        "milk" : 3,
        "water" : 3,
        "price" : 3
    }
]