<svg width="20" height="20" viewBox="0 0 20 20" fill="none" xmlns="http://www.w3.org/2000/svg">
<path d="M12.5 18.9584H7.49996C2.97496 18.9584 1.04163 17.025 1.04163 12.5V7.50002C1.04163 2.97502 2.97496 1.04169 7.49996 1.04169H12.5C17.025 1.04169 18.9583 2.97502 18.9583 7.50002V12.5C18.9583 17.025 17.025 18.9584 12.5 18.9584ZM7.49996 2.29169C3.65829 2.29169 2.29163 3.65835 2.29163 7.50002V12.5C2.29163 16.3417 3.65829 17.7084 7.49996 17.7084H12.5C16.3416 17.7084 17.7083 16.3417 17.7083 12.5V7.50002C17.7083 3.65835 16.3416 2.29169 12.5 2.29169H7.49996Z" fill="#213067"/>
<path d="M11.4667 14.7916H8.52499C7.60832 14.7916 6.88332 14.3416 6.47499 13.525L5.73333 12.0333C5.55833 11.675 5.19999 11.4583 4.79999 11.4583H1.65833C1.31666 11.4583 1.03333 11.175 1.03333 10.8333C1.03333 10.4916 1.32499 10.2083 1.66666 10.2083H4.79999C5.67499 10.2083 6.45833 10.6916 6.84999 11.475L7.59166 12.9666C7.78332 13.35 8.09166 13.5416 8.52499 13.5416H11.4667C11.8667 13.5416 12.225 13.325 12.4 12.9666L13.1417 11.475C13.5333 10.6916 14.3167 10.2083 15.1917 10.2083H18.3083C18.65 10.2083 18.9333 10.4916 18.9333 10.8333C18.9333 11.175 18.65 11.4583 18.3083 11.4583H15.1917C14.7917 11.4583 14.4333 11.675 14.2583 12.0333L13.5167 13.525C13.125 14.3083 12.3417 14.7916 11.4667 14.7916Z" fill="#213067"/>
<path d="M11.3916 6.45831H8.61661C8.26661 6.45831 7.98328 6.17498 7.98328 5.83331C7.98328 5.49165 8.26661 5.20831 8.60828 5.20831H11.3833C11.7249 5.20831 12.0083 5.49165 12.0083 5.83331C12.0083 6.17498 11.7333 6.45831 11.3916 6.45831Z" fill="#213067"/>
<path d="M12.0833 8.95831H7.91663C7.57496 8.95831 7.29163 8.67498 7.29163 8.33331C7.29163 7.99165 7.57496 7.70831 7.91663 7.70831H12.0833C12.425 7.70831 12.7083 7.99165 12.7083 8.33331C12.7083 8.67498 12.425 8.95831 12.0833 8.95831Z" fill="#213067"/>
</svg>
