<svg width="20" height="20" viewBox="0 0 20 20" fill="none" xmlns="http://www.w3.org/2000/svg">
<path d="M10 8.12502C9.91667 8.12502 9.84167 8.10835 9.75833 8.07502C9.525 7.98335 9.375 7.75002 9.375 7.50002V1.66669C9.375 1.32502 9.65833 1.04169 10 1.04169C10.3417 1.04169 10.625 1.32502 10.625 1.66669V5.99169L11.225 5.39169C11.4667 5.15002 11.8667 5.15002 12.1083 5.39169C12.35 5.63335 12.35 6.03335 12.1083 6.27502L10.4417 7.94169C10.325 8.05835 10.1667 8.12502 10 8.12502Z" fill="#213067"/>
<path d="M10 8.12497C9.8417 8.12497 9.68337 8.06664 9.55837 7.94164L7.8917 6.27497C7.65003 6.03331 7.65003 5.6333 7.8917 5.39164C8.13337 5.14997 8.53337 5.14997 8.77503 5.39164L10.4417 7.05831C10.6834 7.29997 10.6834 7.69997 10.4417 7.94164C10.3167 8.06664 10.1584 8.12497 10 8.12497Z" fill="#213067"/>
<path d="M11.4667 14.7916H8.52502C7.65002 14.7916 6.86669 14.3083 6.47502 13.525L5.50002 11.575C5.46669 11.5 5.39169 11.4583 5.31669 11.4583H1.65002C1.30836 11.4583 1.02502 11.175 1.02502 10.8333C1.02502 10.4916 1.30836 10.2083 1.65002 10.2083H5.32502C5.88336 10.2083 6.38336 10.5166 6.63336 11.0166L7.60836 12.9666C7.78336 13.325 8.14169 13.5416 8.54169 13.5416H11.4834C11.8834 13.5416 12.2417 13.325 12.4167 12.9666L13.3917 11.0166C13.6417 10.5166 14.1417 10.2083 14.7 10.2083H18.3334C18.675 10.2083 18.9584 10.4916 18.9584 10.8333C18.9584 11.175 18.675 11.4583 18.3334 11.4583H14.7C14.6167 11.4583 14.55 11.5 14.5167 11.575L13.5417 13.525C13.125 14.3083 12.3417 14.7916 11.4667 14.7916Z" fill="#213067"/>
<path d="M12.5 18.9583H7.49996C2.97496 18.9583 1.04163 17.025 1.04163 12.5V9.16665C1.04163 5.25831 2.49163 3.29998 5.74163 2.82498C6.09163 2.77498 6.39996 3.00831 6.44996 3.34998C6.49996 3.69165 6.26663 4.00831 5.92496 4.05831C3.30829 4.44165 2.29163 5.87498 2.29163 9.16665V12.5C2.29163 16.3416 3.65829 17.7083 7.49996 17.7083H12.5C16.3416 17.7083 17.7083 16.3416 17.7083 12.5V9.16665C17.7083 5.87498 16.6916 4.44165 14.075 4.05831C13.7333 4.00831 13.5 3.69165 13.55 3.34998C13.6 3.00831 13.9166 2.77498 14.2583 2.82498C17.5083 3.29998 18.9583 5.25831 18.9583 9.16665V12.5C18.9583 17.025 17.025 18.9583 12.5 18.9583Z" fill="#213067"/>
</svg>
