{
	"info": {
		"_postman_id": "d88d8746-79c9-4586-8fdc-d1457536b4da",
		"name": "modulesParameterizedRoutes",
		"schema": "https://schema.getpostman.com/json/collection/v2.1.0/collection.json"
	},
	"item": [
		{
			"name": "getAllTasks",
			"request": {
				"method": "GET",
				"header": [],
				"url": {
					"raw": "http://localhost:3001/tasks/",
					"protocol": "http",
					"host": [
						"localhost"
					],
					"port": "3001",
					"path": [
						"tasks",
						""
					]
				}
			},
			"response": []
		},
		{
			"name": "postTask",
			"request": {
				"method": "POST",
				"header": [],
				"body": {
					"mode": "raw",
					"raw": "{\r\n    \"name\": \"Codes Duplicate\"\r\n}",
					"options": {
						"raw": {
							"language": "json"
						}
					}
				},
				"url": {
					"raw": "http://localhost:3001/tasks/",
					"protocol": "http",
					"host": [
						"localhost"
					],
					"port": "3001",
					"path": [
						"tasks",
						""
					]
				}
			},
			"response": []
		},
		{
			"name": "deleteTask",
			"request": {
				"method": "DELETE",
				"header": [],
				"url": {
					"raw": "http://localhost:3001/tasks/61adc50fcfce056ed38b1474",
					"protocol": "http",
					"host": [
						"localhost"
					],
					"port": "3001",
					"path": [
						"tasks",
						"61adc50fcfce056ed38b1474"
					]
				}
			},
			"response": []
		},
		{
			"name": "updateTask",
			"request": {
				"method": "PUT",
				"header": [],
				"body": {
					"mode": "raw",
					"raw": "{\r\n    \"name\": \"Code update\"\r\n}",
					"options": {
						"raw": {
							"language": "json"
						}
					}
				},
				"url": {
					"raw": "http://localhost:3001/tasks/61adc504a9a06752b020bab0",
					"protocol": "http",
					"host": [
						"localhost"
					],
					"port": "3001",
					"path": [
						"tasks",
						"61adc504a9a06752b020bab0"
					]
				}
			},
			"response": []
		},
		{
			"name": "getOneTask",
			"request": {
				"method": "GET",
				"header": [],
				"url": {
					"raw": "http://localhost:3001/tasks/61ad61d0232adc610b4c1d10",
					"protocol": "http",
					"host": [
						"localhost"
					],
					"port": "3001",
					"path": [
						"tasks",
						"61ad61d0232adc610b4c1d10"
					]
				}
			},
			"response": []
		},
		{
			"name": "completeTask",
			"request": {
				"method": "GET",
				"header": [],
				"url": null
			},
			"response": []
		}
	]
}