{
	"info": {
		"_postman_id": "7c19a48f-4749-4967-b62e-74a6177f2b13",
		"name": "ecommerce api",
		"schema": "https://schema.getpostman.com/json/collection/v2.1.0/collection.json"
	},
	"item": [
		{
			"name": "user registration",
			"request": {
				"method": "POST",
				"header": [],
				"body": {
					"mode": "raw",
					"raw": "{\n    \"firstName\": \"Mickey\",\n    \"lastName\": \"Mouse\",\n    \"email\": \"mickeymouse@mail.com\",\n    \"password\": \"mickey123\"\n}",
					"options": {
						"raw": {
							"language": "json"
						}
					}
				},
				"url": {
					"raw": "https://boiling-earth-61174.herokuapp.com/users/register",
					"protocol": "https",
					"host": [
						"boiling-earth-61174",
						"herokuapp",
						"com"
					],
					"path": [
						"users",
						"register"
					]
				}
			},
			"response": []
		},
		{
			"name": "user authentication / login",
			"request": {
				"method": "POST",
				"header": [],
				"body": {
					"mode": "raw",
					"raw": "{\n    \"email\": \"mickeymouse@mail.com\",\n    \"password\": \"mickey123\"\n}",
					"options": {
						"raw": {
							"language": "json"
						}
					}
				},
				"url": {
					"raw": "https://boiling-earth-61174.herokuapp.com/users/login",
					"protocol": "https",
					"host": [
						"boiling-earth-61174",
						"herokuapp",
						"com"
					],
					"path": [
						"users",
						"login"
					]
				}
			},
			"response": []
		},
		{
			"name": "set as admin",
			"request": {
				"auth": {
					"type": "bearer",
					"bearer": [
						{
							"key": "token",
							"value": "eyJhbGciOiJIUzI1NiIsInR5cCI6IkpXVCJ9.eyJpZCI6IjYxYjkyMTRlYWY0YzZlZmE0ODU2NzFhNiIsImVtYWlsIjoiYmlsbG55ZUBtYWlsLmNvbSIsImlzQWRtaW4iOnRydWUsImlhdCI6MTYzOTUyMjkzM30.94FyWBV0xpPnJK5b9MOm0ViFicZhxw9rM047eKRlfCo",
							"type": "string"
						}
					]
				},
				"method": "PUT",
				"header": [],
				"body": {
					"mode": "raw",
					"raw": "",
					"options": {
						"raw": {
							"language": "json"
						}
					}
				},
				"url": {
					"raw": "http://localhost:4000/users/61b921ccaf4c6efa485671a8/setAsAdmin",
					"protocol": "http",
					"host": [
						"localhost"
					],
					"port": "4000",
					"path": [
						"users",
						"61b921ccaf4c6efa485671a8",
						"setAsAdmin"
					]
				}
			},
			"response": []
		},
		{
			"name": "get all users",
			"request": {
				"method": "GET",
				"header": [],
				"url": {
					"raw": "https://boiling-earth-61174.herokuapp.com/users/",
					"protocol": "https",
					"host": [
						"boiling-earth-61174",
						"herokuapp",
						"com"
					],
					"path": [
						"users",
						""
					]
				}
			},
			"response": []
		},
		{
			"name": "create new product",
			"request": {
				"auth": {
					"type": "bearer",
					"bearer": [
						{
							"key": "token",
							"value": "eyJhbGciOiJIUzI1NiIsInR5cCI6IkpXVCJ9.eyJpZCI6IjYxYjkyMTRlYWY0YzZlZmE0ODU2NzFhNiIsImVtYWlsIjoiYmlsbG55ZUBtYWlsLmNvbSIsImlzQWRtaW4iOnRydWUsImlhdCI6MTYzOTUyMjkzM30.94FyWBV0xpPnJK5b9MOm0ViFicZhxw9rM047eKRlfCo",
							"type": "string"
						}
					]
				},
				"method": "POST",
				"header": [],
				"body": {
					"mode": "raw",
					"raw": "{\n    \"name\": \"Oreo Cheescake\",\n    \"description\": \"Oreo cheescake\",\n    \"price\": 200\n}",
					"options": {
						"raw": {
							"language": "json"
						}
					}
				},
				"url": {
					"raw": "https://boiling-earth-61174.herokuapp.com/products/",
					"protocol": "https",
					"host": [
						"boiling-earth-61174",
						"herokuapp",
						"com"
					],
					"path": [
						"products",
						""
					]
				}
			},
			"response": []
		},
		{
			"name": "get active products",
			"request": {
				"method": "GET",
				"header": [],
				"url": {
					"raw": "https://boiling-earth-61174.herokuapp.com/products/",
					"protocol": "https",
					"host": [
						"boiling-earth-61174",
						"herokuapp",
						"com"
					],
					"path": [
						"products",
						""
					]
				}
			},
			"response": []
		},
		{
			"name": "get one product",
			"request": {
				"method": "GET",
				"header": [],
				"url": {
					"raw": "https://boiling-earth-61174.herokuapp.com/products/61b92334af4c6efa485671b2",
					"protocol": "https",
					"host": [
						"boiling-earth-61174",
						"herokuapp",
						"com"
					],
					"path": [
						"products",
						"61b92334af4c6efa485671b2"
					]
				}
			},
			"response": []
		},
		{
			"name": "update product",
			"request": {
				"auth": {
					"type": "bearer",
					"bearer": [
						{
							"key": "token",
							"value": "eyJhbGciOiJIUzI1NiIsInR5cCI6IkpXVCJ9.eyJpZCI6IjYxYjk2NGM1N2Y0OThkZGFhNDhhZjIwMCIsImVtYWlsIjoibWlja2V5bW91c2VAbWFpbC5jb20iLCJpc0FkbWluIjp0cnVlLCJpYXQiOjE2Mzk1NDY5MTl9.mbcW2vQBtwdtqYKiTxR3eKsrzcdGTWl-_lXDeuEIHgw",
							"type": "string"
						}
					]
				},
				"method": "PUT",
				"header": [],
				"body": {
					"mode": "raw",
					"raw": "{\n    \"name\": \"Ube cake\",\n    \"description\": \"Ube flavored cake with custard and ube halaya filling\",\n    \"price\": 600\n}",
					"options": {
						"raw": {
							"language": "json"
						}
					}
				},
				"url": {
					"raw": "https://boiling-earth-61174.herokuapp.com/products/61b92334af4c6efa485671b2",
					"protocol": "https",
					"host": [
						"boiling-earth-61174",
						"herokuapp",
						"com"
					],
					"path": [
						"products",
						"61b92334af4c6efa485671b2"
					]
				}
			},
			"response": []
		},
		{
			"name": "archive product",
			"request": {
				"auth": {
					"type": "bearer",
					"bearer": [
						{
							"key": "token",
							"value": "eyJhbGciOiJIUzI1NiIsInR5cCI6IkpXVCJ9.eyJpZCI6IjYxYjkyMTRlYWY0YzZlZmE0ODU2NzFhNiIsImVtYWlsIjoiYmlsbG55ZUBtYWlsLmNvbSIsImlzQWRtaW4iOnRydWUsImlhdCI6MTYzOTUyMjkzM30.94FyWBV0xpPnJK5b9MOm0ViFicZhxw9rM047eKRlfCo",
							"type": "string"
						}
					]
				},
				"method": "PUT",
				"header": [],
				"url": {
					"raw": "https://boiling-earth-61174.herokuapp.com/products/61b9650a364eb895f13df41a/archive",
					"protocol": "https",
					"host": [
						"boiling-earth-61174",
						"herokuapp",
						"com"
					],
					"path": [
						"products",
						"61b9650a364eb895f13df41a",
						"archive"
					]
				}
			},
			"response": []
		},
		{
			"name": "Create order",
			"request": {
				"auth": {
					"type": "bearer",
					"bearer": [
						{
							"key": "token",
							"value": "eyJhbGciOiJIUzI1NiIsInR5cCI6IkpXVCJ9.eyJpZCI6IjYxYjkyMjMwYWY0YzZlZmE0ODU2NzFhYyIsImVtYWlsIjoiZG9uYWxkZHVja0BtYWlsLmNvbSIsImlzQWRtaW4iOmZhbHNlLCJpYXQiOjE2Mzk1NDAxMjF9.HuMgemtqlD76FQ61YfzEXeb7DdqrpLiyfGljPgeBcPI",
							"type": "string"
						}
					]
				},
				"method": "POST",
				"header": [],
				"body": {
					"mode": "raw",
					"raw": "{\n    \"productId\": \"61b92334af4c6efa485671b2\",\n    \"amount\": 2\n}",
					"options": {
						"raw": {
							"language": "json"
						}
					}
				},
				"url": {
					"raw": "https://boiling-earth-61174.herokuapp.com/users/checkout",
					"protocol": "https",
					"host": [
						"boiling-earth-61174",
						"herokuapp",
						"com"
					],
					"path": [
						"users",
						"checkout"
					]
				}
			},
			"response": []
		},
		{
			"name": "get all orders",
			"request": {
				"auth": {
					"type": "bearer",
					"bearer": [
						{
							"key": "token",
							"value": "eyJhbGciOiJIUzI1NiIsInR5cCI6IkpXVCJ9.eyJpZCI6IjYxYjkyMWNjYWY0YzZlZmE0ODU2NzFhOCIsImVtYWlsIjoiYm9icm9zc0BtYWlsLmNvbSIsImlzQWRtaW4iOnRydWUsImlhdCI6MTYzOTUyMzcxMH0.fWtQswYT3HdnEMDZZBP0qdLzauxlP7CD9e0_IZv4qSk",
							"type": "string"
						}
					]
				},
				"method": "GET",
				"header": [],
				"url": {
					"raw": "https://boiling-earth-61174.herokuapp.com/users/orders",
					"protocol": "https",
					"host": [
						"boiling-earth-61174",
						"herokuapp",
						"com"
					],
					"path": [
						"users",
						"orders"
					]
				}
			},
			"response": []
		},
		{
			"name": "get user's orders",
			"request": {
				"auth": {
					"type": "bearer",
					"bearer": [
						{
							"key": "token",
							"value": "eyJhbGciOiJIUzI1NiIsInR5cCI6IkpXVCJ9.eyJpZCI6IjYxYjkyMjMwYWY0YzZlZmE0ODU2NzFhYyIsImVtYWlsIjoiZG9uYWxkZHVja0BtYWlsLmNvbSIsImlzQWRtaW4iOmZhbHNlLCJpYXQiOjE2Mzk1NDAxMjF9.HuMgemtqlD76FQ61YfzEXeb7DdqrpLiyfGljPgeBcPI",
							"type": "string"
						}
					]
				},
				"method": "GET",
				"header": [],
				"url": {
					"raw": "https://boiling-earth-61174.herokuapp.com/users/myOrders",
					"protocol": "https",
					"host": [
						"boiling-earth-61174",
						"herokuapp",
						"com"
					],
					"path": [
						"users",
						"myOrders"
					]
				}
			},
			"response": []
		}
	]
}