{
	"info": {
		"_postman_id": "1b39b02e-741d-4b6c-b353-399cde6fbd48",
		"name": "ecommerce api (local host)",
		"schema": "https://schema.getpostman.com/json/collection/v2.1.0/collection.json"
	},
	"item": [
		{
			"name": "user registration",
			"request": {
				"method": "POST",
				"header": [],
				"body": {
					"mode": "raw",
					"raw": "{\n    \"firstName\": \"Donald\",\n    \"lastName\": \"Duck\",\n    \"email\": \"donaldduck@mail.com\",\n    \"password\": \"donald123\"\n}",
					"options": {
						"raw": {
							"language": "json"
						}
					}
				},
				"url": {
					"raw": "http://localhost:4000/users/register",
					"protocol": "http",
					"host": [
						"localhost"
					],
					"port": "4000",
					"path": [
						"users",
						"register"
					]
				}
			},
			"response": []
		},
		{
			"name": "user authentication / login",
			"request": {
				"method": "POST",
				"header": [],
				"body": {
					"mode": "raw",
					"raw": "{\n    \"email\": \"bobross@mail.com\",\n    \"password\": \"bob123\"\n}",
					"options": {
						"raw": {
							"language": "json"
						}
					}
				},
				"url": {
					"raw": "http://localhost:4000/users/login",
					"protocol": "http",
					"host": [
						"localhost"
					],
					"port": "4000",
					"path": [
						"users",
						"login"
					]
				}
			},
			"response": []
		},
		{
			"name": "set as admin",
			"request": {
				"auth": {
					"type": "bearer",
					"bearer": [
						{
							"key": "token",
							"value": "eyJhbGciOiJIUzI1NiIsInR5cCI6IkpXVCJ9.eyJpZCI6IjYxYjkyMTRlYWY0YzZlZmE0ODU2NzFhNiIsImVtYWlsIjoiYmlsbG55ZUBtYWlsLmNvbSIsImlzQWRtaW4iOnRydWUsImlhdCI6MTYzOTUyMjkzM30.94FyWBV0xpPnJK5b9MOm0ViFicZhxw9rM047eKRlfCo",
							"type": "string"
						}
					]
				},
				"method": "PUT",
				"header": [],
				"body": {
					"mode": "raw",
					"raw": "",
					"options": {
						"raw": {
							"language": "json"
						}
					}
				},
				"url": {
					"raw": "http://localhost:4000/users/61b921ccaf4c6efa485671a8/setAsAdmin",
					"protocol": "http",
					"host": [
						"localhost"
					],
					"port": "4000",
					"path": [
						"users",
						"61b921ccaf4c6efa485671a8",
						"setAsAdmin"
					]
				}
			},
			"response": []
		},
		{
			"name": "get all users",
			"request": {
				"method": "GET",
				"header": [],
				"url": {
					"raw": "https://boiling-earth-61174.herokuapp.com/users/",
					"protocol": "https",
					"host": [
						"boiling-earth-61174",
						"herokuapp",
						"com"
					],
					"path": [
						"users",
						""
					]
				}
			},
			"response": []
		},
		{
			"name": "create new product",
			"request": {
				"auth": {
					"type": "bearer",
					"bearer": [
						{
							"key": "token",
							"value": "eyJhbGciOiJIUzI1NiIsInR5cCI6IkpXVCJ9.eyJpZCI6IjYxYjkyMTRlYWY0YzZlZmE0ODU2NzFhNiIsImVtYWlsIjoiYmlsbG55ZUBtYWlsLmNvbSIsImlzQWRtaW4iOnRydWUsImlhdCI6MTYzOTUyMjkzM30.94FyWBV0xpPnJK5b9MOm0ViFicZhxw9rM047eKRlfCo",
							"type": "string"
						}
					]
				},
				"method": "POST",
				"header": [],
				"body": {
					"mode": "raw",
					"raw": "{\n    \"name\": \"Chocolate Banana Bread\",\n    \"description\": \"Banana bread with chocolate chips \",\n    \"price\": 150\n}",
					"options": {
						"raw": {
							"language": "json"
						}
					}
				},
				"url": {
					"raw": "http://localhost:4000/products/",
					"protocol": "http",
					"host": [
						"localhost"
					],
					"port": "4000",
					"path": [
						"products",
						""
					]
				}
			},
			"response": []
		},
		{
			"name": "get active products",
			"request": {
				"method": "GET",
				"header": [],
				"url": {
					"raw": "http://localhost:4000/products/",
					"protocol": "http",
					"host": [
						"localhost"
					],
					"port": "4000",
					"path": [
						"products",
						""
					]
				}
			},
			"response": []
		},
		{
			"name": "get one product",
			"request": {
				"method": "GET",
				"header": [],
				"url": {
					"raw": "http://localhost:4000/products/61b923d1af4c6efa485671b9",
					"protocol": "http",
					"host": [
						"localhost"
					],
					"port": "4000",
					"path": [
						"products",
						"61b923d1af4c6efa485671b9"
					]
				}
			},
			"response": []
		},
		{
			"name": "update product",
			"request": {
				"auth": {
					"type": "bearer",
					"bearer": [
						{
							"key": "token",
							"value": "eyJhbGciOiJIUzI1NiIsInR5cCI6IkpXVCJ9.eyJpZCI6IjYxYjkyMTRlYWY0YzZlZmE0ODU2NzFhNiIsImVtYWlsIjoiYmlsbG55ZUBtYWlsLmNvbSIsImlzQWRtaW4iOnRydWUsImlhdCI6MTYzOTUyMjkzM30.94FyWBV0xpPnJK5b9MOm0ViFicZhxw9rM047eKRlfCo",
							"type": "string"
						}
					]
				},
				"method": "PUT",
				"header": [],
				"body": {
					"mode": "raw",
					"raw": "{\n    \"name\": \"Dedication cake\",\n    \"description\": \"Plain sheet cake that can be decorated in any way for the customer\",\n    \"price\": 400\n}",
					"options": {
						"raw": {
							"language": "json"
						}
					}
				},
				"url": {
					"raw": "http://localhost:4000/products/61b9238daf4c6efa485671b5",
					"protocol": "http",
					"host": [
						"localhost"
					],
					"port": "4000",
					"path": [
						"products",
						"61b9238daf4c6efa485671b5"
					]
				}
			},
			"response": []
		},
		{
			"name": "archive product",
			"request": {
				"auth": {
					"type": "bearer",
					"bearer": [
						{
							"key": "token",
							"value": "eyJhbGciOiJIUzI1NiIsInR5cCI6IkpXVCJ9.eyJpZCI6IjYxYjkyMTRlYWY0YzZlZmE0ODU2NzFhNiIsImVtYWlsIjoiYmlsbG55ZUBtYWlsLmNvbSIsImlzQWRtaW4iOnRydWUsImlhdCI6MTYzOTUyMjkzM30.94FyWBV0xpPnJK5b9MOm0ViFicZhxw9rM047eKRlfCo",
							"type": "string"
						}
					]
				},
				"method": "PUT",
				"header": [],
				"url": {
					"raw": "http://localhost:4000/products/61b923d1af4c6efa485671b9/archive",
					"protocol": "http",
					"host": [
						"localhost"
					],
					"port": "4000",
					"path": [
						"products",
						"61b923d1af4c6efa485671b9",
						"archive"
					]
				}
			},
			"response": []
		},
		{
			"name": "Create order",
			"request": {
				"auth": {
					"type": "bearer",
					"bearer": [
						{
							"key": "token",
							"value": "eyJhbGciOiJIUzI1NiIsInR5cCI6IkpXVCJ9.eyJpZCI6IjYxYjkyMTRlYWY0YzZlZmE0ODU2NzFhNiIsImVtYWlsIjoiYmlsbG55ZUBtYWlsLmNvbSIsImlzQWRtaW4iOnRydWUsImlhdCI6MTYzOTUyMjkzM30.94FyWBV0xpPnJK5b9MOm0ViFicZhxw9rM047eKRlfCo",
							"type": "string"
						}
					]
				},
				"method": "POST",
				"header": [],
				"body": {
					"mode": "raw",
					"raw": "{\n    \"userId\": \"61b9221faf4c6efa485671aa\",\n    \"productId\": \"61b9238daf4c6efa485671b5\",\n    \"amount\": 3\n}",
					"options": {
						"raw": {
							"language": "json"
						}
					}
				},
				"url": {
					"raw": "http://localhost:4000/users/checkout",
					"protocol": "http",
					"host": [
						"localhost"
					],
					"port": "4000",
					"path": [
						"users",
						"checkout"
					]
				}
			},
			"response": []
		},
		{
			"name": "get all orders",
			"request": {
				"auth": {
					"type": "bearer",
					"bearer": [
						{
							"key": "token",
							"value": "eyJhbGciOiJIUzI1NiIsInR5cCI6IkpXVCJ9.eyJpZCI6IjYxYjkyMWNjYWY0YzZlZmE0ODU2NzFhOCIsImVtYWlsIjoiYm9icm9zc0BtYWlsLmNvbSIsImlzQWRtaW4iOnRydWUsImlhdCI6MTYzOTUyMzcxMH0.fWtQswYT3HdnEMDZZBP0qdLzauxlP7CD9e0_IZv4qSk",
							"type": "string"
						}
					]
				},
				"method": "GET",
				"header": [],
				"url": {
					"raw": "http://localhost:4000/users/orders",
					"protocol": "http",
					"host": [
						"localhost"
					],
					"port": "4000",
					"path": [
						"users",
						"orders"
					]
				}
			},
			"response": []
		},
		{
			"name": "get user's orders",
			"request": {
				"auth": {
					"type": "bearer",
					"bearer": [
						{
							"key": "token",
							"value": "eyJhbGciOiJIUzI1NiIsInR5cCI6IkpXVCJ9.eyJpZCI6IjYxYjkyMjFmYWY0YzZlZmE0ODU2NzFhYSIsImVtYWlsIjoibWlja2V5bW91c2VAbWFpbC5jb20iLCJpc0FkbWluIjpmYWxzZSwiaWF0IjoxNjM5NTIzNjYxfQ.Gn2D_q9NPM36o8llNOQHMzi7MvcASQHuSZeyEw6oSHI",
							"type": "string"
						}
					]
				},
				"method": "GET",
				"header": [],
				"url": {
					"raw": "http://localhost:4000/users/myOrders",
					"protocol": "http",
					"host": [
						"localhost"
					],
					"port": "4000",
					"path": [
						"users",
						"myOrders"
					]
				}
			},
			"response": []
		}
	]
}