{
	"info": {
		"_postman_id": "43801e0f-1e39-46cd-a9c0-88cf4bf56391",
		"name": "E-Commerce-API-Capstone",
		"schema": "https://schema.getpostman.com/json/collection/v2.1.0/collection.json"
	},
	"item": [
		{
			"name": "User Registration",
			"request": {
				"method": "POST",
				"header": [],
				"body": {
					"mode": "raw",
					"raw": "{\r\n    \"email\":\"Bulaon@mail.com\",\r\n    \"password\": \"Bulaon123\"\r\n}",
					"options": {
						"raw": {
							"language": "json"
						}
					}
				},
				"url": {
					"raw": "https://shielded-reef-23870.herokuapp.com/api/users/register",
					"protocol": "https",
					"host": [
						"shielded-reef-23870",
						"herokuapp",
						"com"
					],
					"path": [
						"api",
						"users",
						"register"
					]
				}
			},
			"response": []
		},
		{
			"name": "All users",
			"request": {
				"method": "GET",
				"header": [],
				"url": {
					"raw": "https://shielded-reef-23870.herokuapp.com/api/users/allUser",
					"protocol": "https",
					"host": [
						"shielded-reef-23870",
						"herokuapp",
						"com"
					],
					"path": [
						"api",
						"users",
						"allUser"
					]
				}
			},
			"response": []
		},
		{
			"name": "Authenticating a user",
			"request": {
				"method": "POST",
				"header": [],
				"body": {
					"mode": "raw",
					"raw": "{\r\n    \"email\":\"Denise@mail.com\",\r\n    \"password\": \"Denise123\"\r\n}",
					"options": {
						"raw": {
							"language": "json"
						}
					}
				},
				"url": {
					"raw": "https://shielded-reef-23870.herokuapp.com/api/users/login",
					"protocol": "https",
					"host": [
						"shielded-reef-23870",
						"herokuapp",
						"com"
					],
					"path": [
						"api",
						"users",
						"login"
					]
				}
			},
			"response": []
		},
		{
			"name": "Set user as Admin",
			"request": {
				"auth": {
					"type": "bearer",
					"bearer": [
						{
							"key": "token",
							"value": "eyJhbGciOiJIUzI1NiIsInR5cCI6IkpXVCJ9.eyJpZCI6IjYxYjg0ODViMTAyMWM3ZDI5YjZlYWFiMCIsImVtYWlsIjoiRGVuaXNlQG1haWwuY29tIiwiaXNBZG1pbiI6dHJ1ZSwiaWF0IjoxNjM5NDg3Njc4fQ.mLq2_wGQVBDd5JKRxRZI4biihzn8q6KDYq9hUEauzlo",
							"type": "string"
						}
					]
				},
				"method": "PUT",
				"header": [],
				"url": {
					"raw": "https://shielded-reef-23870.herokuapp.com/api/users/61b89796d1631c2492be7e61/setAsAdmin",
					"protocol": "https",
					"host": [
						"shielded-reef-23870",
						"herokuapp",
						"com"
					],
					"path": [
						"api",
						"users",
						"61b89796d1631c2492be7e61",
						"setAsAdmin"
					]
				}
			},
			"response": []
		},
		{
			"name": "Add Product",
			"request": {
				"auth": {
					"type": "bearer",
					"bearer": [
						{
							"key": "token",
							"value": "eyJhbGciOiJIUzI1NiIsInR5cCI6IkpXVCJ9.eyJpZCI6IjYxYjg0ODM5MTAyMWM3ZDI5YjZlYWFhZCIsImVtYWlsIjoiQWxleEBtYWlsLmNvbSIsImlzQWRtaW4iOmZhbHNlLCJpYXQiOjE2Mzk0NjgwMTR9.or0HrpPPOwawymeet66vJwliKeZDmOciafQp7G-iCTs",
							"type": "string"
						}
					]
				},
				"method": "POST",
				"header": [],
				"body": {
					"mode": "raw",
					"raw": "{\r\n    \"name\": \"sample\",\r\n    \"description\": \"Phone Case\",\r\n    \"price\": 250\r\n}",
					"options": {
						"raw": {
							"language": "json"
						}
					}
				},
				"url": {
					"raw": "https://shielded-reef-23870.herokuapp.com/api/products/products",
					"protocol": "https",
					"host": [
						"shielded-reef-23870",
						"herokuapp",
						"com"
					],
					"path": [
						"api",
						"products",
						"products"
					]
				}
			},
			"response": []
		},
		{
			"name": "Retrieve all active products",
			"request": {
				"method": "GET",
				"header": [],
				"url": {
					"raw": "https://shielded-reef-23870.herokuapp.com/api/products/products",
					"protocol": "https",
					"host": [
						"shielded-reef-23870",
						"herokuapp",
						"com"
					],
					"path": [
						"api",
						"products",
						"products"
					]
				}
			},
			"response": []
		},
		{
			"name": "Retrieve single Product",
			"request": {
				"method": "GET",
				"header": [],
				"url": {
					"raw": "https://shielded-reef-23870.herokuapp.com/api/products/61b84a59b452851c51e27224",
					"protocol": "https",
					"host": [
						"shielded-reef-23870",
						"herokuapp",
						"com"
					],
					"path": [
						"api",
						"products",
						"61b84a59b452851c51e27224"
					]
				}
			},
			"response": []
		},
		{
			"name": "Update product information",
			"request": {
				"auth": {
					"type": "bearer",
					"bearer": [
						{
							"key": "token",
							"value": "eyJhbGciOiJIUzI1NiIsInR5cCI6IkpXVCJ9.eyJpZCI6IjYxYjg0ODViMTAyMWM3ZDI5YjZlYWFiMCIsImVtYWlsIjoiRGVuaXNlQG1haWwuY29tIiwiaXNBZG1pbiI6dHJ1ZSwiaWF0IjoxNjM5NDg1NDM2fQ.S_6CVjS0ZJw_s0_asQVc1RVegpaqmgcW8F2YvQFFBYg",
							"type": "string"
						}
					]
				},
				"method": "PUT",
				"header": [],
				"body": {
					"mode": "raw",
					"raw": "{   \r\n    \"name\": \"Proof\",\r\n    \"description\": \"Phone case\",\r\n    \"price\": 550\r\n}",
					"options": {
						"raw": {
							"language": "json"
						}
					}
				},
				"url": {
					"raw": "https://shielded-reef-23870.herokuapp.com/api/products/61b84a2cb452851c51e27220/update",
					"protocol": "https",
					"host": [
						"shielded-reef-23870",
						"herokuapp",
						"com"
					],
					"path": [
						"api",
						"products",
						"61b84a2cb452851c51e27220",
						"update"
					]
				}
			},
			"response": []
		},
		{
			"name": "Archive a product",
			"request": {
				"auth": {
					"type": "bearer",
					"bearer": [
						{
							"key": "token",
							"value": "eyJhbGciOiJIUzI1NiIsInR5cCI6IkpXVCJ9.eyJpZCI6IjYxYjg0ODViMTAyMWM3ZDI5YjZlYWFiMCIsImVtYWlsIjoiRGVuaXNlQG1haWwuY29tIiwiaXNBZG1pbiI6dHJ1ZSwiaWF0IjoxNjM5NDY5NzMxfQ.W2JhuM8V3tqla0b0_rH3-2ZcSsx2Pt0_dgOiUSpElnM",
							"type": "string"
						}
					]
				},
				"method": "PUT",
				"header": [],
				"url": {
					"raw": "https://shielded-reef-23870.herokuapp.com/api/products/61b84a59b452851c51e27224/archive",
					"protocol": "https",
					"host": [
						"shielded-reef-23870",
						"herokuapp",
						"com"
					],
					"path": [
						"api",
						"products",
						"61b84a59b452851c51e27224",
						"archive"
					]
				}
			},
			"response": []
		},
		{
			"name": "Checkout",
			"request": {
				"auth": {
					"type": "bearer",
					"bearer": [
						{
							"key": "token",
							"value": "eyJhbGciOiJIUzI1NiIsInR5cCI6IkpXVCJ9.eyJpZCI6IjYxYjg0ODM5MTAyMWM3ZDI5YjZlYWFhZCIsImVtYWlsIjoiQWxleEBtYWlsLmNvbSIsImlzQWRtaW4iOmZhbHNlLCJpYXQiOjE2Mzk0NzI4Mjh9.lg59aQG-CiCArwJk6re-LKdPSd8vrh0QotKzDojIJ8w",
							"type": "string"
						}
					]
				},
				"method": "POST",
				"header": [],
				"body": {
					"mode": "raw",
					"raw": "{\r\n    \"userId\": \"61b848391021c7d29b6eaaad\",\r\n    \"totalAmount\": 3,\r\n    \"orderedProducts\":[{\r\n        \"productId\":\"61b84a09b452851c51e2721d\",\r\n        \"price\": 250\r\n    }]\r\n}",
					"options": {
						"raw": {
							"language": "json"
						}
					}
				},
				"url": {
					"raw": "https://shielded-reef-23870.herokuapp.com/api/orders/checkout",
					"protocol": "https",
					"host": [
						"shielded-reef-23870",
						"herokuapp",
						"com"
					],
					"path": [
						"api",
						"orders",
						"checkout"
					]
				}
			},
			"response": []
		},
		{
			"name": "Retrieve Orders",
			"request": {
				"auth": {
					"type": "bearer",
					"bearer": [
						{
							"key": "token",
							"value": "eyJhbGciOiJIUzI1NiIsInR5cCI6IkpXVCJ9.eyJpZCI6IjYxYjg0ODM5MTAyMWM3ZDI5YjZlYWFhZCIsImVtYWlsIjoiQWxleEBtYWlsLmNvbSIsImlzQWRtaW4iOmZhbHNlLCJpYXQiOjE2Mzk0NzQ1ODJ9.HV3uDwY1dIdhr5KR4vQO7XhkKuHIOw8FJR6wKNkkqXk",
							"type": "string"
						}
					]
				},
				"method": "GET",
				"header": [],
				"url": {
					"raw": "https://shielded-reef-23870.herokuapp.com/api/orders/myOrders",
					"protocol": "https",
					"host": [
						"shielded-reef-23870",
						"herokuapp",
						"com"
					],
					"path": [
						"api",
						"orders",
						"myOrders"
					]
				}
			},
			"response": []
		},
		{
			"name": "All Orders",
			"request": {
				"auth": {
					"type": "bearer",
					"bearer": [
						{
							"key": "token",
							"value": "eyJhbGciOiJIUzI1NiIsInR5cCI6IkpXVCJ9.eyJpZCI6IjYxYjg0ODViMTAyMWM3ZDI5YjZlYWFiMCIsImVtYWlsIjoiRGVuaXNlQG1haWwuY29tIiwiaXNBZG1pbiI6dHJ1ZSwiaWF0IjoxNjM5NDc0OTg2fQ.oHs8GiV1MBuKHOirT66e72R9tBTWJUR6vD1MzsNWaUM",
							"type": "string"
						}
					]
				},
				"method": "GET",
				"header": [],
				"url": {
					"raw": "https://shielded-reef-23870.herokuapp.com/api/orders/orders",
					"protocol": "https",
					"host": [
						"shielded-reef-23870",
						"herokuapp",
						"com"
					],
					"path": [
						"api",
						"orders",
						"orders"
					]
				}
			},
			"response": []
		}
	]
}