{
	"info": {
		"_postman_id": "1073e645-e11c-40e0-a838-c5ff67aaa3fc",
		"name": "ecommerce-api",
		"schema": "https://schema.getpostman.com/json/collection/v2.1.0/collection.json"
	},
	"item": [
		{
			"name": "Register a User",
			"request": {
				"method": "POST",
				"header": [],
				"body": {
					"mode": "raw",
					"raw": "{\r\n    \"email\": \"dri@mail.com\",\r\n    \"password\": \"dri\"\r\n}",
					"options": {
						"raw": {
							"language": "json"
						}
					}
				},
				"url": {
					"raw": "https://murmuring-meadow-05679.herokuapp.com/api/users/register",
					"protocol": "https",
					"host": [
						"murmuring-meadow-05679",
						"herokuapp",
						"com"
					],
					"path": [
						"api",
						"users",
						"register"
					]
				}
			},
			"response": []
		},
		{
			"name": "User Set as  Admin",
			"request": {
				"auth": {
					"type": "bearer",
					"bearer": [
						{
							"key": "token",
							"value": "eyJhbGciOiJIUzI1NiIsInR5cCI6IkpXVCJ9.eyJpZCI6IjYxYjY5NWUyZDc4NTNmZWRmNzg2YWNiYyIsImVtYWlsIjoiYWRtaW5AbWFpbC5jb20iLCJpc0FkbWluIjp0cnVlLCJpYXQiOjE2MzkzNTk4OTF9.gG1A5H4Sc7az7yFtI3MjqyEIejn4doYUgjPL_YGDSCU",
							"type": "string"
						}
					]
				},
				"method": "PUT",
				"header": [],
				"body": {
					"mode": "raw",
					"raw": "{\r\n    \"isAdmin\": true\r\n}",
					"options": {
						"raw": {
							"language": "json"
						}
					}
				},
				"url": {
					"raw": "https://murmuring-meadow-05679.herokuapp.com/api/users/61b38332d2932caa56e436df/setAsAdmin",
					"protocol": "https",
					"host": [
						"murmuring-meadow-05679",
						"herokuapp",
						"com"
					],
					"path": [
						"api",
						"users",
						"61b38332d2932caa56e436df",
						"setAsAdmin"
					]
				}
			},
			"response": []
		},
		{
			"name": "Login user",
			"request": {
				"auth": {
					"type": "bearer",
					"bearer": [
						{
							"key": "token",
							"value": "",
							"type": "string"
						}
					]
				},
				"method": "POST",
				"header": [],
				"body": {
					"mode": "raw",
					"raw": "{\r\n    \"email\": \"admin@mail.com\",\r\n    \"password\": \"admin\"\r\n}",
					"options": {
						"raw": {
							"language": "json"
						}
					}
				},
				"url": {
					"raw": "https://murmuring-meadow-05679.herokuapp.com/api/users/login",
					"protocol": "https",
					"host": [
						"murmuring-meadow-05679",
						"herokuapp",
						"com"
					],
					"path": [
						"api",
						"users",
						"login"
					]
				}
			},
			"response": []
		},
		{
			"name": "Add  Product",
			"request": {
				"auth": {
					"type": "bearer",
					"bearer": [
						{
							"key": "token",
							"value": "eyJhbGciOiJIUzI1NiIsInR5cCI6IkpXVCJ9.eyJpZCI6IjYxYjY5NWUyZDc4NTNmZWRmNzg2YWNiYyIsImVtYWlsIjoiYWRtaW5AbWFpbC5jb20iLCJpc0FkbWluIjp0cnVlLCJpYXQiOjE2MzkzNjIwMDd9.cNrhrTcQq5MNZtj5v7Uima30cYI5fY5wHZCOxoY0L9E",
							"type": "string"
						}
					]
				},
				"method": "POST",
				"header": [],
				"body": {
					"mode": "raw",
					"raw": "{\r\n    \"name\": \"Nike Air Max 270\",\r\n    \"description\": \"Men's Shoes\",\r\n    \"price\": 7645 \r\n}",
					"options": {
						"raw": {
							"language": "json"
						}
					}
				},
				"url": {
					"raw": "https://murmuring-meadow-05679.herokuapp.com/api/products/addProduct",
					"protocol": "https",
					"host": [
						"murmuring-meadow-05679",
						"herokuapp",
						"com"
					],
					"path": [
						"api",
						"products",
						"addProduct"
					]
				}
			},
			"response": []
		},
		{
			"name": "Retrieve All Active Product",
			"request": {
				"method": "GET",
				"header": [],
				"url": {
					"raw": "http://localhost:4000/api/products/",
					"protocol": "http",
					"host": [
						"localhost"
					],
					"port": "4000",
					"path": [
						"api",
						"products",
						""
					]
				}
			},
			"response": []
		},
		{
			"name": "Retrieve Single Product",
			"request": {
				"method": "GET",
				"header": [],
				"url": {
					"raw": "https://murmuring-meadow-05679.herokuapp.com/api/products/61b6af62e085a0e58fd3d8be",
					"protocol": "https",
					"host": [
						"murmuring-meadow-05679",
						"herokuapp",
						"com"
					],
					"path": [
						"api",
						"products",
						"61b6af62e085a0e58fd3d8be"
					]
				}
			},
			"response": []
		},
		{
			"name": "Archive Product",
			"request": {
				"auth": {
					"type": "bearer",
					"bearer": [
						{
							"key": "token",
							"value": "eyJhbGciOiJIUzI1NiIsInR5cCI6IkpXVCJ9.eyJpZCI6IjYxYjY5NWUyZDc4NTNmZWRmNzg2YWNiYyIsImVtYWlsIjoiYWRtaW5AbWFpbC5jb20iLCJpc0FkbWluIjp0cnVlLCJpYXQiOjE2MzkzNjIwMDd9.cNrhrTcQq5MNZtj5v7Uima30cYI5fY5wHZCOxoY0L9E",
							"type": "string"
						}
					]
				},
				"method": "PUT",
				"header": [],
				"url": {
					"raw": "https://murmuring-meadow-05679.herokuapp.com/api/products/61b6b26ea8f4f6cc5db35e75/archive",
					"protocol": "https",
					"host": [
						"murmuring-meadow-05679",
						"herokuapp",
						"com"
					],
					"path": [
						"api",
						"products",
						"61b6b26ea8f4f6cc5db35e75",
						"archive"
					]
				}
			},
			"response": []
		},
		{
			"name": "Update Product",
			"request": {
				"auth": {
					"type": "bearer",
					"bearer": [
						{
							"key": "token",
							"value": "eyJhbGciOiJIUzI1NiIsInR5cCI6IkpXVCJ9.eyJpZCI6IjYxYjY5NWUyZDc4NTNmZWRmNzg2YWNiYyIsImVtYWlsIjoiYWRtaW5AbWFpbC5jb20iLCJpc0FkbWluIjp0cnVlLCJpYXQiOjE2MzkzNjIwMDd9.cNrhrTcQq5MNZtj5v7Uima30cYI5fY5wHZCOxoY0L9E",
							"type": "string"
						}
					]
				},
				"method": "PUT",
				"header": [],
				"body": {
					"mode": "raw",
					"raw": "{\r\n    \"name\": \"Nike Air Max 90 G\",\r\n    \"description\": \"Golf Shoe\",\r\n    \"price\": 6895\r\n}",
					"options": {
						"raw": {
							"language": "json"
						}
					}
				},
				"url": {
					"raw": "https://murmuring-meadow-05679.herokuapp.com/api/products/61b6b26ea8f4f6cc5db35e75/updateProduct",
					"protocol": "https",
					"host": [
						"murmuring-meadow-05679",
						"herokuapp",
						"com"
					],
					"path": [
						"api",
						"products",
						"61b6b26ea8f4f6cc5db35e75",
						"updateProduct"
					]
				}
			},
			"response": []
		},
		{
			"name": "Create Order",
			"request": {
				"auth": {
					"type": "bearer",
					"bearer": [
						{
							"key": "token",
							"value": "eyJhbGciOiJIUzI1NiIsInR5cCI6IkpXVCJ9.eyJpZCI6IjYxYjZlNWU5MGQ0NzIzMWJkODljNGI0OSIsImVtYWlsIjoiYWxsaXNvbkBtYWlsLmNvbSIsImlzQWRtaW4iOmZhbHNlLCJpYXQiOjE2MzkzODgyNjd9.kYzdAztepkjquTFLDKKek__rISeAU2v1lbO8V2FJtS4",
							"type": "string"
						}
					]
				},
				"method": "POST",
				"header": [],
				"body": {
					"mode": "raw",
					"raw": "{\r\n    \"userId\": \"61b6e5e90d47231bd89c4b49\",\r\n    \"productId\": \"61b6e578912de9bb93fb5093\"\r\n   \r\n}",
					"options": {
						"raw": {
							"language": "json"
						}
					}
				},
				"url": {
					"raw": "localhost:4000/api/users/checkout",
					"host": [
						"localhost"
					],
					"port": "4000",
					"path": [
						"api",
						"users",
						"checkout"
					]
				}
			},
			"response": []
		},
		{
			"name": "Users Order",
			"request": {
				"auth": {
					"type": "bearer",
					"bearer": [
						{
							"key": "token",
							"value": "eyJhbGciOiJIUzI1NiIsInR5cCI6IkpXVCJ9.eyJpZCI6IjYxYjZlNWU5MGQ0NzIzMWJkODljNGI0OSIsImVtYWlsIjoiYWxsaXNvbkBtYWlsLmNvbSIsImlzQWRtaW4iOmZhbHNlLCJpYXQiOjE2Mzk0NDk5Mjd9.E5M6AsEnNVAbgQo3k4o2vEWN_201R5EibDamgDGmsPA",
							"type": "string"
						}
					]
				},
				"method": "GET",
				"header": [],
				"url": {
					"raw": "https://murmuring-meadow-05679.herokuapp.com/api/users/61b6e5e90d47231bd89c4b49/myOrders",
					"protocol": "https",
					"host": [
						"murmuring-meadow-05679",
						"herokuapp",
						"com"
					],
					"path": [
						"api",
						"users",
						"61b6e5e90d47231bd89c4b49",
						"myOrders"
					]
				}
			},
			"response": []
		},
		{
			"name": "Get All Order",
			"request": {
				"auth": {
					"type": "bearer",
					"bearer": [
						{
							"key": "token",
							"value": "eyJhbGciOiJIUzI1NiIsInR5cCI6IkpXVCJ9.eyJpZCI6IjYxYjY5NWUyZDc4NTNmZWRmNzg2YWNiYyIsImVtYWlsIjoiYWRtaW5AbWFpbC5jb20iLCJpc0FkbWluIjp0cnVlLCJpYXQiOjE2Mzk0NTk3NTR9.AAkTqnwhp_TUqd2AalzPIFkCZb63ohHH3g2ECY-_0-4",
							"type": "string"
						}
					]
				},
				"method": "GET",
				"header": [],
				"url": {
					"raw": "https://murmuring-meadow-05679.herokuapp.com/api/users/orders",
					"protocol": "https",
					"host": [
						"murmuring-meadow-05679",
						"herokuapp",
						"com"
					],
					"path": [
						"api",
						"users",
						"orders"
					]
				}
			},
			"response": []
		}
	]
}