{
	"info": {
		"_postman_id": "1ac4e2b0-5302-4c2f-887e-62c0a2c0025d",
		"name": "S27 Activity",
		"schema": "https://schema.getpostman.com/json/collection/v2.1.0/collection.json"
	},
	"item": [
		{
			"name": "new profile",
			"request": {
				"method": "POST",
				"header": [],
				"body": {
					"mode": "raw",
					"raw": "{\n\t\"firstName\": \"Ralph\",\n\t\"lastName\": \"Dequina\",\n\t\"mobileNo\": \"09111111111\",\n\t\"email\": \"ralphdequina@mail.com\",\n\t\"password\": 12091994\n}",
					"options": {
						"raw": {
							"language": "json"
						}
					}
				},
				"url": {
					"raw": "http://localhost:4000/profile",
					"protocol": "http",
					"host": [
						"localhost"
					],
					"port": "4000",
					"path": [
						"profile"
					]
				}
			},
			"response": []
		}
	]
}