[
    {
        "id": "course101",
        "name": "Intro to CSS",
        "description": "An introduction to CSS",
        "price": 1299,
        "isActive": true,
        "units": 2,
        "slots": 20,
        "enrollees": [
            {
                "id": "course101enrollee1",
                "user_id": "user101"
            }
        ]
    },
    {
        "id": "course102",
        "name": "Intro to JS",
        "description": "An introduction to Javascript",
        "price": 1299,
        "isActive": true,
        "units": 2,
        "slots": 20,
        "enrollees": [
            {
                "id": "course102enrollee1",
                "user_id": "user101"
            },
            {
                "id": "course102enrollee2",
                "user_id": "user102"
            }
        ]
    }
]