[
  {
    "id": "course1",
    "name": "Science",
    "description": "Difficult subject",
    "price": 2000,
    "enrollmentDetails": [
      {
        "id": "courseEnroll1",
        "user_id": "user1",
        "dateEnrolled": "2021-01-01",
        "status": true
      }
    ]
  },
  {
    "id": "course2",
    "name": "Math",
    "description": "Easy subject",
    "price": 3000,
    "enrollmentDetails": [
      {
        "id": "courseEnroll1",
        "user_id": "user1",
        "dateEnrolled": "2021-01-01",
        "status": true
      },
      {
        "id": "courseEnroll1",
        "user_id": "user2",
        "dateEnrolled": "2021-01-01",
        "status": true
      }
    ]
  }
]
