[
	{
 		"id": "course1",
 		"name": "Gymnastics",
 		"description": "Sky rolling",
 		"price": 20000,
 		"isActive": true,
 		"instructor": "The Graysons",
 		"classSchedule": "MWF",
 		"units": 3,
 		"slotsleft": 3,
 		"enrollees": [
 			{
 				"student_id": "user1",
 				"firstName": "Bruce",
 				"lastName": "Wayne",
 				"status": "completed",
 				"dateEnrolled": "1976-03-01"
 			},
 			{
 				"student_id": "user2",
 				"firstName": "Dick",
 				"lastName": "Grayson",
 				"status": "completed",
 				"dateEnrolled": "1999-09-01"
 			}
 		]
 	},
 	{
 		"id": "course2",
 		"name": "Criminal Law",
 		"description": "Detective work",
 		"price": 30000,
 		"isActive": true,
 		"instructor": "Sherlock Holmes",
 		"classSchedule": "TTHF",
 		"units": 4,
 		"slotsleft": 1,
 		"enrollees": [
 			{
 				"student_id": "user1",
 				"firstName": "Bruce",
 				"lastName": "Wayne",
 				"status": "completed",
 				"dateEnrolled": "1976-03-01"
 			}
 		]
 	}
]