<?xml version="1.0" encoding="UTF-8"?>
<session version="1.0">
<refactoring comment="Delete 6 resources" deleteContents="false" description="Delete 6 resources" element1="/lp-t2" element2="/org.xtext.lp.t2" element3="/org.xtext.lp.t2.ide" element4="/org.xtext.lp.t2.tests" element5="/org.xtext.lp.t2.ui" element6="/org.xtext.lp.t2.ui.tests" flags="7" id="org.eclipse.ltk.core.refactoring.delete.resources" resources="6" stamp="1554244275801"/>
</session>