[{
  "_id": {
    "$oid": "631635928fb2999ee17324f3"
  },
  "title": "Cokelat",
  "stock": 32,
  "price": 15000,
  "description": "Cokelatnya sangat enak",
  "image": "https://image_url.com",
  "category_id": {
    "$oid": "631635bd8fb2999ee17324fb"
  }
},{
  "_id": {
    "$oid": "631635928fb2999ee17324f4"
  },
  "title": "Melon",
  "stock": 3,
  "price": 14000,
  "description": "Melonnya manis",
  "category_id": {
    "$oid": "631635bd8fb2999ee17324fb"
  }
},{
  "_id": {
    "$oid": "631635928fb2999ee17324f5"
  },
  "title": "Samsung A5",
  "stock": 2,
  "price": 4000000,
  "description": "HPnya cepat",
  "category_id": {
    "$oid": "631635cd8fb2999ee17324fc"
  }
},{
  "_id": {
    "$oid": "631635928fb2999ee17324f6"
  },
  "title": "Apel",
  "stock": 27,
  "price": 5000,
  "description": "Enak",
  "image": "https://image_url.com",
  "category_id": {
    "$oid": "631635bd8fb2999ee17324fb"
  }
},{
  "_id": {
    "$oid": "631635928fb2999ee17324f7"
  },
  "title": "Iphone 8",
  "stock": 5,
  "price": 8000000,
  "description": "Keren",
  "category_id": {
    "$oid": "631635cd8fb2999ee17324fc"
  }
},{
  "_id": {
    "$oid": "631635928fb2999ee17324f8"
  },
  "title": "Iphone 9",
  "stock": 2,
  "price": 9200000,
  "description": "Cepat",
  "image": "https://image_url.com",
  "category_id": {
    "$oid": "631635cd8fb2999ee17324fc"
  }
}]