@startuml crs1lab18HWtask_life
!pragma teoz true
scale 500 width
scale 730 height
skinparam sequenceMessageAlign center

title task1.c lifetime

box "program runtime" #Cyan

box "main" #GoldenRod
participant "main()" as main
end box

box "recursive case" 
participant "calcSum(float arr[ ], int n)" as foo
end box

main -> foo: **arr, 5**
note right: first recursive call
activate foo 

foo ->o foo : 1
activate foo

foo ->o foo : 2
activate foo

foo ->o foo : 3
activate foo

foo ->o foo : 4
activate foo
note right: base case\n(recursive end)

foo -> foo : 4
note right: returning

deactivate foo
foo -> foo : 3

deactivate foo
foo -> foo : 2

deactivate foo
foo -> foo : 1
deactivate foo
deactivate foo
deactivate foo
foo -> main: **return sum**
note right: returning ended

end box

@enduml