@startuml crs1lab18task1
scale 500 width
scale 730 height
skinparam ConditionEndStyle hline

|main|
start
-> start;

partition Init {
    :float arr[] = {pi, e, sqrt(2), phi, sqrt(3)};
    :int size = sizeof(arr) / sizeof(arr[0]);
    :float sum = 0;
}
:sum = calcSum(arr, size)|
|calcSum|
repeat
partition Args {
    :float arr[], int n;
}
:float sum = arr[n - 1];
:sum += calcSum (arr, n - 1)|
repeat while (n > 0) is (Yes)
:return **sum**]
|main|
:<color:Blue>print **sum**;
-> return 0;
stop

@enduml