@startuml task2_copyToArr
skinparam ConditionEndStyle hline 
scale 500 width
scale 830 height
header <font color=black>**copyToArr**</font>
start
-> start;
partition Init {
    :int i = 0
    int j = 0
    int ab = a + b;
}
while (i < a) is (Yes)
    :arrD[i] = arrA[i];
    backward :<color:red>i++;    
endwhile (No) 
:i = a;
while (i < ab) is (Yes)
    :arrD[i] = arrB[j];
    backward :<color:red>i++, j++;    
endwhile (No) 
:i = ab, j = 0;
if (i < d) then (Yes)
    :arrD[i] = arrC[j];
    :<color:red>i++, j++;  
else (No)
endif
stop
@enduml