@startuml crs1lab16task2
skinparam ConditionEndStyle hline 
scale 500 width
scale 930 height

start
-> start;
:<color:Red>input int **n**<
if (n <= 0) then (Yes)
    :<color:Blue> print error;
    -> return 1;
    stop
else (No)
    :float arr[n];
    :setArr(arr, n)|
    :printArr(arr, n)|
    :float sum = calcSumOfElements(arr, n)|
    :float maxEl = findMaxElement(arr, n)|
    :float minEl = findMinElement(arr, n)|
    :float prod = calcProdOfElements(arr, n)|
    :<color:Blue> print sum, maxEl, minEl, prod;
    -> return 0;
    stop
endif

@enduml
