@startuml crs1lab13tasks
skinparam ConditionEndStyle hline 
scale 500 width
scale 830 height
start
-> start;
partition Set {
    :uint32_t arrSize;
    partition Init {
        :int initArr[arrSize], cloneArr[arrSize];
    }
}
:setArr(initArr, arrSize)|
':printArr(initArr, arrSize)|
:copyArr(initArr, cloneArr, arrSize)|

:bubbleSort(cloneArr, arrSize)|
':printArr(cloneArr, arrSize)|
:copyArr(initArr, cloneArr, arrSize)|
:selectionSort(cloneArr, arrSize)|
':printArr(cloneArr, arrSize)|
:copyArr(initArr, cloneArr, arrSize)|
:insertionSort(cloneArr, arrSize)|
':printArr(cloneArr, arrSize)|
:shellSort(initArr, cloneArr, arrSize)|
:sortArr(cloneArr, arrSize)|

-> return 0;
stop
@enduml