@startuml crs1lab18task2_noRecursion
scale 500 width
scale 730 height
skinparam ConditionEndStyle hline

start
-> start;

partition Init {
    :int n = 5;
    :float sum = sqrt(n);
}
while (int i = n - 1; i >= 1; <color:Red>i--) is (Yes)
    :sum = sqrt(i + sum);
endwhile (No) 
:<color:Blue>print **sum**;
-> return 0;
stop

@enduml