en
conf t
ip host R-2-25-1 215.2.25.1
ip host SW-2-25-1 215.2.25.3
ip host SW-2-25-2 215.2.25.5
ip host Serv-2-25-1 215.2.25.7
ip host Serv-2-25-2 215.2.25.9
ip host WS-2-25-1 215.2.25.11
ip host WS-2-25-2 215.2.25.9
ip host WS-2-25-3 215.2.25.12
ip host WS-2-25-4 215.2.25.13
ip host WS-2-25-5 215.2.25.10
ip host WS-2-25-6 215.2.25.14
ex
