# Blender MTL File: 'None'
# Material Count: 2

newmtl airplane_body
Ns 17.647059
Ka 1.000000 1.000000 1.000000
Kd 1.000000 1.000000 1.000000
Ks 0.495000 0.495000 0.495000
Ke 0.000000 0.000000 0.000000
Ni 1.500000
d 1.000000
illum 2
map_Kd C:\Users\36305\Downloads\airplane_v2_L2.123c71795678-4b63-46c4-b2c6-549c45f4c806\airplane_v2_L2.123c71795678-4b63-46c4-b2c6-549c45f4c806\airplane_body_diffuse_v1.jpg
map_Ka C:\\Users\\36305\\Downloads\\airplane_v2_L2.123c71795678-4b63-46c4-b2c6-549c45f4c806\\airplane_v2_L2.123c71795678-4b63-46c4-b2c6-549c45f4c806\\airplane_body_diffuse_v1.jpg

newmtl airplane_wings
Ns 17.647059
Ka 1.000000 1.000000 1.000000
Kd 1.000000 1.000000 1.000000
Ks 0.495000 0.495000 0.495000
Ke 0.000000 0.000000 0.000000
Ni 1.500000
d 1.000000
illum 2
map_Kd C:\Users\36305\Downloads\airplane_v2_L2.123c71795678-4b63-46c4-b2c6-549c45f4c806\airplane_v2_L2.123c71795678-4b63-46c4-b2c6-549c45f4c806\airplane_wings_diffuse_v1.jpg
map_Ka C:\\Users\\36305\\Downloads\\airplane_v2_L2.123c71795678-4b63-46c4-b2c6-549c45f4c806\\airplane_v2_L2.123c71795678-4b63-46c4-b2c6-549c45f4c806\\airplane_wings_diffuse_v1.jpg
