<?xml version="1.0" encoding="utf-8"?>
<!-- Generator: Adobe Illustrator 24.0.1, SVG Export Plug-In . SVG Version: 6.00 Build 0)  -->
<svg version="1.1" id="Capa_1" xmlns="http://www.w3.org/2000/svg" xmlns:xlink="http://www.w3.org/1999/xlink" x="0px" y="0px"
	 viewBox="0 0 356.6 356.6" style="enable-background:new 0 0 356.6 356.6;" xml:space="preserve">
<style type="text/css">
	.st0{fill:#FFFFFF;}
</style>
<g>
	<g>
		<g>
			<path class="st0" d="M350.8,25.3c-0.9-1-2.1-1.7-3.5-1.9l-77-6.6l-1.4-11.1c-0.3-2.8-3-4.9-5.8-4.5l-71.5,9
				c-0.3-0.1-0.6-0.1-0.9-0.1L92.3,1.8c-2.8-0.3-5.4,1.9-5.7,4.8l-1.5,17.2L9.1,33.2c-2.8,0.3-4.9,3-4.5,5.8l38.8,309
				c0.2,1.4-0.1,2.8,0.5,4.1c0.8,1.9,2.7,3.2,4.8,3.2h255.8c2.9,0,5.2-2.4,5.2-5.2v-6.8l10.1,0.8c2.8,0.3,5.4-1.9,5.7-4.8L352,29.1
				C352.1,27.8,351.7,26.5,350.8,25.3z M43.5,264.8L15.6,42.9l27.9-3.5V264.8z M96.7,12.6l45.6,3.9l-46.5,5.8L96.7,12.6z
				 M259.1,12.3l2.7,21.2H90.5L259.1,12.3z M315.6,333.4l-5.8-0.5V180.5c0-2.9-2.4-5.2-5.2-5.2c-2.8,0-5.2,2.4-5.2,5.2v164.4H54
				v-301h245.4v112.2c0,2.9,2.4,5.2,5.2,5.2c2.8,0,5.2-2.4,5.2-5.2V38.7c0-2.9-2.4-5.2-5.2-5.2h-32.3l-0.8-5.9l69.6,5.9L315.6,333.4
				z"/>
		</g>
	</g>
	<g>
		<g>
			<path class="st0" d="M276.7,61.3h-27.8c-1.7,0-3.4,0.9-4.4,2.4l-11.8,17.7c-12.7-9.1-28.3-14.5-45-14.5c-2.9,0-5.2,2.4-5.2,5.2
				v72.3c0,2.9,2.4,5.2,5.2,5.2H260c2.9,0,5.2-2.4,5.2-5.2c0-22.2-9.4-42.3-24.4-56.4l10.9-16.3h25c2.9,0,5.2-2.4,5.2-5.2
				S279.6,61.3,276.7,61.3z M254.7,139.2H193V77.5c12.7,1,24.3,5.5,34,12.5l-4.6,7c-1.5,2.1-1,5.2,1,6.8c2.4,2,6,1.5,7.7-1.1l4-5.9
				C246.1,107.9,253.4,122.7,254.7,139.2z"/>
		</g>
	</g>
	<g>
		<g>
			<path class="st0" d="M276.7,233.7h-47.2l-8.3-13.3c13.5-14,21.8-32.9,21.8-53.8c0-2.9-2.4-5.2-5.2-5.2h-67.1V94.4
				c0-2.9-2.4-5.2-5.2-5.2c-42.7,0-77.5,34.8-77.5,77.5s34.8,77.5,77.5,77.5c18.1,0,34.7-6.2,47.9-16.6l8.9,14.2
				c1,1.5,2.6,2.4,4.4,2.4h50.1c2.9,0,5.2-2.4,5.2-5.2S279.6,233.7,276.7,233.7z M203.3,191.7c-1.5-2.4-4.8-3.2-7.2-1.7
				s-3.2,4.8-1.7,7.2l13.4,21.4c-11.5,9.4-26.3,15.1-42.3,15.1c-37,0-67.1-30.1-67.1-67.1c0-35.2,27.3-64.2,61.9-66.9v66.9
				c0,2.9,2.4,5.2,5.2,5.2h66.9c-1.2,15.1-7.3,28.8-16.9,39.4L203.3,191.7z"/>
		</g>
	</g>
	<g>
		<g>
			<path class="st0" d="M121,261.5H76.6c-2.9,0-5.2,2.4-5.2,5.2s2.4,5.2,5.2,5.2H121c2.9,0,5.2-2.4,5.2-5.2S123.9,261.5,121,261.5z"
				/>
		</g>
	</g>
	<g>
		<g>
			<path class="st0" d="M187.8,261.5h-44.5c-2.9,0-5.2,2.4-5.2,5.2s2.4,5.2,5.2,5.2h44.5c2.9,0,5.2-2.4,5.2-5.2
				S190.6,261.5,187.8,261.5z"/>
		</g>
	</g>
	<g>
		<g>
			<path class="st0" d="M148.9,289.3H76.5c-2.9,0-5.2,2.4-5.2,5.2c0,2.8,2.4,5.2,5.2,5.2h72.3c2.9,0,5.2-2.4,5.2-5.2
				C154,291.7,151.7,289.3,148.9,289.3z"/>
		</g>
	</g>
	<g>
		<g>
			<path class="st0" d="M187.8,289.3h-16.7c-2.9,0-5.2,2.4-5.2,5.2c0,2.8,2.4,5.2,5.2,5.2h16.7c2.9,0,5.2-2.4,5.2-5.2
				C193,291.7,190.6,289.3,187.8,289.3z"/>
		</g>
	</g>
	<g>
		<g>
			<path class="st0" d="M98.8,317.1H76.5c-2.9,0-5.2,2.4-5.2,5.2c0,2.8,2.4,5.2,5.2,5.2h22.3c2.9,0,5.2-2.4,5.2-5.2
				C104,319.5,101.7,317.1,98.8,317.1z"/>
		</g>
	</g>
	<g>
		<g>
			<path class="st0" d="M187.8,317.1H121c-2.9,0-5.2,2.4-5.2,5.2c0,2.8,2.4,5.2,5.2,5.2h66.7c2.9,0,5.2-2.4,5.2-5.2
				C193,319.5,190.6,317.1,187.8,317.1z"/>
		</g>
	</g>
</g>
</svg>
