<?xml version="1.0" encoding="utf-8"?>
<!-- Generator: Adobe Illustrator 22.0.0, SVG Export Plug-In . SVG Version: 6.00 Build 0)  -->
<svg version="1.1" id="Calque_1" xmlns="http://www.w3.org/2000/svg" xmlns:xlink="http://www.w3.org/1999/xlink" x="0px" y="0px"
	 width="600px" height="940px" viewBox="0 0 600 940" style="enable-background:new 0 0 600 940;" xml:space="preserve">
<g>
	<g>
		<polygon style="fill:#F24141;" points="294.1,682.3 290.7,682.3 297.2,671.3 290.7,660.3 294.1,660.3 300.6,671.4 		"/>
		<polygon style="fill:#F24141;" points="285.5,682.3 282.1,682.3 288.6,671.3 282.1,660.3 285.5,660.3 292,671.4 		"/>
		<polygon style="fill:#F24141;" points="302.7,682.3 299.3,682.3 305.8,671.3 299.3,660.3 302.7,660.3 309.2,671.4 		"/>
		<polygon style="fill:#F24141;" points="311.3,682.3 307.9,682.3 314.4,671.3 307.9,660.3 311.3,660.3 317.8,671.4 		"/>
		<polygon style="fill:#F24141;" points="319.9,682.3 316.5,682.3 323,671.3 316.5,660.3 319.9,660.3 326.4,671.4 		"/>
		<polygon style="fill:#F24141;" points="328.6,682 325.2,682 331.7,671 325.2,660 328.6,660 335.1,671.1 		"/>
		<polygon style="fill:#F24141;" points="337.2,682.5 333.8,682.5 340.3,671.6 333.8,660.6 337.2,660.6 343.7,671.6 		"/>
		<polygon style="fill:#F24141;" points="345.8,682.5 342.4,682.5 348.9,671.6 342.4,660.6 345.8,660.6 352.3,671.6 		"/>
		<polygon style="fill:#F24141;" points="354.4,682.5 351,682.5 357.5,671.6 351,660.6 354.4,660.6 360.9,671.6 		"/>
		<polygon style="fill:#F24141;" points="363,682.5 359.6,682.5 366.1,671.6 359.6,660.6 363,660.6 369.5,671.6 		"/>
		<polygon style="fill:#F24141;" points="371.7,682.2 368.2,682.2 374.7,671.3 368.2,660.3 371.7,660.3 378.2,671.3 		"/>
	</g>
	<g>
		<polygon style="fill:#F24141;" points="241.5,682.5 238.1,682.5 244.6,671.6 238.1,660.6 241.5,660.6 248,671.6 		"/>
		<polygon style="fill:#F24141;" points="250.1,682.5 246.7,682.5 253.2,671.6 246.7,660.6 250.1,660.6 256.6,671.6 		"/>
		<polygon style="fill:#F24141;" points="258.8,682.5 255.3,682.5 261.8,671.6 255.3,660.6 258.8,660.6 265.3,671.6 		"/>
		<polygon style="fill:#F24141;" points="267.4,682.5 264,682.5 270.5,671.6 264,660.6 267.4,660.6 273.9,671.6 		"/>
		<polygon style="fill:#F24141;" points="276,682.2 272.6,682.2 279.1,671.3 272.6,660.3 276,660.3 282.5,671.3 		"/>
	</g>
</g>
<g>
	<g>
		<polygon style="fill:#F24141;" points="305.1,114.7 301.7,114.7 308.2,103.7 301.7,92.8 305.1,92.8 311.6,103.8 		"/>
		<polygon style="fill:#F24141;" points="296.5,114.7 293.1,114.7 299.6,103.7 293.1,92.8 296.5,92.8 303,103.8 		"/>
		<polygon style="fill:#F24141;" points="313.7,114.7 310.3,114.7 316.8,103.7 310.3,92.8 313.7,92.8 320.2,103.8 		"/>
		<polygon style="fill:#F24141;" points="322.3,114.7 318.9,114.7 325.4,103.7 318.9,92.8 322.3,92.8 328.8,103.8 		"/>
		<polygon style="fill:#F24141;" points="330.9,114.7 327.5,114.7 334,103.7 327.5,92.8 330.9,92.8 337.4,103.8 		"/>
		<polygon style="fill:#F24141;" points="339.6,114.4 336.2,114.4 342.7,103.4 336.2,92.5 339.6,92.5 346.1,103.5 		"/>
		<polygon style="fill:#F24141;" points="348.2,115 344.8,115 351.3,104 344.8,93 348.2,93 354.7,104.1 		"/>
		<polygon style="fill:#F24141;" points="356.8,115 353.4,115 359.9,104 353.4,93 356.8,93 363.3,104.1 		"/>
		<polygon style="fill:#F24141;" points="365.4,115 362,115 368.5,104 362,93 365.4,93 371.9,104.1 		"/>
		<polygon style="fill:#F24141;" points="374,115 370.6,115 377.1,104 370.6,93 374,93 380.5,104.1 		"/>
		<polygon style="fill:#F24141;" points="382.7,114.7 379.2,114.7 385.7,103.7 379.2,92.7 382.7,92.7 389.2,103.8 		"/>
	</g>
	<g>
		<polygon style="fill:#F24141;" points="252.5,115 249.1,115 255.6,104 249.1,93 252.5,93 259,104.1 		"/>
		<polygon style="fill:#F24141;" points="261.1,115 257.7,115 264.2,104 257.7,93 261.1,93 267.6,104.1 		"/>
		<polygon style="fill:#F24141;" points="269.8,115 266.3,115 272.8,104 266.3,93 269.8,93 276.3,104.1 		"/>
		<polygon style="fill:#F24141;" points="278.4,115 275,115 281.5,104 275,93 278.4,93 284.9,104.1 		"/>
		<polygon style="fill:#F24141;" points="287,114.7 283.6,114.7 290.1,103.7 283.6,92.7 287,92.7 293.5,103.8 		"/>
	</g>
</g>
<g>
	<polygon style="fill:#F24141;" points="232.5,408.7 236,408.7 229.5,419.6 236,430.6 232.5,430.6 226,419.5 	"/>
	<polygon style="fill:#F24141;" points="223.8,409 227.2,409 220.7,419.9 227.2,430.9 223.8,430.9 217.3,419.9 	"/>
	<polygon style="fill:#F24141;" points="215.1,408.4 218.5,408.4 212,419.4 218.5,430.3 215.1,430.3 208.6,419.3 	"/>
	<polygon style="fill:#F24141;" points="206.4,408.4 209.8,408.4 203.3,419.4 209.8,430.3 206.4,430.3 199.9,419.3 	"/>
	<polygon style="fill:#F24141;" points="197.7,408.4 201.1,408.4 194.6,419.4 201.1,430.3 197.7,430.3 191.2,419.3 	"/>
	<polygon style="fill:#F24141;" points="189,408.4 192.4,408.4 185.9,419.4 192.4,430.3 189,430.3 182.5,419.3 	"/>
	<polygon style="fill:#F24141;" points="180.3,408.7 183.7,408.7 177.2,419.7 183.7,430.6 180.3,430.6 173.8,419.6 	"/>
	<polygon style="fill:#F24141;" points="171.5,407.9 175,407.9 168.5,418.9 175,429.9 171.5,429.9 165,418.8 	"/>
</g>
<g>
	<polygon style="fill:#F24141;" points="128.5,478.3 128.5,474.9 139.5,481.4 150.4,474.9 150.4,478.3 139.4,484.8 	"/>
	<polygon style="fill:#F24141;" points="128.5,469.6 128.5,466.2 139.5,472.7 150.4,466.2 150.4,469.6 139.4,476.1 	"/>
	<polygon style="fill:#F24141;" points="128.5,487 128.5,483.6 139.5,490.1 150.4,483.6 150.4,487 139.4,493.5 	"/>
	<polygon style="fill:#F24141;" points="128.5,495.7 128.5,492.3 139.5,498.8 150.4,492.3 150.4,495.7 139.4,502.2 	"/>
	<polygon style="fill:#F24141;" points="128.5,504.5 128.5,501 139.5,507.5 150.4,501 150.4,504.5 139.4,511 	"/>
	<polygon style="fill:#F24141;" points="128.8,513.2 128.8,509.8 139.8,516.3 150.8,509.8 150.8,513.2 139.7,519.7 	"/>
	<polygon style="fill:#F24141;" points="128.2,521.9 128.2,518.5 139.2,525 150.2,518.5 150.2,521.9 139.1,528.4 	"/>
	<polygon style="fill:#F24141;" points="128.2,530.6 128.2,527.2 139.2,533.7 150.2,527.2 150.2,530.6 139.1,537.1 	"/>
	<polygon style="fill:#F24141;" points="128.2,539.3 128.2,535.9 139.2,542.4 150.2,535.9 150.2,539.3 139.1,545.8 	"/>
	<polygon style="fill:#F24141;" points="128.2,548 128.2,544.6 139.2,551.1 150.2,544.6 150.2,548 139.1,554.5 	"/>
	<polygon style="fill:#F24141;" points="128.5,556.7 128.5,553.3 139.5,559.8 150.5,553.3 150.5,556.7 139.4,563.2 	"/>
	<polygon style="fill:#F24141;" points="127.8,565.5 127.8,562 138.8,568.5 149.7,562 149.7,565.5 138.7,572 	"/>
</g>
<polygon style="fill:#F24141;" points="141.7,421.1 143.9,418.5 148.1,430.6 160.7,432.7 158.5,435.3 145.9,433.1 "/>
<polygon style="fill:#F24141;" points="134.2,434.2 135.5,431 143.3,441.1 155.9,439 154.7,442.2 142,444.2 "/>
<polygon style="fill:#F24141;" points="130,447.1 130.4,443.7 140.4,451.7 152.2,446.7 151.7,450.1 139.9,455 "/>
<polygon style="fill:#F24141;" points="128.5,458.9 128.5,455.5 139.5,462 150.4,455.5 150.4,459 139.4,465.4 "/>
<polygon style="fill:#F24141;" points="154,411.1 157.1,409.6 156,422.3 166.6,429.4 163.5,430.9 152.9,423.7 "/>
<g>
	<polygon style="fill:#F24141;" points="510.4,314.7 510.4,311.3 499.4,317.8 488.4,311.3 488.4,314.7 499.5,321.2 	"/>
	<polygon style="fill:#F24141;" points="510.4,323.4 510.4,320 499.4,326.5 488.4,320 488.4,323.4 499.5,329.9 	"/>
	<polygon style="fill:#F24141;" points="510,332.1 510,328.7 499.1,335.2 488.1,328.7 488.1,332.1 499.2,338.6 	"/>
	<polygon style="fill:#F24141;" points="510.6,340.9 510.6,337.4 499.7,343.9 488.7,337.4 488.7,340.9 499.7,347.4 	"/>
	<polygon style="fill:#F24141;" points="510.6,349.6 510.6,346.2 499.7,352.7 488.7,346.2 488.7,349.6 499.7,356.1 	"/>
	<polygon style="fill:#F24141;" points="510.6,358.3 510.6,354.9 499.7,361.4 488.7,354.9 488.7,358.3 499.7,364.8 	"/>
	<polygon style="fill:#F24141;" points="510.6,367 510.6,363.6 499.7,370.1 488.7,363.6 488.7,367 499.7,373.5 	"/>
	<polygon style="fill:#F24141;" points="510.3,375.7 510.3,372.3 499.3,378.8 488.4,372.3 488.4,375.7 499.4,382.2 	"/>
	<polygon style="fill:#F24141;" points="511.1,384.4 511.1,381 500.1,387.5 489.1,381 489.1,384.4 500.2,390.9 	"/>
</g>
<g>
	<polygon style="fill:#F24141;" points="440.7,427.5 444.1,427.5 437.6,416.5 444.1,405.5 440.7,405.5 434.2,416.6 	"/>
	<polygon style="fill:#F24141;" points="449.4,427.5 452.8,427.5 446.3,416.5 452.8,405.5 449.4,405.5 442.9,416.6 	"/>
	<polygon style="fill:#F24141;" points="432,427.5 435.4,427.5 428.9,416.5 435.4,405.5 432,405.5 425.5,416.6 	"/>
	<polygon style="fill:#F24141;" points="423.3,427.5 426.7,427.5 420.2,416.5 426.7,405.5 423.3,405.5 416.8,416.6 	"/>
	<polygon style="fill:#F24141;" points="414.6,427.5 418,427.5 411.5,416.5 418,405.5 414.6,405.5 408.1,416.6 	"/>
	<polygon style="fill:#F24141;" points="405.8,427.2 409.3,427.2 402.8,416.2 409.3,405.2 405.8,405.2 399.3,416.3 	"/>
	<polygon style="fill:#F24141;" points="397.1,427.7 400.5,427.7 394,416.8 400.5,405.8 397.1,405.8 390.6,416.8 	"/>
</g>
<polygon style="fill:#F24141;" points="497.9,414.2 500.5,412 488.4,407.8 486.3,395.3 483.7,397.5 485.9,410.1 "/>
<polygon style="fill:#F24141;" points="484.8,421.8 488,420.5 477.9,412.7 480,400.1 476.8,401.3 474.8,414 "/>
<polygon style="fill:#F24141;" points="471.9,426 475.3,425.5 467.4,415.6 472.3,403.8 468.9,404.3 464,416.1 "/>
<polygon style="fill:#F24141;" points="460.1,427.5 463.5,427.5 457,416.5 463.5,405.5 460.1,405.5 453.6,416.6 "/>
<polygon style="fill:#F24141;" points="507.9,402 509.4,398.9 496.7,400 489.6,389.4 488.2,392.5 495.3,403.1 "/>
<g>
	<path style="fill:#BFBFBF;" d="M161.4,174.9c-24.3,0-48.6-0.1-72.9,0.1c-3.2,0-4.2-0.9-4-4.1c0.4-8.3,0.4-16.7,0.7-25
		c0.2-5,2.2-9,7-11.1c6.5-2.8,13-5.6,19.5-8.3c5.9-2.4,12-4.3,17.7-7.1c3.9-1.9,7.8-4.5,7.2-10c-0.1-0.7,0.1-1.6,0.4-2.2
		c3.7-6.6,3.2-11.7-2-17.2c-0.4-0.5-1-1-1.1-1.6c-0.2-5.5-5.3-8.1-7.2-12.5c-1.2-3-1.7-6.5-1.7-9.7c0-5.5,0.2-11.1,1.3-16.4
		c1.3-6.7,3.3-13.3,5.8-19.7c1.1-2.8,3.9-5.1,6.5-7c1.5-1.1,4-1.2,6-1.4c4.9-0.5,9.9-0.6,14.8-1.3c7.9-1.1,15-0.2,21.7,4.8
		c4,2.9,8,5.5,10.3,9.9c1,1.9,1.4,4.3,1.8,6.5c1.1,7.3,2.3,14.7,2.9,22.1c0.3,3.5,0,7.2-1.1,10.5c-1.8,5.6-4.3,10.9-6.8,16.3
		c-0.7,1.5-2,2.8-3.2,4.1c-2.9,3.5-3,7.8-0.4,11.5c0.7,0.9,1.3,2.2,1.2,3.3c-0.5,7.4,5.1,9.4,10.2,11.5c9.5,3.9,19.2,7.1,28.6,11.2
		c4.6,2,9.9,3.9,11.4,9.6c0.6,2.4,1.2,4.8,1.3,7.2c0.4,7.5,0.4,14.9,0.8,22.4c0.1,2.8-0.8,3.7-3.7,3.7
		C210.2,174.8,185.8,174.9,161.4,174.9z"/>
	<g>
		
			<text transform="matrix(1 0 0 1 37.6182 209.2231)" style="fill:#FF3334; font-family:'Raleway-Black'; font-size:18.85px; letter-spacing:1;">AHMED BOUCHAMAOUI</text>
	</g>
	<rect x="54.9" y="223.4" style="fill:none;" width="212.9" height="127.5"/>
	<text transform="matrix(1 0 0 1 82.2906 234.3228)"><tspan x="0" y="0" style="fill:#808080; font-family:'Raleway-Medium'; font-size:14.95px;">HEIR OF THE AL MAJD </tspan><tspan x="-15.3" y="17.9" style="fill:#808080; font-family:'Raleway-Medium'; font-size:14.95px;">GROUP, FOUNDED BY FEU </tspan><tspan x="-25.8" y="35.9" style="fill:#808080; font-family:'Raleway-Medium'; font-size:14.95px;">ABDELMEJID BOUCHAMAOUI </tspan><tspan x="39.4" y="53.8" style="fill:#F24141; font-family:'Raleway-Medium'; font-size:14.95px; letter-spacing:1;">(TUNISIA)</tspan></text>
</g>
<g>
	<g>
		<path style="fill:#BFBFBF;" d="M507,97.5c-2.1,10-5.7,19.2-15.1,24.7c-16,9.4-37,1.4-43-16.3c-0.6-1.8-0.9-3.8-1.7-5.6
			c-1-2.3-2-4.7-3.6-6.6c-4.3-5.4-5.6-11.6-5.9-18.1c-0.1-3.2,2.4-4,5.1-4.7c-0.5-1.4-0.8-2.5-1.2-3.7c-3.2-9.1,0-17.1,4.6-24.6
			c5.3-8.7,13-14.9,22.6-18.3c12-4.2,26.5-0.6,34.6,9.8c0.5,0.6,0.9,1.4,1.5,1.6c7.3,2.6,9.9,8.7,11.2,15.4
			c1.3,7.2-0.2,14.4-1.9,21.5c3.7,3.9,3.9,10.5,0.5,16.4c-1,1.7-1.6,3.6-2.7,5.1c-1.1,1.5-2.8,2.5-4.2,3.8
			C507.5,97.7,507.3,97.6,507,97.5z"/>
		<path style="fill:#BFBFBF;" d="M451.6,123c5.2,16.9,10.3,33.3,15.4,49.8c0.4,0,0.7,0,1.1,0c2-5.7,4-11.5,5.9-17.3
			c0.2-0.8-0.7-1.9-1.1-2.9c-1.5-3.9-3.1-7.7-4.5-11.6c-0.2-0.6,0-1.5,0.2-2.2c1.2-3.9,7.4-6.1,13.2-4.6c4.9,1.3,6.9,4.1,5.7,8.8
			c-0.8,2.9-1.8,5.9-3.4,8.3c-1.9,2.8-2.1,5.1-0.8,8.1c1.9,4.3,3.3,8.8,4.8,13.3c0.3,0,0.6,0,1,0.1c5.1-16.5,10.3-33,15.4-49.4
			c6.4,3.1,12.4,6.3,18.7,9c4.5,2,9.2,3.7,14,4.9c9.4,2.3,13.3,9.2,14.4,17.6c0.9,6.7,0.3,13.6,0.1,20.4c0,0.8-1.4,1.7-2.3,2.2
			c-0.6,0.3-1.5,0.1-2.2,0.1c-46,0-92,0-138,0c-4.9,0-5.3-0.2-5.1-5.2c0.3-6.8,0.2-13.7,1.4-20.3c1.3-7.2,5.4-12.6,13.1-14.5
			c11.2-2.8,21.5-7.8,31.5-13.6C450.3,123.7,450.8,123.5,451.6,123z"/>
	</g>
	<g>
		
			<text transform="matrix(1 0 0 1 397.0776 211.2797)" style="fill:#FF3334; font-family:'Raleway-Black'; font-size:18.85px; letter-spacing:1;">INTERMEDIARY</text>
	</g>
	<rect x="390.4" y="225.5" style="fill:none;" width="175.2" height="78.1"/>
	<text transform="matrix(1 0 0 1 390.8901 236.3793)"><tspan x="0" y="0" style="fill:#808080; font-family:'Raleway-Medium'; font-size:14.95px;">INDOSUEZ S.A. FIDUCIA</tspan><tspan x="167.8" y="0" style="fill:#808080; font-family:'Raleway-Medium'; font-size:14.95px;">-</tspan><tspan x="17.5" y="17.9" style="fill:#808080; font-family:'Raleway-Medium'; font-size:14.95px;">RY (SUBSIDIARY OF </tspan><tspan x="19.8" y="35.9" style="fill:#808080; font-family:'Raleway-Medium'; font-size:14.95px;">CRÉDIT AGRICOLE)  </tspan><tspan x="20.2" y="53.8" style="fill:#F24141; font-family:'Raleway-Medium'; font-size:14.95px; letter-spacing:1;">(SWITZERLAND) </tspan></text>
</g>
<g>
	<g>
		<g>
			<path style="fill:#BFBFBF;" d="M349.9,332.2c3.3,0,6.1,0.1,8.9,0c2.7-0.2,3.7,0.9,3.5,3.6c-0.1,1.5,0,3,0,4.9
				c3.5,0,6.6,0.1,9.7,0c1.9,0,2.9,0.7,2.7,2.7c0,0.6,0,1.3,0,2c0,49.3,0,98.5,0,147.8c0,4.6,0,4.6-4.7,4.6c-36.9,0-73.8,0-110.7,0
				c-4.5,0-4.5,0-4.5-4.4c0-49.4,0-98.7,0-148.1c0-4.4,0-4.4,4.5-4.4c0.4,0,0.9,0,1.3,0c2.1-0.1,4.8,0.5,6.3-0.6
				c1.1-0.8,0.5-3.8,1-5.7c0.2-0.8,1.3-1.9,2.2-2c2.5-0.3,5-0.2,7.5-0.1c1.9,0.1,2.7-0.5,2.7-2.6c0.3-7.2,0.3-7.2,7.5-7.2
				c19.3,0,38.6,0.1,57.9-0.1c3.2,0,4.7,0.7,4.2,4.1C349.7,328.2,349.9,330,349.9,332.2z M328.3,459.3c-8.7,0-17.2,0-25.6,0.1
				c-0.6,0-1.5,1.6-1.5,2.5c-0.1,9.7,0,19.5-0.1,29.2c0,2.2,0.9,2.7,2.9,2.7c5.5-0.1,11,0,16.6,0c2.5,0,5.1,0,7.8,0
				C328.3,482.1,328.3,470.9,328.3,459.3z M354.2,364.8c-0.3-0.3-0.7-0.7-1-1c-2.5,0.5-5.6,0.2-7.2,1.7c-1.1,1-0.7,5,0.5,6.4
				c1,1.1,5.4,1.3,6.1,0.3C354,370.3,353.7,367.3,354.2,364.8z M306.8,405.8c-4.4,0-4.4,0-4.4,4.1c0,4.3,0,4.1,4.3,4.4
				c3.2,0.2,4.5-0.7,4.2-4.1C310.6,405.8,310.8,405.8,306.8,405.8z M329.1,364.1c0,1.8,0.2,3.1,0,4.4c-0.5,3.4,1,4.3,4.2,4.1
				c4.2-0.2,4.1-0.1,4.3-4.4c0.2-3.3-0.9-4.6-4.2-4.1C332.1,364.3,330.9,364.1,329.1,364.1z M310.8,367.5c0.9-3.3-1.3-3.5-4.2-3.4
				c-4.3,0.2-4.3,0-4.2,4.3c0,4.2,0.1,4.2,4.4,4.2C310.8,372.6,310.8,372.6,310.8,367.5z M284.5,364.7c-0.3-0.3-0.7-0.7-1-1
				c-2.5,0.5-5.5,0.3-7.3,1.8c-1,0.8-0.8,5.2,0.4,6.2c1.4,1.2,5.6,1.5,6.4,0.5C284.4,370.4,284,367.3,284.5,364.7z M266.4,363.8
				c-0.3,0.4-0.6,0.7-0.9,1.1c0.5,2.5,0.3,5.5,1.7,7.3c0.8,1,5.2,0.8,6.1-0.4c1.2-1.4,1.5-5.5,0.4-6.5
				C272.1,363.9,268.9,364.2,266.4,363.8z M284,410.3c0.6-3,0.2-4.8-3.6-4.6c-4.6,0.3-4.6,0.1-4.7,4.1c0,4.3,0.1,4.3,4.2,4.5
				C283.1,414.5,284.9,413.8,284,410.3z M355.8,364.2c0,2.4-0.3,4.5,0.1,6.4c0.7,3.7,3.8,1.5,5.9,1.8c0.7,0.1,2-1.3,2.3-2.3
				c0.4-1.2,0.4-2.6,0-3.8c-0.3-0.9-1.3-1.9-2.1-2.1C360,363.9,358.1,364.2,355.8,364.2z M265.9,410.5c-0.6,2.7,0.5,4,3.9,3.8
				c4.2-0.3,4.4-0.2,4.4-4.3c0-4-0.1-4.2-4.1-4.2C265.9,405.8,265.9,405.8,265.9,410.5z M265.4,381.6c0.3,0.4,0.7,0.7,1,1.1
				c2.5-0.4,5.5-0.2,7.3-1.5c1-0.7,0.8-4.9-0.3-6.1c-1.1-1.2-5.2-1.5-6.1-0.5C265.9,376.2,266,379.2,265.4,381.6z M283.4,382.8
				c0.4-0.3,0.7-0.7,1.1-1c-0.5-2.5-0.3-5.5-1.7-7.2c-0.8-1-4.9-0.8-6.2,0.4c-1.2,1.1-1.5,5.3-0.5,6.1
				C277.9,382.4,280.9,382.3,283.4,382.8z M306.4,382.3c2.9,0.6,4.8,0.2,4.5-3.6c-0.3-4.5-0.1-4.6-4.1-4.6c-4.2,0-4.3,0.2-4.5,4.2
				C302.1,381.5,303,383.1,306.4,382.3z M328.6,381.6c0.3,0.3,0.7,0.7,1,1c2.6-0.3,5.6,0.1,7.5-1.2c1-0.7,0.8-5-0.4-6.4
				c-0.9-1.2-5.2-1.4-6.1-0.4C329.1,376.1,329.1,379.2,328.6,381.6z M354.3,382.8c-0.6-3.5-0.4-6.5-1.7-8.3c-0.8-1-5.1-0.9-6.1,0.3
				c-1.2,1.4-1.5,5.5-0.5,6.4C347.7,382.6,350.8,382.3,354.3,382.8z M355.3,382.8c3.5-0.6,6.5-0.3,8.4-1.6c1-0.7,0.9-5.1-0.2-6.1
				c-1.4-1.2-5.5-1.5-6.4-0.5C355.6,376.2,355.9,379.4,355.3,382.8z M355.4,435.1c0.3,0.3,0.6,0.7,1,1c2.5-0.4,5.6-0.1,7.3-1.6
				c1.1-0.9,0.8-5-0.4-6.4c-1-1.2-5.3-1.4-6.1-0.3C355.7,429.6,355.8,432.6,355.4,435.1z M265.9,459.2c0,2.4-0.3,4.5,0.1,6.4
				c0.7,3.7,3.8,1.5,5.8,1.8c0.7,0.1,2-1.3,2.3-2.3c0.4-1.3,0.3-2.8,0-4.1c-0.2-0.7-1.1-1.7-1.8-1.7
				C270.3,459.1,268.3,459.2,265.9,459.2z M284.1,459.2c-2.4,0-4.3-0.1-6.1,0.1c-0.8,0.1-1.9,0.7-2.1,1.4c-1.7,4.8,0.1,7,5.1,7
				c2.4,0,3.3-0.8,3.1-3.2C284,462.9,284.1,461.3,284.1,459.2z M353.2,436.2c0.3-0.3,0.7-0.7,1-1c-0.4-2.5-0.2-5.5-1.6-7.3
				c-0.8-1-5.1-0.9-6.1,0.3c-1.2,1.4-1.5,5.5-0.5,6.4C347.6,435.9,350.7,435.7,353.2,436.2z M353.8,459.4c-1.4-0.1-2.3-0.1-3.1-0.1
				c-5.3-0.1-5.6,0.4-5.2,5.7c0.1,1.8,0.8,2.8,2.7,2.7c1.2-0.1,2.4,0.2,3.5-0.1c0.8-0.2,1.9-1.1,2-1.8
				C354,463.7,353.8,461.7,353.8,459.4z M356.5,458.7c-0.3,0.3-0.7,0.6-1,1c0.4,2.5,0,5.7,1.3,7.4c0.8,1,5,0.8,6.5-0.4
				c1.2-1,1.4-5.3,0.4-6.1C362,459.2,359,459.3,356.5,458.7z M328.5,436.3c3.7-0.6,6.8-0.3,8.5-1.7c1.1-0.9,0.8-5.2-0.4-6.4
				c-1.2-1.2-5.5-1.4-6.4-0.3C328.8,429.5,329.1,432.7,328.5,436.3z M310.8,431.8c0-4.4,0-4.4-4.1-4.4c-4.2,0-4.1,0.1-4.4,4.3
				c-0.2,3.2,0.8,4.4,4.1,4.2C310.8,435.6,310.8,435.8,310.8,431.8z M265.4,477.9c3.5-0.6,6.5-0.3,8.3-1.7c1-0.7,0.9-5.1-0.3-6.1
				c-1.4-1.2-5.5-1.5-6.4-0.5C265.7,471.3,266,474.4,265.4,477.9z M283.5,477.8c0.4-0.4,0.7-0.7,1.1-1.1c-0.5-2.5-0.4-5.5-1.8-7.2
				c-0.8-1-5-0.7-6.2,0.4c-1.2,1.2-1.4,5.4-0.4,6.1C278,477.5,281,477.4,283.5,477.8z M353.1,477.9c0.4-0.3,0.7-0.7,1.1-1
				c-0.5-2.5-0.3-5.5-1.7-7.2c-0.8-1-4.9-0.7-6.1,0.4c-1.2,1.2-1.4,5.3-0.5,6.1C347.7,477.5,350.7,477.4,353.1,477.9z M355.3,477.9
				c3.5-0.6,6.5-0.3,8.4-1.6c1-0.7,0.9-5.1-0.3-6.1c-1.4-1.2-5.5-1.5-6.4-0.5C355.6,471.3,355.9,474.4,355.3,477.9z M283.5,436.1
				c0.3-0.3,0.7-0.7,1-1c-0.5-2.5-0.3-5.5-1.7-7.3c-0.8-1-5.1-0.8-6.1,0.3c-1.2,1.4-1.5,5.5-0.5,6.4
				C277.9,436,281,435.7,283.5,436.1z M265.5,435.1c0.3,0.3,0.7,0.7,1,1c2.5-0.5,5.5-0.3,7.3-1.7c1-0.8,0.8-5.1-0.3-6.1
				c-1.4-1.2-5.5-1.5-6.4-0.5C265.7,429.5,266,432.6,265.5,435.1z M332.8,405.8c-2.6-0.6-4,0.3-3.8,3.9c0.3,4.5,0.1,4.5,4,4.6
				c4.5,0,4.5,0,4.5-4.1C337.5,405.8,337.5,405.8,332.8,405.8z M350,405.8c-4.4,0-4.5,0.1-4.5,4.1c0,4.1,0.2,4.2,4,4.4
				c2.9,0.1,4.7-0.2,4.4-3.9C353.5,405.9,353.8,405.8,350,405.8z M355.8,409.3c0,5,0,5,4,5c4.2,0,4.4-0.1,4.4-4
				c0-4.4-0.1-4.3-4.2-4.5C357,405.7,354.9,406,355.8,409.3z M266.1,395.6c0,3.2,0,5.5,0,8.4c2.7-0.3,5.6,0.1,7.5-1.1
				c1-0.6,1.1-5.2,0.1-5.8C271.9,395.9,269,396.1,266.1,395.6z M326.9,409.8c1.1-3.3-0.5-4-3.7-4.1c-3.6-0.2-4,1.3-4,4.3
				c0,3,0.4,4.5,4,4.4C326.7,414.3,327.7,413.2,326.9,409.8z M300.9,364.4c-3.2,0-5.6,0-8.5,0c0.4,2.8,0.1,5.6,1.3,7.8
				c0.4,0.8,5,0.9,5.6,0.1C300.4,370.2,300.3,367.3,300.9,364.4z M319,364.4c0.4,2.8,0.1,5.7,1.3,7.8c0.5,0.9,5.3,0.9,5.8-0.1
				c1.2-2.1,0.8-5,1.1-7.7C324.3,364.4,322,364.4,319,364.4z M284,395.6c-3,0.6-5.8,0.5-7.8,1.8c-0.9,0.5-0.7,5.1,0.1,5.6
				c2.2,1.1,5,0.9,7.7,1.2C284,401.1,284,398.8,284,395.6z M300.7,435.6c-0.4-2.8-0.1-5.7-1.3-7.7c-0.5-0.9-5.3-0.9-5.8,0.1
				c-1.2,2.1-0.9,4.9-1.2,7.7C295.4,435.6,297.7,435.6,300.7,435.6z M266.1,446c3-0.5,5.8-0.4,7.7-1.6c0.9-0.6,0.9-5.1,0-5.6
				c-2.1-1.2-4.9-1-7.7-1.4C266.1,440.5,266.1,442.8,266.1,446z M283.9,437.3c-2.9,0.4-5.7,0.3-7.7,1.5c-0.9,0.6-0.9,5.1,0,5.6
				c2.1,1.2,4.9,1.1,7.7,1.5C283.9,442.8,283.9,440.5,283.9,437.3z M356,445.9c2.9-0.5,5.7-0.3,7.7-1.5c0.9-0.6,0.9-5.1,0-5.6
				c-2.1-1.2-4.9-1.1-7.7-1.5C356,440.5,356,442.8,356,445.9z M353.6,437.3c-2.9,0.4-5.8,0.2-7.6,1.5c-0.9,0.6-0.9,5.2,0.1,5.8
				c1.9,1.2,4.8,0.8,7.5,1.1C353.6,442.8,353.6,440.5,353.6,437.3z M329.3,446c3-0.5,5.9-0.4,7.9-1.7c0.9-0.5,0.8-5.2,0-5.6
				c-2.2-1.1-5-0.9-7.8-1.2C329.3,440.5,329.3,442.8,329.3,446z M306.5,437.9c-3.2-1-4.1,0.5-4.2,3.7c-0.2,3.6,1.4,4,4.4,4
				c3,0,4.4-0.4,4.3-4C310.9,438.2,309.8,437.1,306.5,437.9z M306.9,403.7c3.3,1.1,3.9-0.5,4.1-3.7c0.2-3.6-1.3-4-4.3-4
				c-3,0-4.5,0.4-4.4,4C302.3,403.4,303.5,404.4,306.9,403.7z M353.5,404.3c0-3.3,0-5.6,0-8.6c-2.8,0.5-5.6,0.3-7.5,1.5
				c-0.9,0.6-0.9,5,0,5.6C347.9,404,350.7,403.8,353.5,404.3z M356,404.2c2.8-0.4,5.6-0.3,7.7-1.5c0.9-0.5,0.8-5.1,0-5.6
				c-2.1-1.2-4.9-1-7.7-1.4C356,398.8,356,401.1,356,404.2z M327.4,435.6c-0.4-2.8-0.3-5.7-1.4-7.8c-0.5-0.9-5.1-0.9-5.6,0
				c-1.2,2.1-1,5-1.4,7.8C322.1,435.6,324.4,435.6,327.4,435.6z M300.9,382.2c-0.6-3-0.6-5.8-1.9-7.7c-0.6-0.9-5.1-0.7-5.5,0.2
				c-1.1,2.1-0.8,4.9-1.1,7.6C295.4,382.2,297.7,382.2,300.9,382.2z M327.5,382.2c-0.5-2.8-0.3-5.6-1.5-7.6c-0.5-0.9-5.1-0.8-5.5,0
				c-1.2,2.1-1,4.9-1.4,7.6C322.1,382.2,324.4,382.2,327.5,382.2z M300.3,410c0.7-3.2-0.4-4.2-3.8-4.3c-3.6-0.1-4,1.4-4,4.4
				c0,3,0.4,4.4,4,4.4C300,414.3,301,413.1,300.3,410z M329.3,403.9c1.8,0,3.2-0.2,4.5,0c3.2,0.5,3.8-1.1,3.7-3.9
				c0-2.7-0.4-4.2-3.7-4c-4.9,0.3-4.9,0-4.8,4.9C329.1,401.7,329.2,402.6,329.3,403.9z M300.2,445.4c0-2.6,0-4.9,0-7.4
				c-2.6,0-5,0-7.3,0c0,2.6,0,4.9,0,7.4C295.3,445.4,297.6,445.4,300.2,445.4z M319.5,445.2c2.7,0,5,0,7.4,0c0-2.6,0-4.9,0-7.3
				c-2.6,0-4.9,0-7.4,0C319.5,440.5,319.5,442.7,319.5,445.2z M319.5,403.6c2.7,0,5,0,7.4,0c0-2.6,0-4.9,0-7.2c-2.6,0-4.9,0-7.4,0
				C319.5,398.8,319.5,401,319.5,403.6z M300.2,396.4c-2.7,0-5.1,0-7.4,0c0,2.6,0,4.9,0,7.2c2.6,0,4.9,0,7.4,0
				C300.2,401.1,300.2,398.9,300.2,396.4z M314,341c-3.1-0.3-5.2-1.1-6.1,2.2c-0.4,1.4-1.5,2.6-2.3,3.8c-1,1.4-2,2.8-3,4.1
				c0.1,0.1,0.3,0.1,0.4,0.2C306.4,348.1,309.9,344.8,314,341z M326.4,329c-0.2-0.2-0.4-0.4-0.6-0.6c-3.4,3.3-6.8,6.6-10.2,10
				c0.2,0.4,0.4,0.8,0.7,1.2c1.4-0.3,3.5-0.2,4.1-1.1C322.7,335.5,324.4,332.2,326.4,329z M305.3,330c2.6,2.7,5.5,5.6,8.8,9
				c-0.4-1.8-0.2-3.8-1-4.4C310.6,332.7,307.7,331.3,305.3,330z M315.9,341.4c-1,3-0.5,4.8,2.4,5.9c2.2,0.9,4.2,2.5,6.3,3.8
				c0.1-0.1,0.1-0.3,0.2-0.4C321.9,347.7,319,344.7,315.9,341.4z"/>
			<rect x="260" y="358.4" style="fill:#BFBFBF;" width="110.7" height="136.7"/>
		</g>
		<g>
			<g>
				<rect x="277.8" y="364" style="fill:#FFFFFF;" width="8" height="8"/>
				<rect x="267.4" y="364" style="fill:#FFFFFF;" width="8" height="8"/>
				<rect x="267.4" y="374" style="fill:#FFFFFF;" width="8" height="8"/>
				<rect x="277.8" y="374" style="fill:#FFFFFF;" width="8" height="8"/>
			</g>
			<g>
				<rect x="328.6" y="364" style="fill:#FFFFFF;" width="8" height="8"/>
				<rect x="318.2" y="364" style="fill:#FFFFFF;" width="8" height="8"/>
				<rect x="318.2" y="374" style="fill:#FFFFFF;" width="8" height="8"/>
				<rect x="328.6" y="374" style="fill:#FFFFFF;" width="8" height="8"/>
			</g>
			<g>
				<rect x="303.2" y="364" style="fill:#FFFFFF;" width="8" height="8"/>
				<rect x="292.8" y="364" style="fill:#FFFFFF;" width="8" height="8"/>
				<rect x="292.8" y="374" style="fill:#FFFFFF;" width="8" height="8"/>
				<rect x="303.2" y="374" style="fill:#FFFFFF;" width="8" height="8"/>
			</g>
			<g>
				<rect x="354" y="364" style="fill:#FFFFFF;" width="8" height="8"/>
				<rect x="343.6" y="364" style="fill:#FFFFFF;" width="8" height="8"/>
				<rect x="343.6" y="374" style="fill:#FFFFFF;" width="8" height="8"/>
				<rect x="354" y="374" style="fill:#FFFFFF;" width="8" height="8"/>
			</g>
		</g>
		<g>
			<g>
				<rect x="277.8" y="395.9" style="fill:#FFFFFF;" width="8" height="8"/>
				<rect x="267.4" y="395.9" style="fill:#FFFFFF;" width="8" height="8"/>
				<rect x="267.4" y="405.9" style="fill:#FFFFFF;" width="8" height="8"/>
				<rect x="277.8" y="405.9" style="fill:#FFFFFF;" width="8" height="8"/>
			</g>
			<g>
				<rect x="328.6" y="395.9" style="fill:#FFFFFF;" width="8" height="8"/>
				<rect x="318.2" y="395.9" style="fill:#FFFFFF;" width="8" height="8"/>
				<rect x="318.2" y="405.9" style="fill:#FFFFFF;" width="8" height="8"/>
				<rect x="328.6" y="405.9" style="fill:#FFFFFF;" width="8" height="8"/>
			</g>
			<g>
				<rect x="303.2" y="395.9" style="fill:#FFFFFF;" width="8" height="8"/>
				<rect x="292.8" y="395.9" style="fill:#FFFFFF;" width="8" height="8"/>
				<rect x="292.8" y="405.9" style="fill:#FFFFFF;" width="8" height="8"/>
				<rect x="303.2" y="405.9" style="fill:#FFFFFF;" width="8" height="8"/>
			</g>
			<g>
				<rect x="354" y="395.9" style="fill:#FFFFFF;" width="8" height="8"/>
				<rect x="343.6" y="395.9" style="fill:#FFFFFF;" width="8" height="8"/>
				<rect x="343.6" y="405.9" style="fill:#FFFFFF;" width="8" height="8"/>
				<rect x="354" y="405.9" style="fill:#FFFFFF;" width="8" height="8"/>
			</g>
		</g>
		<g>
			<rect x="277.8" y="458.3" style="fill:#FFFFFF;" width="8" height="8"/>
			<rect x="267.4" y="458.3" style="fill:#FFFFFF;" width="8" height="8"/>
			<rect x="267.4" y="468.3" style="fill:#FFFFFF;" width="8" height="8"/>
			<rect x="277.8" y="468.3" style="fill:#FFFFFF;" width="8" height="8"/>
		</g>
		<g>
			<g>
				<rect x="277.8" y="427.7" style="fill:#FFFFFF;" width="8" height="8"/>
				<rect x="267.4" y="427.7" style="fill:#FFFFFF;" width="8" height="8"/>
				<rect x="267.4" y="437.7" style="fill:#FFFFFF;" width="8" height="8"/>
				<rect x="277.8" y="437.7" style="fill:#FFFFFF;" width="8" height="8"/>
			</g>
			<g>
				<rect x="328.6" y="427.7" style="fill:#FFFFFF;" width="8" height="8"/>
				<rect x="318.2" y="427.7" style="fill:#FFFFFF;" width="8" height="8"/>
				<rect x="318.2" y="437.7" style="fill:#FFFFFF;" width="8" height="8"/>
				<rect x="328.6" y="437.7" style="fill:#FFFFFF;" width="8" height="8"/>
			</g>
			<g>
				<rect x="303.2" y="427.7" style="fill:#FFFFFF;" width="8" height="8"/>
				<rect x="292.8" y="427.7" style="fill:#FFFFFF;" width="8" height="8"/>
				<rect x="292.8" y="437.7" style="fill:#FFFFFF;" width="8" height="8"/>
				<rect x="303.2" y="437.7" style="fill:#FFFFFF;" width="8" height="8"/>
			</g>
			<g>
				<rect x="354" y="427.7" style="fill:#FFFFFF;" width="8" height="8"/>
				<rect x="343.6" y="427.7" style="fill:#FFFFFF;" width="8" height="8"/>
				<rect x="343.6" y="437.7" style="fill:#FFFFFF;" width="8" height="8"/>
				<rect x="354" y="437.7" style="fill:#FFFFFF;" width="8" height="8"/>
			</g>
		</g>
		<g>
			<rect x="354" y="458.3" style="fill:#FFFFFF;" width="8" height="8"/>
			<rect x="343.6" y="458.3" style="fill:#FFFFFF;" width="8" height="8"/>
			<rect x="343.6" y="468.3" style="fill:#FFFFFF;" width="8" height="8"/>
			<rect x="354" y="468.3" style="fill:#FFFFFF;" width="8" height="8"/>
		</g>
		<rect x="300.5" y="458.1" style="fill:#FFFFFF;" width="28.2" height="36.4"/>
	</g>
	<g>
		
			<text transform="matrix(1 0 0 1 209.6178 525.7093)" style="fill:#FF3334; font-family:'Raleway-Black'; font-size:18.85px; letter-spacing:1;">MOSSACK FONSECA</text>
	</g>
	<rect x="216" y="539.9" style="fill:none;" width="197.4" height="75.6"/>
	<text transform="matrix(1 0 0 1 259.2208 550.8069)"><tspan x="0" y="0" style="fill:#808080; font-family:'Raleway-Medium'; font-size:14.95px;">SPECIALIZES IN</tspan><tspan x="-24.9" y="17.9" style="fill:#808080; font-family:'Raleway-Medium'; font-size:14.95px;"> CREATING OFFSHORE </tspan><tspan x="11.8" y="35.9" style="fill:#808080; font-family:'Raleway-Medium'; font-size:14.95px;">COMPANIES</tspan><tspan x="13.9" y="53.8" style="fill:#F24141; font-family:'Raleway-Medium'; font-size:14.95px; letter-spacing:1;">(PANAMA)</tspan></text>
</g>
<g>
	<g>
		
			<text transform="matrix(1 0 0 1 24.4896 779.3452)" style="fill:#FF3334; font-family:'Raleway-Black'; font-size:18.85px; letter-spacing:1;">INERSA INVESTMENTS INC  </text>
	</g>
	<rect x="36.4" y="790.5" style="fill:none;" width="254.5" height="106.7"/>
	<text transform="matrix(1 0 0 1 39.7032 801.4438)"><tspan x="0" y="0" style="fill:#808080; font-family:'Raleway-Medium'; font-size:14.95px;">BEARER SHARE. CRÉDIT AGRICOLE </tspan><tspan x="13.1" y="17.9" style="fill:#808080; font-family:'Raleway-Medium'; font-size:14.95px;">TRANSFERS MANAGEMENT TO </tspan><tspan x="-3" y="35.9" style="fill:#808080; font-family:'Raleway-Medium'; font-size:14.95px;">NEWGEST MANAGEMENT LTD. THE </tspan><tspan x="-2.3" y="53.8" style="fill:#808080; font-family:'Raleway-Medium'; font-size:14.95px;">SILENT PARTNER GETS A GENERAL </tspan><tspan x="41.3" y="71.8" style="fill:#808080; font-family:'Raleway-Medium'; font-size:14.95px;">POWER OF ATTORNEY. </tspan><tspan x="13.7" y="89.7" style="fill:#F24141; font-family:'Raleway-Medium'; font-size:14.95px; letter-spacing:1;">(BRITISH VIRGIN ISLANDS)</tspan></text>
	<g>
		<g>
			<path style="fill:#BFBFBF;" d="M176.7,608.5h-60.9c-3.9,0-7-3.2-7-7v-4.4c0-3.9,3.2-7,7-7h60.9c3.9,0,7,3.2,7,7v4.4
				C183.7,605.4,180.6,608.5,176.7,608.5z"/>
			<rect x="143.9" y="607.1" style="fill:#BFBFBF;" width="5.6" height="44.8"/>
			<rect x="100" y="629" style="fill:#BFBFBF;" width="93.2" height="4.8"/>
			<rect x="187.4" y="632.9" style="fill:#BFBFBF;" width="5.8" height="21.7"/>
			<rect x="100" y="631.4" style="fill:#BFBFBF;" width="5.8" height="21.3"/>
			<ellipse style="fill:#BFBFBF;" cx="103" cy="659.7" rx="13" ry="8.6"/>
			<ellipse style="fill:#BFBFBF;" cx="146.8" cy="659.7" rx="13" ry="8.6"/>
			<ellipse style="fill:#BFBFBF;" cx="190.5" cy="659.7" rx="13" ry="8.6"/>
		</g>
		<path style="fill:#BFBFBF;" d="M185.9,745.3h-78.9c-6.1,0-11-4.9-11-11v-47.5c0-6.1,4.9-11,11-11h78.9c6.1,0,11,4.9,11,11v47.5
			C196.8,740.4,191.9,745.3,185.9,745.3z"/>
		<rect x="102" y="682.7" style="fill:none;stroke:#FFFFFF;stroke-width:1.95;stroke-miterlimit:10;" width="88.4" height="55.9"/>
		<rect x="129.7" y="690.7" style="fill:#FFFFFF;" width="33.2" height="3.9"/>
		<rect x="112.1" y="699.4" style="fill:#FFFFFF;" width="68.2" height="3.4"/>
		<rect x="112.3" y="707.9" style="fill:#FFFFFF;" width="68.2" height="3.2"/>
		<rect x="112.1" y="716" style="fill:#FFFFFF;" width="42.2" height="3.2"/>
		<rect x="112.3" y="724.3" style="fill:#FFFFFF;" width="14.1" height="3.1"/>
		<circle style="fill:#FFFFFF;" cx="174.7" cy="724.2" r="4.6"/>
		<path style="fill:#FFFFFF;stroke:#FFFFFF;stroke-width:0.65;stroke-miterlimit:10;" d="M182.4,722.4l-1.2-0.3
			c-0.1-0.3-0.2-0.7-0.4-1l0.7-1.1c0.1-0.2,0.1-0.4-0.1-0.6l-1.9-1.9c-0.2-0.2-0.4-0.2-0.6-0.1l-1.1,0.7c-0.3-0.2-0.6-0.3-1-0.4
			l-0.3-1.2c0-0.2-0.2-0.4-0.5-0.4h-2.7c-0.2,0-0.4,0.2-0.5,0.4l-0.3,1.2c-0.3,0.1-0.7,0.2-1,0.4l-1.1-0.7c-0.2-0.1-0.4-0.1-0.6,0.1
			l-1.9,1.9c-0.2,0.2-0.2,0.4-0.1,0.6l0.7,1.1c-0.2,0.3-0.3,0.6-0.4,1l-1.2,0.3c-0.2,0-0.4,0.2-0.4,0.5v2.7c0,0.2,0.2,0.4,0.4,0.5
			l1.2,0.3c0.1,0.3,0.2,0.7,0.4,1l-0.7,1.1c-0.1,0.2-0.1,0.4,0.1,0.6l1.9,1.9c0.2,0.2,0.4,0.2,0.6,0.1l1.1-0.7
			c0.3,0.2,0.6,0.3,1,0.4l0.3,1.2c0,0.2,0.2,0.4,0.5,0.4h2.7c0.2,0,0.4-0.2,0.5-0.4l0.3-1.2c0.3-0.1,0.7-0.2,1-0.4l1.1,0.7
			c0.2,0.1,0.4,0.1,0.6-0.1l1.9-1.9c0.2-0.2,0.2-0.4,0.1-0.6l-0.7-1.1c0.2-0.3,0.3-0.6,0.4-1l1.2-0.3c0.2,0,0.4-0.2,0.4-0.5v-2.7
			C182.8,722.6,182.7,722.4,182.4,722.4z M181.9,725.2l-1.1,0.2c-0.2,0-0.3,0.2-0.4,0.3c-0.1,0.4-0.3,0.9-0.5,1.3
			c-0.1,0.2-0.1,0.3,0,0.5l0.6,1l-1.4,1.4l-1-0.6c-0.2-0.1-0.3-0.1-0.5,0c-0.4,0.2-0.8,0.4-1.3,0.5c-0.2,0-0.3,0.2-0.3,0.4l-0.2,1.1
			h-2l-0.2-1.1c0-0.2-0.2-0.3-0.3-0.4c-0.4-0.1-0.9-0.3-1.3-0.5c-0.2-0.1-0.3-0.1-0.5,0l-1,0.6l-1.4-1.4l0.6-1
			c0.1-0.2,0.1-0.3,0-0.5c-0.2-0.4-0.4-0.8-0.5-1.3c0-0.2-0.2-0.3-0.4-0.3l-1.1-0.2v-2l1.1-0.2c0.2,0,0.3-0.2,0.4-0.3
			c0.1-0.4,0.3-0.9,0.5-1.3c0.1-0.2,0.1-0.3,0-0.5l-0.6-1l1.4-1.4l1,0.6c0.2,0.1,0.3,0.1,0.5,0c0.4-0.2,0.8-0.4,1.3-0.5
			c0.2,0,0.3-0.2,0.3-0.4l0.2-1.1h2l0.2,1.1c0,0.2,0.2,0.3,0.3,0.4c0.4,0.1,0.9,0.3,1.3,0.5c0.2,0.1,0.3,0.1,0.5,0l1-0.6l1.4,1.4
			l-0.6,1c-0.1,0.2-0.1,0.3,0,0.5c0.2,0.4,0.4,0.8,0.5,1.3c0,0.2,0.2,0.3,0.4,0.3l1.1,0.2V725.2z"/>
	</g>
</g>
<g>
	<g>
		
			<text transform="matrix(1 0 0 1 397.8915 778.3845)" style="fill:#FF3334; font-family:'Raleway-Black'; font-size:18.85px; letter-spacing:1;">BANK ACCOUNT</text>
	</g>
	<rect x="395.4" y="792.6" style="fill:none;" width="175.2" height="75.6"/>
	<text transform="matrix(1 0 0 1 401.7621 803.4821)"><tspan x="0" y="0" style="fill:#808080; font-family:'Raleway-Medium'; font-size:14.95px;">POWER OF ATTORNEY </tspan><tspan x="19" y="17.9" style="fill:#808080; font-family:'Raleway-Medium'; font-size:14.95px;">TO OPEN A BANK  </tspan><tspan x="34.6" y="35.9" style="fill:#808080; font-family:'Raleway-Medium'; font-size:14.95px;">ACCOUNT</tspan><tspan x="108.3" y="35.9" style="font-family:'Raleway-Medium'; font-size:14.95px;"> </tspan><tspan x="112.1" y="35.9" style="fill:#F24141; font-family:'Raleway-Medium'; font-size:14.95px;">(?)</tspan><tspan x="127.7" y="35.9" style="font-family:'Raleway-Medium'; font-size:14.95px;">  </tspan></text>
	<g>
		<path style="fill:#BFBFBF;" d="M482.6,634.6c24.9,0,49.7,0,74.6,0c5.1,0,5.4-0.3,4.8-5.3c-0.1-0.9-1-2-1.9-2.5
			c-2-1.2-4.3-2-6.4-3.1c-13.3-6.3-26.7-12.7-40-19c-9-4.3-18.1-8.3-26.9-12.8c-3.1-1.6-5.7-1.2-8.4,0.4c-0.7,0.4-1.3,0.9-1.9,1.2
			c-13.7,6.4-27.4,12.8-41.1,19.2c-9.7,4.5-19.3,9.2-29.1,13.6c-3.5,1.5-2.4,4.3-2.3,6.6c0.2,2.7,2.6,1.7,4.1,1.7
			C432.9,634.6,457.7,634.6,482.6,634.6z"/>
		<path style="fill:#BFBFBF;" d="M482.6,634.6c-24.9,0-49.7,0-74.6,0c-1.5,0-4,1-4.1-1.7c-0.1-2.4-1.2-5.1,2.3-6.6
			c9.8-4.4,19.4-9,29.1-13.6c13.7-6.4,27.4-12.8,41.1-19.2c0.7-0.3,1.3-0.8,1.9-1.2c2.7-1.6,5.3-2,8.4-0.4
			c8.9,4.5,17.9,8.5,26.9,12.8c13.4,6.3,26.7,12.7,40,19c2.1,1,4.4,1.9,6.4,3.1c0.8,0.5,1.8,1.6,1.9,2.5c0.6,5,0.3,5.3-4.8,5.3
			C532.3,634.6,507.4,634.6,482.6,634.6z"/>
		<path style="fill:#BFBFBF;" d="M482.8,733c-22.9,0-45.8,0-68.7,0c-4.5,0-5.1-0.7-4.3-5.1c0.1-0.8,1.1-1.5,1.9-2
			c0.5-0.3,1.3-0.1,1.9-0.1c46.2,0,92.5,0,138.7-0.1c3.2,0,4.1,1,4,4.1c-0.1,2.7-1.1,3.2-3.5,3.2C529.4,732.9,506.1,733,482.8,733z"
			/>
		<path style="fill:#BFBFBF;" d="M482.7,744c-25.1,0-50.1-0.1-75.2,0.1c-3.1,0-4-0.9-3.8-3.9c0.1-1.9,0.7-2.8,2.7-2.7
			c0.4,0,0.9,0,1.3,0c50.1,0,100.2,0,150.4,0c1.9,0,3.9-0.5,4,2.7c0.1,3-0.9,3.9-3.9,3.9C533.1,744,507.9,744,482.7,744z"/>
		<path style="fill:#BFBFBF;" d="M482.9,645.7c-23.1,0-46.2,0-69.3,0c-3.9,0-4.6-0.7-3.8-4.6c0.1-0.8,1.2-1.5,1.9-2
			c0.5-0.3,1.3-0.1,1.9-0.1c46.2,0,92.4,0,138.7,0c2.2,0,4-0.2,4,3.1c0,2.8-0.8,3.7-3.7,3.7C529.4,645.7,506.1,645.7,482.9,645.7z"
			/>
		<path style="fill:#BFBFBF;" d="M549.1,718.1c0,3-0.9,4.3-3.9,3.8c-0.2,0-0.4,0-0.6,0c-5.3,0-5.4,0-5.3-5.2c0.2-21,0.4-42,0.6-63.1
			c0-1.8,0-3.7,2.6-3.4c2.2,0.3,5.5-1.4,5.6,2.8c0.1,7.4,0,14.7,0,22.1C548.4,675.2,548.9,703.8,549.1,718.1z"/>
		<path style="fill:#BFBFBF;" d="M518.5,718.2c0,2.8-0.8,3.8-3.7,3.7c-7-0.2-6.2,0.6-6.1-6c0.2-20.8,0.5-41.6,0.6-62.4
			c0-2.9,1.2-3.4,3.7-3.3c2.4,0.1,4.4-0.1,4.3,3.4c-0.2,8.8-0.1,17.5-0.1,26.3C517.6,679.9,518.3,705.5,518.5,718.2z"/>
		<path style="fill:#BFBFBF;" d="M487.9,718.2c0,2.9-0.9,3.8-3.7,3.7c-7.1-0.2-6.1,0.6-6.1-6c0-0.7,0-1.3,0-2
			c0.2-20.1,0.5-40.3,0.6-60.4c0-2.9,1.2-3.5,3.7-3.3c2.1,0.1,4.3-0.5,4.3,3.1c-0.2,10.1-0.1,20.1-0.1,30.2
			C487,683.5,487.7,706.7,487.9,718.2z"/>
		<path style="fill:#BFBFBF;" d="M457.3,718.3c0,2.9-0.9,3.8-3.7,3.7c-7.2-0.2-6.2,0.5-6.2-6.3c0-7,0-14.1,0.1-21.1
			c0.2-13.8,0.5-27.5,0.6-41.3c0-3.3,1.9-3,4-3c2.2,0,4-0.1,3.9,3.1c-0.1,11.4-0.1,22.7-0.1,34.1C456.3,687.4,457.1,708,457.3,718.3
			z"/>
		<path style="fill:#BFBFBF;" d="M417.5,697.9c0-14.9,0.1-29.7-0.1-44.6c0-3.2,1.8-3.1,4-3.1c2.2,0,4-0.1,4,3.1
			c0.1,14.8,0.3,29.5,0.6,44.2c0.1,7.2,0.4,14.3,0.7,21.5c0.1,2-0.6,2.9-2.8,2.9c-7.3,0.2-7.3,0.3-7.1-6.8
			C416.8,709.4,417.2,697.9,417.5,697.9z"/>
		<g>
			<rect x="479" y="600.1" style="fill:#FFFFFF;" width="6.9" height="27.1"/>
			<rect x="471.8" y="609.2" style="fill:#FFFFFF;" width="20.8" height="9.1"/>
		</g>
	</g>
</g>
</svg>
