<?xml version="1.0" encoding="utf-8"?>
<!-- Generator: Adobe Illustrator 22.0.0, SVG Export Plug-In . SVG Version: 6.00 Build 0)  -->
<svg version="1.1" xmlns="http://www.w3.org/2000/svg" xmlns:xlink="http://www.w3.org/1999/xlink" x="0px" y="0px" width="1920px"
	 height="910px" viewBox="0 0 1920 910" style="enable-background:new 0 0 1920 910;" xml:space="preserve">
<style type="text/css">
	.st0{fill:#999999;stroke:#FFFFFF;stroke-width:1.3552;stroke-miterlimit:10;}
	.st1{fill:#FFCCCC;stroke:#FFFFFF;stroke-width:1.3552;stroke-miterlimit:10;}
	.st2{fill:#FF9999;stroke:#FFFFFF;stroke-width:1.3552;stroke-miterlimit:10;}
	.st3{fill:#FF6666;stroke:#FFFFFF;stroke-width:1.3552;stroke-miterlimit:10;}
	.st4{fill:#CCCCCC;stroke:#FFFFFF;stroke-width:1.3552;stroke-miterlimit:10;}
	.st5{font-family:'Akrobat-Bold';}
	.st6{font-size:44px;}
	.st7{font-family:'Akrobat-SemiBold';}
	.st8{font-size:35px;}
	.st9{font-family:'Akrobat'; font-weight:200;}
	.st10{font-size:26px;}
</style>
<g id="Map">
	<g id="Libye">
		<path class="st0" d="M1196.3,346.5c0.2,1.7,4.1,3.9,2.4,5.6c-5,4.9-14.2,5.1-19.7,9l-3,3.4c-1.4,0.9-3.6,0.2-4.7,1.3
			c-1.6,1.6-0.6,6.7-4.8,7.4c-4.5,0.9-7,0.8-9.8,5.8c-3,5.5,3.1,13.2,2.7,19c-0.4,5-18.5,23.1-22.7,19.7c-1.7,0.8-5.9,1.9-6,4.4
			c-0.1,3.2,6,9.5,7.5,12.6c3.6,7.8,5.3,17.3,4.6,25.7c-0.5,6-4.1,12.4-3.8,18.3c0.2,4,4.6,8.5,4.4,12.4c-1,10.6-9.2,9.1-6.3,24.9
			l0.8,4.3c0.6,0.7,1.9,0.4,2.3,1c0.7,1.3-0.7,2.9-1.1,4.4c-0.4,1.4-0.6,5.4-1.7,6.4c-3,3.5-15.3,3.5-14.3,10.9
			c1,7.6,14.3,18.2,16.6,26.3c0.2,0.8,0,1.6-0.1,2.5c0,0.8,0,1.6-0.1,2.5c-0.1,2.5-0.1,4.9-0.3,7.5c0,0.8-0.5,1.7-0.1,2.5
			c0.6,1.4,4,1.4,4.7,2.7c0.8,1.4,0,3.3,0.7,4.7c3.6,6.8,8.8,1.3,13.7,1.4c2.2,0,23,7.5,24.5,8.9c6,5.4,4.7,19.4,11,24.5
			c4.9,4.1,33.7,7,41.9,10.2c7.1,2.7,19.5,18.3,23.5,19c2.5,0.5,9.9-4.6,12.1-5.8c6.3-3.2,36.6-20.6,41.1-20.7
			c4-0.1,43,21.6,49.6,25c42.2,21.9,84.4,43.7,126.3,66.3c15,8.1,29.8,16.3,44.7,24.6c3.4,2,11.8,8.8,15.6,8.7l2.1-1.6l0,0.1
			c1.4-3.2-1.6-11,0-13c0.5-0.6,1.5,0,2.2,0c2.8,0,27.9,0.1,27.9,0l-0.1-5.1c-0.1-3.3-0.1-6.8-0.2-10.1c-0.2-15.7-0.6-31.3-0.8-47.1
			c-0.3-0.2-0.3-15.8-0.3-17.6c-0.3-16.5-0.7-33.1-1-49.6c-0.8-35-1.6-70-2.5-105c-0.4-15.5,1.7-36.4-1.4-51.2
			c-0.6-2.9-2.9-5.3-3.5-8.2c-0.9-3.9-1-7.5-1.8-11.1c-0.7-2.9-3.5-5.3-4-8.2c-0.7-4,8.9-13.1,8.4-19.9
			c-1.2-13.6-12.2-12.7,1.8-25.4l0.2-0.1c-1.2-3.5-2.6-8.4-4.1-10c-2.4-2.5-18.6-0.9-22.8-1c-5.1,0.1-6.6-4.1-12.1-5
			c-2.8-0.5-6.1,0.3-8.8-0.5c-0.5-0.1-2.4-2.3-3.2-1.1c-0.3,0.6,0.9,1.5,0.4,2.1c-0.3,0.5-0.6-1-0.9-1.5c-1.1-1.3-4.9-2.8-5.6-4.1
			c-2-3.2,2.7-1.6,1.7-4c-1.2-3.3-2,0.4-1.5-3.6c0.5-3.4,0.5,0.5,0.5-1.5c0-0.3-9.7-3.2-10.9-3.3c-3.4-0.4-15.3-6.3-16-6.3
			c-4.5,0-7.2,2.6-11.9-0.1c-2.4-1.3-6.7,4.3-9.2,5c-3,0.8-5.9,0.1-8.7,0.5c-9.7,1.3-28,14.6-31,24.1c-1.6,5.2-1.1,13.8,2.2,18.3
			c1.3,1.7,2.7,2.2,3.2,4.6c3,15.7-21.2,31.3-35.1,28.1c-6.3-1.4-15-12-20-15.4c-2.4-1.6-7.2-2.9-9.7-4.2
			c-8.8-4.2-20.8-8.2-30.7-9.5c-10.7-1.5-20.4-0.3-29.7-7.1c-10.2-7.6-4.8-22.2-12.7-29.6c-1-0.9-15.5-2.7-18.8-3.9
			c-3.2-1.1-5.2-4.5-8.5-5.8c-5.3-2.1-10.7-2.1-15.9-3.4c-3.2-0.7-5.6-3.3-9-3.7c-7.5-1.2-14.6,5.6-26,1.9c-6.9-2.2-11.7-7-18.3-8.6
			c-0.5-0.1-1.8-0.8-3.2-1.7C1197.7,335.2,1195.5,342,1196.3,346.5"/>
	</g>
	<g id="Tunisie">
		<path class="st1" d="M1131.5,217c-1.5,0.9-5.3,0-6.4,1.8c-0.3,0.6,3.8,0.7,0.5,3.6c-2.2,1.9-5.5,1.2-7.5,3.7
			c-0.9,1.1,4.4,1.6,4.7,2.2c0.3,0.6-4.1,14.5-4.5,16.5c-0.8,4.4,2.1,7.2,1.4,11.7c-0.2,1.7-2.9,3.3-2.3,5.5c0.4,1.6,4.3,2,3.8,3.1
			c-1.6,2.9-5.1,5.7-5.9,9.4c-0.7,2.9,0,6.3-1.3,8.6c-1.7,3.1-9.4,3.5-12,6.1c-1.3,1.3-1.1,4.4-2.4,5.5c-3.5,3-7.8,0.9-8.8,9.8
			c-0.5,5,3.8,9.7,4.8,14.4c0.4,2-1.2,5.3,0.6,6.7c2.3,1.6,6.4,2,8.4,3.4c6.3,4.6,2.7,12.8,5.5,18.1c3.5,6.3,14.8,8.3,18.5,14.4
			c2.8,4.6,5.1,36.7,6.2,44c0.3,2.1,0.4,11.6,1.9,12.9c4.1,3.4,22.4-14.7,22.7-19.7c0.4-5.7-5.6-13.5-2.7-19c2.8-5,5.3-4.9,9.8-5.8
			c4.3-0.8,3.1-5.8,4.8-7.4c1.2-1.1,3.3-0.6,4.7-1.3l3-3.4c5.5-4,14.7-4.1,19.7-9c1.7-1.7-2.2-3.9-2.4-5.6
			c-0.7-4.5,1.6-11.2,2.9-15.7c-1-0.6-1.9-1.3-2.7-1.7c0.1,0.1,0.2,0.2,0.2,0.2c0.2,0.6-6.8-0.4-7.3-0.7c-0.8-0.5-1.6-2.5-0.7-2.5
			l4,0.6c1.3-1.3-4.5-0.8-4.8-2.7c-0.4-2.5,2.3-5.7-0.8-7.6c-4.3-2.7-3.5,3.9-8.5,4.3c-4.7,0.4,1-5.4-0.3-7.1
			c-0.9-1.2-5.2,2-6.6,1.8c-4.5-0.7-10.3-7.8-11.3-12c-2.6-11.2,20.5-15.2,25.8-25c1.4-2.6,4.2-11,7.7-10.9c1.6,0-2.7-2.1-3.3-3.6
			c-0.9-2.5,2-6,1.2-8.5c-0.8-2.3-13.1-4.8-14.4-15c-0.9-6.4,5.5-8.8,10.3-10.1c0.9-0.2,2.6-4.6,3.1-5.4c1.3-1.9,5.8-4.4,6.4-6.3
			c0.2-0.7-0.9-5.7-1.2-6.6c-0.6-1.7-7.1,4.2-7.8,4.5c-2.2,1.6-2.5,0.2-4.7,1c-1.6,0.6-3.5,3.8-5.3,4.8c-1.4,0.8-3-2.5-3.3-2.7
			c-0.7-0.2-1.6,0.8-2.3,0.4c-1.9-1,4.5-0.8,4.3-2.8c-0.2-1.6-2.6-1.9-3.7-3.1c-3.6-4.3,3.9-1.7-1.3-5.1c-0.2-0.1,4-0.4,3.7-0.9
			c-1-1.4-8.2-3.5-10.8-2.4c-0.3,0.2-0.5,0.5-0.7,0.7c-0.1,0.1-0.1,0.2-0.2,0.3c0,0.3,1,0,1.5,0c0.5,0,1.4-0.4,1.5,0
			c1.1,4.7-4.8,2.5-3.1,0l0,0c0-0.1,0.2-0.2,0.2-0.3c0.2-0.2,0.3-0.5,0.7-0.7l0,0c0.9-0.6,0.4-1.8,0.2-2.5
			c-0.3-1.6-13.6,2.5-15.7,2.4c-6.3-0.3-9.7,6.4-17.6,8C1131.3,214.5,1131.8,216.9,1131.5,217"/>
	</g>
	<g id="Algerie">
		<path class="st2" d="M846.1,264.9c0.2,1.3-3.6,3.1-3.5,4.5c0,1,4,2.9,3.8,3.8l-3.7,2.8c-0.8,2.5,2.5,6.8,2.3,9.4
			c-0.3,3.7-4.8,7.9-4.4,11.6c0.2,1.7,3.4,1.6,2.7,4.8c-0.7,3-4.2,5.6-3.5,9c0.6,2.3,3.3,4.2,3.9,6.5c0.7,3.2-4.7,3.2,1,10.5
			c1.6,2.1,8.2,4.3,8.9,6.7c0.4,1.8-6.6,3.7-7.3,5.2c-0.8,1.6-2,3.2-2.2,5c-0.1,0.5,0.9,0,1.4,0.1c0.5,0,1-0.2,1.4,0.1
			c0.8,0.8,0.1,2.3-0.9,2.5c-12.3,2.2-30.7-7.6-44.9-3c-3.8,1.2-1.6,5-4.1,7c-1.7,1.5-6.9,2-9.1,2.7c-2,0.6-4.8,1.9-6.9,2
			c-2.3,0-5.6-3.5-8-1.5c-4.5,3.5,1,8.6,1,9.4c0,0.1-4.1,5.6-4.4,6.5c0,0,6.3,1,5.5,5.1c-0.1,0.6,0.1,1.1-0.2,1.5
			c-2.1,2.3-9.5,0.5-12.3,1.8c-4.4,1.8-7.3,6.6-12.4,7.5c-4.6,0.8-10.7,0-14.9,3.1c-5.9,4.3-8.3,11.9-15.5,15.7
			c-4.1,2.2-24,4.5-28.5,3.2c-0.7-0.2-1-1.4-1.6-1.2c-2.2,0.8-1.3,7.5-4.8,8.1c-5.2,1-11.7-3.6-16.7-2.3c-2.9,0.8-4.7,4.9-7.6,5.8
			l-5-0.4c-7.9,1.8-20.5,13.2-28.1,17.5c-1,0.6-4.4,0.8-5.1,1.7c-2.6,3.7-2.6,13.1-3.5,17.5c-1.8,8.9-3.5,17.9-5.2,26.8l-0.1,0.6
			c23.1,19.1,46.5,37.9,69.6,56.8c4.1,3.4,24,16.9,25.3,20.6c43,36.6,87.1,76.5,131.9,111c4.1,3.2,26.6,18.6,28,21.3
			c0.9,1.7-2.7,10.7-0.7,11.6c0.7,0.3,1.5,0,2.2,0.1c0.7,0,1.6-0.2,2.2,0.1c0.8,0.5,0,2.1,0.8,2.6c2.2,1.7,6.7,1.1,8.6,4
			c0.2,0.3-0.1,0.9-0.1,1.3c0,0.5-0.2,0.9-0.1,1.3c1.2,3,5.1,5.5,6.8,7c3,2.7,7.4-2.2,9.1-1.2c2.9,1.6,2.9,6,5.3,7.5
			c4.3,2.8,20.9,3.2,23.7,8.2c1.1,1.8-1.8,6.6-1.2,8.9c0.2,1.1,1.7,3.2,1.1,5.3c-1.2,3.8-7.6,5.1-3,8.8l4.1,3.2
			c5,1.4,24.2-3.7,30.3-4.8c11.1-1.9,36-3.4,45.2-7.6c4.1-1.9,8.4-6.8,12-9.8c13.2-10.7,25.9-23,39.8-32.7
			c19-13.1,40.7-23.5,60.7-34.9c26-14.9,51.8-31.4,78.7-44.7c-6.3-5.1-5-19.1-11-24.5c-1.5-1.3-22.3-8.9-24.5-8.9
			c-4.8,0-10,5.4-13.7-1.4c-0.8-1.4,0.1-3.3-0.7-4.7c-0.8-1.3-4.1-1.4-4.7-2.7c-0.3-0.8,0-1.7,0.1-2.5c0.1-2.5,0.1-4.9,0.3-7.5
			c0-0.8,0-1.7,0.1-2.5c0-0.8,0.4-1.7,0.1-2.5c-2.2-7.9-15.6-18.6-16.6-26.3c-1-7.5,11.3-7.4,14.3-10.9c0.9-1,1.3-5,1.7-6.4
			c0.4-1.5,1.7-3,1.1-4.4c-0.5-0.8-1.7-0.5-2.3-1l-0.8-4.3c-3-15.7,5.3-14.3,6.3-24.9c0.4-3.9-4.1-8.4-4.4-12.4
			c-0.3-6,3.3-12.4,3.8-18.3c0.6-8.5-1-17.9-4.6-25.7c-1.5-3.1-7.6-9.2-7.5-12.6c0.1-2.5,4.3-3.5,6-4.4c-1.5-1.2-1.5-10.7-1.9-12.9
			c-1.1-7.5-3.4-39.4-6.2-44c-3.7-6.1-15-8-18.5-14.4c-2.9-5.2,0.8-13.3-5.5-18.1c-1.9-1.4-6.1-1.8-8.4-3.4
			c-1.9-1.4-0.3-4.7-0.6-6.7c-1-4.7-5.3-9.4-4.8-14.4c1-8.9,5.3-6.9,8.8-9.8c1.4-1.1,1.2-4.2,2.4-5.5c2.5-2.6,10.1-3,12-6.1
			c1.3-2.3,0.6-5.7,1.3-8.6c0.9-3.7,4.4-6.5,5.9-9.4c0.7-1.1-3.3-1.5-3.8-3.1c-0.6-2.1,2.1-3.8,2.3-5.5c0.7-4.5-2.2-7.2-1.4-11.7
			c0.4-1.9,4.8-15.9,4.5-16.5c-0.3-0.6-5.5-1.1-4.7-2.2c2-2.5,5.3-1.8,7.5-3.7c3.2-2.8-0.9-2.9-0.5-3.6c1-1.7,4.9-0.8,6.4-1.8
			c0.2-0.1-0.2-2.5-0.1-3.3c-2.9,0.6-6.2,0.5-10.6-0.6c-3.6-0.9-8.2,5.3-12.2,1.5c-0.7-0.7,1.7-2.6,0.8-3c-0.8-0.3-1.5,0.9-2.3,0.9
			c-2.2-0.1-3.7-2.6-5.8-3.3c-0.5-0.1-8-1.2-7.8-0.9c2,4.4-1.6,5.5-6.8,5.2c-4-0.1-12.1-7.5-14.6-6.8c-3.2,1-2.3,3.9-4.2,4.8
			c-5.8,3.1-12.9,0.3-17.7,3.7c-2.3,1.6-3.7,3.9-7.1,3.7c-4.6-0.3-9.8-9.1-22.5-9.8c-4.8-0.3-9.6-0.5-14.5-0.8
			c-4-0.3-7.3,3.7-11.2,3.9c-4.7,0.3-4-2-7.1,0.1c-3.5,2.3-4.7-3.9-8.1-2c-3.2,1.8-5.3,5.9-9.8,6c-2.3,0-3.9-1.5-5.8-1.9
			c-5.6-1.1-16.7,2.5-23,2.1c-1.1-0.1-2.2-1.3-3.3-1.3c-10.6,0.3-22.3,7.7-32.1,11.3c-4.7,1.7-4.9,9.3-10.6,9.6
			c-3.8,0.2-3.5-3.5-5.9-3.9c-3.4-0.7-4.8,3.5-7.6,5.1c-0.2,0.1-7.6-2.3-11.1,0.3c-3.7,2.7-4.7,5.5-7.9,8.7
			c-1.5,1.6-16.1,7.8-18.7,8c-2.2,0.1-5.4-1-8.1-1.8l0,0.1C836.7,257.2,845.4,260.7,846.1,264.9"/>
	</g>
	<g id="Maroc">
		<path class="st3" d="M853.5,334.5c-0.7-2.4-7.3-4.8-8.9-6.7c-5.7-7.2-0.2-7.2-1-10.5c-0.6-2.3-3.3-4.2-3.9-6.5
			c-0.8-3.4,2.8-6.1,3.5-9c0.7-3.1-2.6-3.1-2.7-4.8c-0.3-3.7,4.2-7.9,4.4-11.6c0.1-2.6-3.2-6.9-2.3-9.4l3.7-2.8
			c0.2-1-3.8-2.8-3.8-3.8c0-1.3,3.7-3.2,3.5-4.5c-0.7-4.1-9.4-7.6-10.4-12.1l0-0.1c-2.2-0.7-4-1.3-4.9-1.2c-8.4,1-8.9-1.3-9,0.4
			c0,0.5-1-0.2-1.5-0.4c-3.3-0.8-2.4-7-1.9-9.7c0,0-3.6,4.1-4,4.3c-2,1-5.3,1.8-7.6,2.5c-2.6,0.8-6.2-3-8.1-3.7
			c-3.4-1.2-1.7,2.4-4.5,2.3c-0.7,0-1.6-0.1-2.1-0.7c-0.3-0.3,0.4-1.4-0.1-1.6c-2.7-0.8-8.9,2.6-12.2,2.7
			c-11,0.4-18.5-11.7-21.6-18.9c-1.4-3,2.3-5,2.2-6.1c0-0.3-10,1.7-16.3,1.7c-0.8,0-8.2,12.3-9.4,14.5
			c-7.7,12.9-16.3,26.3-26.9,37.1c-11.9,12.2-30.3,10.1-44.3,17.1c-8.6,4.3-23.8,16.5-32.1,23.5c-0.7,0.6,0.4,1.7,0.3,2.6
			c-0.5,2.5-2,6-2.9,8.7c-2.7,7.7-18.9,14.9-20.7,23c-0.2,0.9,0.9,1.8,0.8,2.8c-1.5,6.9-3.7,13.3-6.7,19.6c-0.6,1.3,5.1,6.1,5.3,9
			c0.5,5.6-5.1,12.9-8.7,16.8c-7.4,7.8-14.6,15.4-22.4,22.6c-5.7,5.1-14.6,5.3-20.3,10.1c-4.3,3.5-9.6,10.1-14.8,12.6
			c-4.8,2.3-11.5,4.2-16.6,5.5c-5.8,1.6-21.9,0.1-25.7,3.2c-1.4,1-1.5,3.5-2.9,4.6c-1.2,0.9-3,0.8-4.1,1.8c-0.2,0.2-0.6,0.6-0.8,0.9
			c-2.4,3.2-7.3,12.1-9.2,14.9c-2.8,4.2-3.9,10.2-7.7,14c-8.3,8-22.1,7.4-29.2,15.9c-1.4,1.7-1,5.3-2.6,7.3c-4.5,6.2-9,12.4-13,19
			c-3.6,5.9-1.4,14.5-6.1,20.2c-2.4,3-5.9,4-9.2,5.8c-5.8,3.1-9.6,10.6-15.1,14c-2.4,1.5-4.4,2.7-6.2,4c0.6-0.3,0.9-0.3,1,0.6
			c0.1,1.1-14.1,20.8-15.8,22.2c-0.7,0.6-2.3,1.2-1.9,2.1c1.4,2.2,3.1-1.4,1.4,2.9c-0.7,1.7-4.8,2.7-5,3.4c-0.5,2.3-2,8-3.4,10.1
			c-0.6,0.8-2.1,0.7-2.7,1.5c-1.3,1.5-1.2,4.5-2.6,5.8c-3,3-7.2-0.4-11.9,7.3c-6.6,11-9.7,24.6-13.9,36.3c-0.1,0.2-0.3,3.7-0.1,4.7
			l0.5-0.2c-0.1-3.1,3.5-15,6.2-16.6c1.5-0.9,19.6,1.5,22.7,1.8c21.8,1.6,43.6,3.2,65.5,4.7c2.1,0.1,24,1.7,24,1.7
			c2.3-2.2,2.6-40.4,3.6-45.9c3.2-16.2,33.4-16.4,36.5-20.1c2.5-3,2.5-13.9,3.2-17.8c2.9-15.2,5.7-30.5,8.7-45.7
			c0.4-1.9,3-17.3,3.5-17.8c0.3-0.3,15.7,1.3,17.6,1.4c18.4,1.4,36.8,2.8,55.2,4.1c5.2,0.4,20,2.1,20.4,1.4
			c2.9-3.8,2.7-15.4,3.7-20.2c1.3-6.8,2.5-13.5,3.8-20.3l0.1-0.6c0.7-3.8,1.4-7.7,2.3-11.5c1-5.2,1.9-10.3,3-15.4
			c0.8-4.5,0.9-13.9,3.5-17.5c0.7-0.9,4-1.1,5.1-1.7c7.5-4.2,20.2-15.6,28.1-17.5l5,0.4c2.9-0.8,4.7-5,7.6-5.8
			c5.1-1.3,11.6,3.3,16.7,2.3c3.4-0.7,2.6-7.3,4.8-8.1c0.6-0.2,1,0.9,1.6,1.2c4.4,1.4,24.3-1,28.5-3.2c7-3.7,9.5-11.3,15.5-15.7
			c4.3-3.1,10.2-2.3,14.9-3.1c5.2-0.9,8.1-5.7,12.4-7.5c2.8-1.2,10.2,0.5,12.3-1.8c0.3-0.3,0.2-1,0.2-1.5c0.7-4.1-5.5-5.1-5.5-5.1
			c0.4-0.9,4.4-6.4,4.4-6.5c0-0.8-5.6-5.9-1-9.4c2.4-1.8,5.7,1.6,8,1.5c2.1,0,4.9-1.5,6.9-2c2.3-0.7,7.4-1.1,9.1-2.7
			c2.3-2.1,0.2-5.7,4.1-7c14.2-4.7,32.6,5,44.9,3c1-0.2,1.6-1.7,0.9-2.5c-0.3-0.3-0.9,0-1.4-0.1c-0.5,0-1.5,0.3-1.4-0.1
			c0.4-1.8,1.4-3.4,2.2-5C846.9,338.3,854,336.3,853.5,334.5z"/>
	</g>
	<g id="Mauritanie">
		<path class="st4" d="M330,828.7c3.7-3.4,4.1-10.9,7.9-14.4c3.4-3.1,6.1,0.4,9.1,1.1c5.7,1.4,11.1-1.5,15.4-2.4
			c2-0.3,4.7,0.8,6.7,1c0.7,0,1.3-0.1,2-0.2c4.5-0.3,0.7-4.1,5.9-3.7c1.3,0.1,1.8,2,3.1,2.4c1.9,0.6,5,0.3,7,0.4
			c1.1,0.1,7.9-0.3,8.5,0.5c2.5,3.5,6.5,8.9,9,13.6l2.7,1.3l0.1,2.8c1.5,0.2,2.7-2.3,4.1-1.9c0.9,0.1-0.2,2.4,0.7,2.8
			c1.4,0.6,4.3-2,5.5-1.3c5.5,2.6,2.1,13.2,5.2,17.1c0.9,1.2,3.4,0.5,4.2,1.9c0.7,1.2-1.4,2.5,0.6,3.3l3-0.4c0.8,0.9,2,9.8,2.2,9.9
			c0.6,0.3,1.5-0.9,2.1-0.4c0.6,0.5-0.6,1.5-0.2,2.2c1.2,2.4,6.6,2.6,8.3,4.8c0.9,1.2,0.2,3.1,1,4.4c2.2,3.3,7.8,4.4,10.6,5.9
			c0.5,0.2,7.6-4.7,8.1-5.6c1.4-2.6-0.7-4.4-0.9-5.5c-0.4-2.4,3.3-8.7,4.1-11.1l1.6-4.5c0.7-0.2,1.1,1.3,1.8,1.2
			c1.5-0.1,3-3.7,4.4-4.1c3.1-1.1,16.1,18.8,16.2,18.7c2.8-1.8,3.4-8.9,6.6-10.5c3.5-1.7,14.3,1.8,17.5,3c5.4,1.9,9.8-1.5,14.7-1.6
			c1.4,0,2.9-0.1,4.2-0.1c0.7,0,1.7,0.5,2.1-0.1c0.5-0.7-1.2-9.3,3.4-8c1.6,0.5-1.3,5.8-0.7,6.4c0.2,0.2,20.5,0.9,22.7,1
			c21.3,1,42.7,1.8,64,2.7c3.1,0.1,26.4,1.9,27.5,1.1c0.9-0.7,1.8-6,2.1-7.2c0.8-2.7,6.1-17.5,5.5-19.2c-0.7-2.4-6.3-3.4-7.4-5.7
			l0-5.2c0-6,0.1-12.1,0.1-18c0.4-55.4,1.3-111,3.5-166.4c0.8-20.4,1.5-40.9,2.4-61.3c0.1-2.1,0.7-20.5,0.9-20.8
			c0.2-0.2,34.4,2.1,38.1,2.3c1.3,0.1,11.7,1.3,10.9-0.7c-1.4-3.7-21.2-17.3-25.3-20.6c-23.2-18.9-46.6-37.7-69.6-56.8
			c-1.3,6.8-2.5,13.5-3.8,20.3c-0.8,4.8-0.8,16.4-3.7,20.2c-0.5,0.6-15.3-1-20.4-1.4c-18.4-1.3-36.8-2.7-55.2-4.1
			c-1.8-0.1-17.1-1.6-17.6-1.4c-0.6,0.5-3.1,15.8-3.5,17.8c-3,15.2-5.8,30.5-8.7,45.7c-0.7,3.9-0.7,14.9-3.2,17.8
			c-3.1,3.7-33.4,4-36.5,20.1c-1.1,5.5-1.3,43.6-3.6,45.9c0,0.1-21.9-1.5-24-1.7c-21.8-1.5-43.6-3.1-65.5-4.7
			c-3.1-0.3-21.1-2.7-22.7-1.8c-2.7,1.6-6.3,13.5-6.2,16.6l-0.5,0.2c0,0.2,0.1,0.3,0.1,0.3c4-2.6,1.3-8.8,6-11.7
			c0.9-0.6,2.1,7.2,2.4,7.8c0.3,0.7,3.4,6.9,2.9,7.9c-0.7,1.5-0.4,0.9,1.1,3.1c2.5,3.8,1.4-2.5,2.3-4c0.5-0.7,1.1,2.8,1.4,2.9
			c0.3,0.1,0.8-0.2,0.9,0.1c1.4,2.1,1,6.1,1,7.8c0.1,2.5,3.5,4.4,3.2,6.8c-0.2,1.1-2.3,1.4-2.3,2.6c0,3.2,2.4,1.3,0.7,4.5
			c-0.8,1.5-2.7,2.2-3.5,3.6c-0.9,1.5,3.8-0.8,1.8,3.5c-0.9,2.1-10.3,9.8-8.8,12c0.1,0.1,0.2,0.1,0.3,0.2c0.1,0,0.2,0,0.3,0
			c0.9-0.2,2-2.9,2.2-2.3c0.3,1.2,0.4,1.6-0.4,2.2c-0.5,0.3-1.1,0.2-1.8,0.1c-0.1,0-0.2,0-0.3,0c-0.9-0.1-1.7-0.4-2.3,0.2
			c-1,1,6.5,8.2,7.5,15.9c2.7,20.6-1,39.8-10.3,58.4c-2.8,5.5-7.4,10-9.4,16.2c-1.8,5.5-2.6,11.2-3.6,16.8l0.2,0
			C330.7,827.3,329.5,829,330,828.7"/>
	</g>
</g>
<g id="Mauritanie_1_">
	<g>
		<text transform="matrix(1 0 0 1 71.9049 682.3422)" class="st5 st6">MAURITANIE</text>
		<text transform="matrix(1 0 0 1 71.9049 722.0614)" class="st7 st8">8 cas</text>
		<text transform="matrix(1 0 0 1 71.9049 754.1888)"><tspan x="0" y="0" class="st9 st10">0.17/100 000 habitants</tspan><tspan x="0" y="31.2" class="st5 st10">Nombre de morts : 1</tspan></text>
	</g>
</g>
<g id="Maroc_1_">
	<text transform="matrix(1 0 0 1 317.9049 296.3422)" class="st5 st6">MAROC</text>
	<text transform="matrix(1 0 0 1 317.9049 336.0614)" class="st7 st8">6 418 cas</text>
	<text transform="matrix(1 0 0 1 317.9049 368.1888)"><tspan x="0" y="0" class="st9 st10">0.12/10 000 habitants</tspan><tspan x="0" y="31.2" class="st5 st10">Nombre de morts : 188</tspan></text>
</g>
<g id="Libye_1_">
	<g>
		<text transform="matrix(1 0 0 1 1599.9049 429.3422)" class="st5 st6">LIBYE</text>
		<text transform="matrix(1 0 0 1 1599.9049 469.0614)" class="st7 st8">64 cas</text>
		<text transform="matrix(1 0 0 1 1599.9049 501.1888)"><tspan x="0" y="0" class="st9 st10">0.12/10 000 habitants</tspan><tspan x="0" y="31.2" class="st5 st10">Nombre de morts : 0</tspan></text>
	</g>
</g>
<g id="Tunisie_1_">
	<g>
		<text transform="matrix(1 0 0 1 1225.9049 175.3422)" class="st5 st6">TUNISIE</text>
		<text transform="matrix(1 0 0 1 1225.9049 215.0614)" class="st7 st8">1 045 cas</text>
		<text transform="matrix(1 0 0 1 1225.9049 247.1888)"><tspan x="0" y="0" class="st9 st10">8.84/100 000 habitants</tspan><tspan x="0" y="31.2" class="st5 st10">Nombre de morts : 46</tspan></text>
	</g>
</g>
<g id="Algerie_1_">
	<g>
		<text transform="matrix(1 0 0 1 843.9049 67.3422)" class="st5 st6">ALGÉRIE</text>
		<text transform="matrix(1 0 0 1 843.9049 107.0614)" class="st7 st8">6 067 cas</text>
		<text transform="matrix(1 0 0 1 843.9049 139.1888)"><tspan x="0" y="0" class="st9 st10">0.12/10 000 habitants</tspan><tspan x="0" y="31.2" class="st5 st10">Nombre de morts : 515</tspan></text>
	</g>
</g>
</svg>
