<?xml version="1.0" encoding="utf-8"?>
<!-- Generator: Adobe Illustrator 22.0.0, SVG Export Plug-In . SVG Version: 6.00 Build 0)  -->
<svg version="1.1" id="Layer_1" xmlns="http://www.w3.org/2000/svg" xmlns:xlink="http://www.w3.org/1999/xlink" x="0px" y="0px"
	 width="600px" height="900px" viewBox="0 0 600 900" style="enable-background:new 0 0 600 900;" xml:space="preserve">
<rect x="124.9" y="141.4" style="fill:none;stroke:#454FA1;stroke-width:0.6;stroke-miterlimit:10;" width="348.1" height="47.6"/>
<rect x="125.1" y="205.5" style="fill:none;stroke:#454FA1;stroke-width:0.6;stroke-miterlimit:10;" width="348.1" height="47.3"/>
<rect x="125.1" y="268.7" style="fill:none;stroke:#454FA1;stroke-width:0.6;stroke-miterlimit:10;" width="348.1" height="47.3"/>
<rect style="fill:#454FA1;" width="224.4" height="106.2"/>
<text transform="matrix(1 0 0 1 34.2523 60.5226)" style="fill:#FFFFFF; font-family:'Roboto-BoldCondensed'; font-size:39px;">THE</text>
<text transform="matrix(1 0 0 1 93.1902 60.5226)" style="fill:#FFFFFF; font-family:'Roboto-BoldCondensed'; font-size:48px;"> </text>
<text transform="matrix(1 0 0 1 34.2464 106.5064)" style="fill:#FFFFFF; font-family:'Roboto-BoldCondensed'; font-size:48px;">ACCUSED</text>
<text transform="matrix(1 0 0 1 137.9161 171.8692)" style="fill:#454FA1; font-family:'Roboto-BoldCondensed'; font-size:19.6078px;">Zine El Abidine Ben Ali</text>
<text transform="matrix(1 0 0 1 310.5524 171.8692)" style="fill:#454FA1; font-family:'FuturaLT'; font-size:19.6078px;"> </text>
<text transform="matrix(1 0 0 1 316.193 171.8692)" style="fill:#454FA1; font-family:'Roboto-Condensed'; font-size:14.1176px;">President of the Republic</text>
<text transform="matrix(1 0 0 1 176.3204 238.0665)" style="fill:#454FA1; font-family:'Roboto-BoldCondensed'; font-size:19.6078px;">Abdallah Kallel</text>
<text transform="matrix(1 0 0 1 296.7213 238.0665)" style="fill:#454FA1; font-family:'FuturaLT'; font-size:19.6078px;"> </text>
<text transform="matrix(1 0 0 1 297.3824 238.0665)" style="fill:#454FA1; font-family:'Roboto-Condensed'; font-size:14.1176px;">Minister of the Interior</text>
<text transform="matrix(1 0 0 1 156.733 300.2848)" style="fill:#454FA1; font-family:'Roboto-BoldCondensed'; font-size:19.6078px;">Azzedine Jenayah</text>
<text transform="matrix(1 0 0 1 284.1891 300.2848)" style="fill:#454FA1; font-family:'FuturaLT'; font-size:19.6078px;"> </text>
<text transform="matrix(1 0 0 1 301.8746 300.2848)" style="fill:#454FA1; font-family:'Roboto-Condensed'; font-size:14.1176px;">Director of State Security</text>
<rect x="27.9" y="332.5" style="fill:none;stroke:#454FA1;stroke-width:0.6;stroke-miterlimit:10;" width="152.8" height="97.5"/>
<rect x="341.6" y="332.5" style="fill:none;stroke:#454FA1;stroke-width:0.6;stroke-miterlimit:10;" width="226.5" height="59.5"/>
<text transform="matrix(1 0 0 1 49.4208 358.1852)"><tspan x="0" y="0" style="fill:#454FA1; font-family:'Roboto-BoldCondensed'; font-size:19.6078px;">Mohamed-Ali </tspan><tspan x="20.6" y="23.5" style="fill:#454FA1; font-family:'Roboto-BoldCondensed'; font-size:19.6078px;">Mohamed-A</tspan></text>
<polygon style="fill:none;stroke:#454FA1;stroke-width:0.6;stroke-miterlimit:10;" points="179.6,517.5 27.1,517.5 27.1,449.2 
	179.6,449.2 179.6,482 "/>
<rect x="343.6" y="406.2" style="fill:none;stroke:#454FA1;stroke-width:0.6;stroke-miterlimit:10;" width="178" height="53.8"/>
<rect x="26.1" y="548.2" style="fill:none;stroke:#454FA1;stroke-width:0.6;stroke-miterlimit:10;" width="151.5" height="59.8"/>
<polyline style="fill:none;stroke:#454FA1;stroke-width:0.6;stroke-miterlimit:10;" points="177.6,608.2 177.6,745 26.1,745 
	26.1,608.2 "/>
<text transform="matrix(1 0 0 1 44.7196 473.7848)" style="fill:#454FA1; font-family:'Roboto-BoldCondensed'; font-size:19.6078px;">Samir Zaâtouri </text>
<polyline style="fill:none;stroke:#454FA1;stroke-width:0.6;stroke-miterlimit:10;" points="336.2,519.8 541.6,519.8 541.6,599 "/>
<polyline style="fill:none;stroke:#454FA1;stroke-width:0.6;stroke-miterlimit:10;" points="335.2,598.8 541.6,598.8 541.6,792 
	335.2,792 "/>
<text transform="matrix(1 0 0 1 387.85 545.9879)" style="fill:#454FA1; font-family:'Roboto-BoldCondensed'; font-size:19.6078px;">Ali Boussetta </text>
<text transform="matrix(1 0 0 1 404.6616 357.6852)" style="fill:#454FA1; font-family:'Roboto-BoldCondensed'; font-size:19.6078px;">Hassan Abid </text>
<text transform="matrix(1 0 0 1 400.1074 379.6852)" style="fill:#454FA1; font-family:'Roboto-Condensed'; font-size:14.1176px;">Head of Intelligence</text>
<text transform="matrix(1 0 0 1 373.0879 431.4874)" style="fill:#454FA1; font-family:'Roboto-BoldCondensed'; font-size:19.6078px;">Ahmed Ghattas</text>
<text transform="matrix(1 0 0 1 413.6534 450.9752)" style="fill:#454FA1; font-family:'Roboto-Condensed'; font-size:14.1176px;">Doctor</text>
<text transform="matrix(1 0 0 1 236.318 839.6851)" style="fill:#454FA1; font-family:'Roboto-BoldCondensed'; font-size:19.6078px;">Abdallah </text>
<text transform="matrix(1 0 0 1 385.9523 654.1827)" style="fill:#454FA1; font-family:'Roboto-BoldCondensed'; font-size:19.6078px;">Riadh Chebbi,</text>
<text transform="matrix(1 0 0 1 357.9445 682.0211)" style="fill:#454FA1; font-family:'Roboto-BoldCondensed'; font-size:19.6078px;">Mustapha Aounallah,</text>
<text transform="matrix(1 0 0 1 373.5304 712.8595)" style="fill:#454FA1; font-family:'Roboto-BoldCondensed'; font-size:19.6078px;">Oussama Boujeh</text>
<text transform="matrix(1 0 0 1 372.6525 737.6968)" style="fill:#454FA1; font-family:'Roboto-BoldCondensed'; font-size:19.6078px;">Farhat Ben Amor </text>
<text transform="matrix(1 0 0 1 357.0988 626.3443)" style="fill:#454FA1; font-family:'Roboto-BoldCondensed'; font-size:19.6078px;">Anouar Ben Youssef, </text>
<text transform="matrix(1 0 0 1 38.1469 636.0406)" style="fill:#454FA1; font-family:'Roboto-BoldCondensed'; font-size:19.6078px;">Khelifa et Mongi</text>
<text transform="matrix(1 0 0 1 90.9911 681.6441)" style="fill:#454FA1; font-family:'Roboto-BoldCondensed'; font-size:19.6078px;">Ali</text>
<text transform="matrix(1 0 0 1 247.8116 651.4644)"><tspan x="0" y="0" style="fill:#ED2E38; font-family:'Roboto-BoldCondensed'; font-size:20.4px;">MAIN</tspan><tspan x="-33.2" y="24.5" style="fill:#ED2E38; font-family:'Roboto-BoldCondensed'; font-size:20.4px;">MAINDEFEND</tspan></text>
<polyline style="fill:none;stroke:#454FA1;stroke-width:0.6;stroke-miterlimit:10;" points="125.1,294.5 86.1,294.5 86.1,332.1 "/>
<polyline style="fill:none;stroke:#454FA1;stroke-width:0.6;stroke-miterlimit:10;" points="472.1,294.5 511.1,294.5 511.1,332.1 
	"/>
<line style="fill:none;stroke:#454FA1;stroke-width:0.6;stroke-miterlimit:10;" x1="86.2" y1="430.9" x2="86.2" y2="449.2"/>
<line style="fill:none;stroke:#454FA1;stroke-width:0.6;stroke-miterlimit:10;" x1="87.2" y1="516.9" x2="87.2" y2="548"/>
<line style="fill:none;stroke:#454FA1;stroke-width:0.6;stroke-miterlimit:10;" x1="299" y1="189.4" x2="299" y2="205.7"/>
<line style="fill:none;stroke:#454FA1;stroke-width:0.6;stroke-miterlimit:10;" x1="299" y1="253" x2="299" y2="269.3"/>
<g>
	<polygon style="fill:#1F333E;" points="465.9,72.9 465.9,58.7 480.2,58.7 	"/>
	<polygon style="fill:#44606D;" points="465.9,44.4 465.9,58.7 473.1,51.5 	"/>
	<polygon style="fill:#547482;" points="473.1,51.5 480.2,58.7 480.2,44.4 	"/>
	<polygon style="fill:#90C2D9;" points="473.1,37.2 480.2,44.4 480.2,30.1 	"/>
	<polygon style="fill:#2A404A;" points="465.9,58.7 480.2,58.7 473.1,51.5 	"/>
	<polygon style="fill:#6A8FA1;" points="465.9,44.4 480.2,44.4 473.1,51.5 	"/>
	<polygon style="fill:#77A1B4;" points="465.9,44.4 480.2,44.4 473.1,37.2 	"/>
	<path style="fill:#1A171B;" d="M493.7,38.5h-2.1V36h2.1V38.5z M493.7,58.6h-2.1V41.4h2.1V58.6z"/>
	<path style="fill:#1A171B;" d="M498.3,58.6V41.4h1.2l0.6,1.1c0.5-0.9,1.3-1.4,2.5-1.4c2.4,0,3.3,1.3,3.3,4v13.6h-2.1V45.1
		c0-1.3-0.4-2.2-1.7-2.2c-1.3,0-1.8,0.8-1.8,2.2v13.5H498.3z"/>
	<polygon style="fill:#1A171B;" points="512.7,48.9 516,41.4 518.3,41.4 514.4,49.7 518.6,58.6 516.3,58.6 512.7,50.6 512.7,58.6 
		510.6,58.6 510.6,34.2 512.7,34.2 	"/>
	<path style="fill:#1A171B;" d="M520.7,64.3v-1.9c0.3,0.1,0.9,0.2,1.3,0.2c1,0,1.7-0.6,1.9-2l0.4-2L521,41.4h2.1l2.2,13.4l2.2-13.4
		h2.1L526,60.8c-0.5,2.6-1.4,3.7-3.9,3.7C521.6,64.5,521,64.4,520.7,64.3"/>
	<path style="fill:#1A171B;" d="M538.8,34.1v1.8c-0.3-0.2-0.8-0.2-1.3-0.2c-1.3,0-1.7,0.6-1.7,2.1v3.7h2.5v1.8h-2.5v15.4h-2.1V43.3
		h-1.6v-1.8h1.6v-3.7c0-2.5,0.8-3.9,3.6-3.9C537.9,33.9,538.4,34,538.8,34.1"/>
	<path style="fill:#1A171B;" d="M541.2,52.9c0-2.6,1.3-4,5.6-5.3V45c0-1.3-0.5-2.1-1.7-2.1c-1.4,0-1.7,0.9-1.7,2.2v0.8h-2V45
		c0-2.3,0.8-3.9,3.7-3.9c3,0,3.7,1.6,3.7,3.9v13.6h-1.2l-0.6-1c-0.4,0.9-1.2,1.4-2.4,1.4c-2.4,0-3.5-1.3-3.5-3.9V52.9z M546.8,49.1
		c-2.9,0.9-3.5,2-3.5,3.7v2.2c0,1.3,0.4,2.1,1.8,2.1c1.3,0,1.8-0.9,1.8-2.1V49.1z"/>
	<path style="fill:#1A171B;" d="M559.8,58.6l-0.6-1.1c-0.5,0.9-1.3,1.4-2.5,1.4c-2.4,0-3.3-1.3-3.3-4v-9.9c0-2.7,0.9-4,3.3-4
		c1,0,1.9,0.5,2.3,1.2v-8.1h2.1v24.4H559.8z M559,45.2c0-1.3-0.5-2.3-1.8-2.3c-1.3,0-1.7,0.9-1.7,2.2V55c0,1.3,0.4,2.2,1.7,2.2
		c1.3,0,1.8-0.9,1.8-2.2V45.2z"/>
	<path style="fill:#1A171B;" d="M565.3,52.9c0-2.6,1.3-4,5.6-5.3V45c0-1.3-0.5-2.1-1.7-2.1c-1.4,0-1.7,0.9-1.7,2.2v0.8h-2V45
		c0-2.3,0.8-3.9,3.7-3.9c3,0,3.7,1.6,3.7,3.9v13.6h-1.2l-0.5-1c-0.4,0.9-1.2,1.4-2.4,1.4c-2.4,0-3.5-1.3-3.5-3.9V52.9z M570.9,49.1
		c-2.9,0.9-3.5,2-3.5,3.7v2.2c0,1.3,0.4,2.1,1.8,2.1c1.3,0,1.8-0.9,1.8-2.1V49.1z"/>
</g>
<rect x="206.2" y="519.8" style="fill:none;stroke:#ED2E38;stroke-width:0.6;stroke-miterlimit:10;" width="129" height="272.2"/>
<rect x="361.1" y="691.5" style="fill:none;stroke:#ED2E38;stroke-width:0.6;stroke-miterlimit:10;" width="155" height="52"/>
<polyline style="fill:none;stroke:#ED2E38;stroke-width:0.6;stroke-miterlimit:10;" points="516.1,719.7 568.1,719.7 568.1,433.5 
	522.1,433.5 "/>
<polygon style="fill:#ED2E38;" points="567.9,486.9 563.5,494 571.8,494 "/>
<line style="fill:none;stroke:#454FA1;stroke-width:0.6;stroke-miterlimit:10;" x1="434.1" y1="406.5" x2="434.1" y2="391.5"/>
<polyline style="fill:none;stroke:#454FA1;stroke-width:0.6;stroke-miterlimit:10;" points="180.1,481.5 269.1,481.5 269.1,519.8 
	"/>
<rect x="204.1" y="811.5" style="fill:none;stroke:#454FA1;stroke-width:0.6;stroke-miterlimit:10;stroke-dasharray:5.9568,5.9568;" width="339" height="45"/>
<line style="fill:none;stroke:#454FA1;stroke-width:0.6;stroke-miterlimit:10;" x1="371.1" y1="791.5" x2="371.1" y2="811.5"/>
<text transform="matrix(1 0 0 1 58.8787 405.1079)"><tspan x="0" y="0" style="fill:#454FA1; font-family:'Roboto-Condensed'; font-size:14.1176px;">Chief of Special </tspan><tspan x="21.3" y="16.9" style="fill:#454FA1; font-family:'Roboto-Condensed'; font-size:14.1176px;">Services</tspan></text>
<text transform="matrix(1 0 0 1 51.4061 492.7075)"><tspan x="0" y="0" style="fill:#454FA1; font-family:'Roboto-Condensed'; font-size:14.1176px;">Head of the Gabes </tspan><tspan x="-5.9" y="16.9" style="fill:#454FA1; font-family:'Roboto-Condensed'; font-size:14.1176px;">Special Services Unit</tspan></text>
<text transform="matrix(1 0 0 1 34.4917 574.8457)"><tspan x="0" y="0" style="fill:#454FA1; font-family:'Roboto-BoldCondensed'; font-size:18px;">WITNESSES FROM </tspan><tspan x="16.8" y="21.6" style="fill:#454FA1; font-family:'Roboto-BoldCondensed'; font-size:18px;">THE ACCUSED</tspan></text>
<text transform="matrix(1 0 0 1 68.4097 701.9092)"><tspan x="0" y="0" style="fill:#454FA1; font-family:'Roboto-Condensed'; font-size:14.1176px;">Offcer from </tspan><tspan x="-0.5" y="16.9" style="fill:#454FA1; font-family:'Roboto-Condensed'; font-size:14.1176px;">the National </tspan><tspan x="18.1" y="33.9" style="fill:#454FA1; font-family:'Roboto-Condensed'; font-size:14.1176px;">Guard</tspan></text>
<text transform="matrix(1 0 0 1 60.5811 654.3018)" style="fill:#454FA1; font-family:'Roboto-Condensed'; font-size:14.1176px;">Police offcers</text>
<text transform="matrix(1 0 0 1 393.5942 487.5898)"><tspan x="0" y="0" style="fill:#ED2E38; font-family:'Roboto-BoldCondensed'; font-size:13.8px;">These two agents transport </tspan><tspan x="26.5" y="16.6" style="fill:#ED2E38; font-family:'Roboto-BoldCondensed'; font-size:13.8px;">Kamel Matmati’s body</tspan></text>
<text transform="matrix(1 0 0 1 386.3564 566.8467)"><tspan x="0" y="0" style="fill:#454FA1; font-family:'Roboto-Condensed'; font-size:14.1176px;">Head of the Gabes </tspan><tspan x="-18.5" y="16.9" style="fill:#454FA1; font-family:'Roboto-Condensed'; font-size:14.1176px;">investigation department </tspan></text>
<text transform="matrix(1 0 0 1 375.6328 763.208)"><tspan x="0" y="0" style="fill:#454FA1; font-family:'Roboto-Condensed'; font-size:14.1176px;">Offcers from the Gabes </tspan><tspan x="-3.8" y="16.9" style="fill:#454FA1; font-family:'Roboto-Condensed'; font-size:14.1176px;">investigation department </tspan></text>
<text transform="matrix(1 0 0 1 313.373 838.1729)" style="fill:#454FA1; font-family:'Roboto-Condensed'; font-size:14.1176px;">Taxi driver/ informant (deceased) </text>
</svg>
