<?xml version="1.0" encoding="utf-8"?>
<!-- Generator: Adobe Illustrator 22.0.0, SVG Export Plug-In . SVG Version: 6.00 Build 0)  -->
<svg version="1.1" id="Layer_1" xmlns="http://www.w3.org/2000/svg" xmlns:xlink="http://www.w3.org/1999/xlink" x="0px" y="0px"
	 width="600px" height="1330px" viewBox="0 0 600 1330" style="enable-background:new 0 0 600 1330;" xml:space="preserve">
<text transform="matrix(1 0 0 1 80.0839 52.0464)" style="font-family:'Akrobat-ExtraBold'; font-size:35px;">Les différents tests de dépistage</text>
<rect x="269.2" y="72.2" style="fill:#333333;" width="61.6" height="3.5"/>
<text transform="matrix(1 0 0 1 30.5499 1284.4258)"><tspan x="0" y="0" style="fill:#333333; font-family:'Akrobat-SemiBold'; font-size:18.2px;">Source :</tspan><tspan x="54.7" y="0" style="fill:#333333; font-family:'Akrobat-Regular'; font-size:18.2px;"> Déclarations officielles et de chercheurs</tspan><tspan x="0" y="21.8" style="fill:#333333; font-family:'Akrobat-Regular'; font-size:18.2px;">à l’Institut Pasteur de Tunis</tspan></text>
<g>
	<g>
		<polygon style="fill:#1F333E;" points="438.9,1314.1 438.9,1296.6 456.4,1296.6 456.4,1296.6 		"/>
		<polygon style="fill:#44606D;" points="438.9,1279 438.9,1296.6 447.6,1287.8 		"/>
		<polygon style="fill:#547482;" points="447.6,1287.8 456.4,1296.6 456.4,1279 		"/>
		<polygon style="fill:#90C2D9;" points="447.6,1270.2 456.4,1279 456.4,1261.5 		"/>
		<polygon style="fill:#2A404A;" points="438.9,1296.6 456.4,1296.6 447.6,1287.8 		"/>
		<polygon style="fill:#6A8FA1;" points="438.9,1279 456.4,1279 447.6,1287.8 		"/>
		<polygon style="fill:#77A1B4;" points="438.9,1279 456.4,1279 447.6,1270.2 		"/>
	</g>
	<g>
		<path style="fill:#1A171B;" d="M473,1268.7v3.1h-2.6v-3.1H473z M473,1275.4v21.1h-2.5v-21.1H473z"/>
		<path style="fill:#1A171B;" d="M478.7,1296.5v-21.1h1.5l0.7,1.4c0.6-1.1,1.6-1.8,3.1-1.8c3,0,4.1,1.6,4.1,4.9v16.7h-2.5v-16.7
			c0-1.6-0.5-2.7-2.1-2.7c-1.6,0-2.2,1-2.2,2.7v16.7H478.7z"/>
		<path style="fill:#1A171B;" d="M496.3,1284.6l4.1-9.2h2.8l-4.8,10.2l5.2,10.9h-2.8l-4.5-9.9v9.9h-2.5v-30h2.5V1284.6z"/>
		<path style="fill:#1A171B;" d="M506.2,1303.5v-2.3c0.4,0.2,1.1,0.3,1.6,0.3c1.3,0,2-0.8,2.4-2.5l0.5-2.5l-4.1-21.2h2.6l2.7,16.5
			l2.7-16.5h2.6l-4.6,23.8c-0.6,3.2-1.8,4.6-4.8,4.6C507.3,1303.7,506.6,1303.6,506.2,1303.5z"/>
		<path style="fill:#1A171B;" d="M528.4,1266.4v2.2c-0.4-0.2-0.9-0.3-1.6-0.3c-1.6,0-2,0.7-2,2.5v4.6h3.1v2.2h-3.1v18.9h-2.5v-18.9
			h-1.9v-2.2h1.9v-4.6c0-3.1,0.9-4.7,4.5-4.7C527.3,1266.1,528,1266.2,528.4,1266.4z"/>
		<path style="fill:#1A171B;" d="M531.4,1289.4c0-3.3,1.6-4.9,6.9-6.6v-3.1c0-1.6-0.6-2.6-2.1-2.6c-1.7,0-2.1,1.1-2.1,2.7v1h-2.5v-1
			c0-2.8,1-4.8,4.6-4.8c3.6,0,4.6,2,4.6,4.8v16.7h-1.5l-0.7-1.3c-0.5,1.1-1.4,1.7-3,1.7c-3,0-4.3-1.6-4.3-4.8V1289.4z M538.3,1284.8
			c-3.6,1.1-4.4,2.4-4.4,4.6v2.7c0,1.6,0.5,2.6,2.2,2.6c1.6,0,2.2-1.1,2.2-2.6V1284.8z"/>
		<path style="fill:#1A171B;" d="M554.2,1296.5l-0.7-1.3c-0.6,1.1-1.6,1.7-3.1,1.7c-3,0-4.1-1.6-4.1-4.9v-12.2c0-3.3,1.1-4.9,4-4.9
			c1.3,0,2.3,0.6,2.9,1.5v-10h2.5v30H554.2z M553.2,1280c0-1.6-0.6-2.8-2.2-2.8c-1.6,0-2.1,1.1-2.1,2.7v12.2c0,1.6,0.5,2.7,2.1,2.7
			c1.6,0,2.2-1.1,2.2-2.7V1280z"/>
		<path style="fill:#1A171B;" d="M561,1289.4c0-3.3,1.6-4.9,6.9-6.6v-3.1c0-1.6-0.6-2.6-2.1-2.6c-1.7,0-2.1,1.1-2.1,2.7v1h-2.5v-1
			c0-2.8,1-4.8,4.6-4.8c3.6,0,4.6,2,4.6,4.8v16.7H569l-0.7-1.3c-0.5,1.1-1.4,1.7-3,1.7c-3,0-4.3-1.6-4.3-4.8V1289.4z M567.9,1284.8
			c-3.6,1.1-4.4,2.4-4.4,4.6v2.7c0,1.6,0.5,2.6,2.2,2.6c1.6,0,2.2-1.1,2.2-2.6V1284.8z"/>
	</g>
</g>
<text transform="matrix(1 0 0 1 241.6891 171.5234)" style="font-family:'Akrobat-ExtraBold'; font-size:25.0643px;">Test RT-PCR</text>
<path style="fill:#ED4A4A;" d="M70.7,218.3c-0.9-2.1,0.1-4.4,2.2-5.2c2.1-0.9,4.4,0.1,5.2,2.2c0.9,2.1-0.1,4.4-2.2,5.2
	C73.9,221.3,71.5,220.4,70.7,218.3z M86.9,219.7l-1.9-0.8c0.3-1.4,0.3-2.8,0-4.3l1.9-0.8c0.4-0.2,0.7-0.7,0.5-1.2l-0.9-2.2
	c-0.2-0.4-0.7-0.7-1.2-0.5l-1.9,0.8c-0.8-1.2-1.8-2.2-3-3l0.8-1.9c0.2-0.4,0-1-0.5-1.2l-2.2-0.9c-0.4-0.2-1,0-1.2,0.5l-0.8,1.9
	c-0.8-0.1-1.7-0.2-2.5-0.2c-0.2,1.3-1.2,2.3-2.5,2.5c0,0,0,0,0,0.1c0.4,0.5,0.6,1.1,0.6,1.7c0,0.3,0,0.5-0.1,0.7h0
	c3.2-1.3,7,0.2,8.3,3.4c1.3,3.2-0.2,7-3.4,8.3c-3.2,1.3-7-0.2-8.3-3.4c-0.7-1.8-0.6-3.7,0.2-5.3c-0.8,0.1-1.6,0-2.2-0.5
	c0,0,0,0-0.1,0c-0.2,1.4-1.4,2.5-2.9,2.5c-0.1,1,0,2,0.2,3l-1.9,0.8c-0.4,0.2-0.7,0.7-0.5,1.2l0.9,2.2c0.2,0.4,0.7,0.7,1.2,0.5
	l1.9-0.8c0.8,1.2,1.8,2.2,3,3l-0.8,1.9c-0.2,0.4,0,1,0.5,1.2l2.2,0.9c0.4,0.2,1,0,1.2-0.5l0.8-1.9c1.4,0.3,2.8,0.3,4.3,0l0.8,1.9
	c0.2,0.4,0.7,0.7,1.2,0.5l2.2-0.9c0.4-0.2,0.7-0.7,0.5-1.2l-0.8-1.9c1.2-0.8,2.2-1.8,3-3l1.9,0.8c0.4,0.2,1,0,1.2-0.5l0.9-2.2
	C87.6,220.4,87.4,219.9,86.9,219.7z M56,206.2h-1.2c-0.4,0-0.7-0.3-0.7-0.7v-1.3c0-0.4,0.3-0.7,0.7-0.7H56c0.2-0.9,0.5-1.8,1.1-2.5
	l-0.8-0.8c-0.3-0.3-0.3-0.8,0-1.1l0.9-0.9c0.3-0.3,0.8-0.3,1.1,0l0.8,0.8c0.8-0.5,1.6-0.9,2.5-1v-1.2c0-0.4,0.3-0.7,0.7-0.7h1.3
	c0.4,0,0.7,0.3,0.7,0.7v1.2c0.9,0.2,1.8,0.5,2.5,1.1l0.8-0.8c0.3-0.3,0.8-0.3,1.1,0l0.9,0.9c0.3,0.3,0.3,0.8,0,1.1l-0.8,0.9
	c0.5,0.8,0.9,1.6,1,2.5h1.2c0.4,0,0.7,0.3,0.7,0.7v1.3c0,0.4-0.3,0.7-0.7,0.7h-1.2c-0.2,0.9-0.5,1.8-1.1,2.5l0.8,0.8
	c0.3,0.3,0.3,0.8,0,1.1l-0.9,0.9c-0.3,0.3-0.8,0.3-1.1,0l-0.8-0.8c-0.8,0.5-1.6,0.9-2.5,1v1.2c0,0.4-0.3,0.7-0.7,0.7h-1.3
	c-0.4,0-0.7-0.3-0.7-0.7v-1.2c-0.9-0.2-1.8-0.5-2.5-1.1l-0.8,0.8c-0.3,0.3-0.8,0.3-1.1,0l-0.9-0.9c-0.3-0.3-0.3-0.8,0-1.1l0.8-0.8
	C56.5,208,56.2,207.1,56,206.2z M60.6,207.2c1.3,1.3,3.4,1.3,4.8,0c1.3-1.3,1.3-3.4,0-4.8c-1.3-1.3-3.4-1.3-4.8,0
	C59.3,203.7,59.2,205.9,60.6,207.2z"/>
<text transform="matrix(1 0 0 1 92.6071 220.4678)" style="fill:#ED4A4A; font-family:'Akrobat-SemiBold'; font-size:20.8869px;">Fonctionnement</text>
<g>
	<text transform="matrix(1 0 0 1 92.6071 246.8564)"><tspan x="0" y="0" style="fill:#333333; font-family:'Akrobat-SemiBold'; font-size:22.6772px;">Analyse génétique pour détecter la charge virale </tspan><tspan x="0" y="27.2" style="fill:#333333; font-family:'Akrobat-SemiBold'; font-size:22.6772px;">du Covid-19</tspan></text>
</g>
<text transform="matrix(1 0 0 1 92.6071 311.4414)" style="fill:#ED4A4A; font-family:'Akrobat-SemiBold'; font-size:20.8869px;">Avantages</text>
<g>
	<text transform="matrix(1 0 0 1 92.6071 338.8926)" style="fill:#333333; font-family:'Akrobat-SemiBold'; font-size:22.6772px;">Plus fiables</text>
</g>
<text transform="matrix(1 0 0 1 92.6071 481.3398)" style="fill:#ED4A4A; font-family:'Akrobat-SemiBold'; font-size:20.8869px;">Prix</text>
<g>
	<text transform="matrix(1 0 0 1 92.6071 507.5986)" style="fill:#333333; font-family:'Akrobat-SemiBold'; font-size:22.6772px;">Entre 100 et 250 dinars environ</text>
</g>
<text transform="matrix(1 0 0 1 92.6071 547.6172)" style="fill:#ED4A4A; font-family:'Akrobat-SemiBold'; font-size:20.8869px;">Capacité</text>
<g>
	<text transform="matrix(1 0 0 1 92.6071 575.0693)" style="fill:#333333; font-family:'Akrobat-SemiBold'; font-size:22.6772px;">Entre 400 et 1000 par jour (estimation)</text>
</g>
<g>
	<text transform="matrix(1 0 0 1 92.6071 625.7939)" style="fill:#333333; font-family:'Akrobat-SemiBold'; font-size:22.6772px;">10 000 tests en 2 semaines (prévisions)</text>
</g>
<path style="fill:none;stroke:#000000;stroke-width:0.5;stroke-miterlimit:10;" d="M378.1,163.4h163.8c17.2,0,31.1,14.3,31.1,31.9
	v427.2c0,17.6-13.9,31.9-31.1,31.9H58.1c-17.2,0-31.1-14.3-31.1-31.9V195.3c0-17.6,13.9-31.9,31.1-31.9h163.7"/>
<path style="fill:none;stroke:#000000;stroke-width:0.5;stroke-miterlimit:10;" d="M388,743.4h153.9c17.2,0,31.1,14.3,31.1,31.9
	v427.2c0,17.6-13.9,31.9-31.1,31.9H58.1c-17.2,0-31.1-14.3-31.1-31.9V775.3c0-17.6,13.9-31.9,31.1-31.9h157.4"/>
<g>
	<g>
		<path style="fill:#ED4A4A;" d="M53.6,465.5v15.9c0,0.8,0.7,1.6,1.6,1.6h28.6c0.8,0,1.6-0.7,1.6-1.6v-15.9c0-0.8-0.7-1.6-1.6-1.6
			H55.1C54.2,464,53.6,464.7,53.6,465.5z M83.4,479.1c-1,0-1.9,0.8-1.9,1.9H57.4c0-1-0.8-1.9-1.9-1.9v-11.4c1,0,1.9-0.8,1.9-1.9
			h24.1c0,1,0.8,1.9,1.9,1.9L83.4,479.1L83.4,479.1z"/>
		<circle style="fill:#ED4A4A;" cx="69.4" cy="473.4" r="5.7"/>
	</g>
	<g>
		<path style="fill:#ED4A4A;" d="M86.4,466.7H86v17H56.3v0.3c0,0.8,0.7,1.6,1.6,1.6h28.6c0.8,0,1.6-0.7,1.6-1.6v-15.8
			C87.9,467.3,87.2,466.7,86.4,466.7z"/>
	</g>
</g>
<g>
	<rect x="71.3" y="534.6" style="fill:#ED4A4A;" width="1" height="1.5"/>
	<rect x="78.6" y="541" style="fill:#ED4A4A;" width="1" height="1.5"/>
	<rect x="62.5" y="539.5" style="fill:#ED4A4A;" width="1" height="1.5"/>
	<rect x="69.3" y="547.3" style="fill:#ED4A4A;" width="1" height="1.5"/>
	<path style="fill:#ED4A4A;" d="M84.9,527.8H82v1h1.7l-3.1,3.1l0.7,0.7l3.1-3.1v1.7h1v-2.9C85.4,528,85.2,527.8,84.9,527.8
		C84.9,527.8,84.9,527.8,84.9,527.8z"/>
	<path style="fill:#ED4A4A;" d="M84.4,555.4l-3.1-3.1l-0.7,0.7l3.1,3.1H82v1h2.9c0.3,0,0.5-0.2,0.5-0.5c0,0,0,0,0,0v-2.9h-1V555.4z"
		/>
	<path style="fill:#ED4A4A;" d="M60.2,552.3l-3.1,3.1v-1.7h-1v2.9c0,0.3,0.2,0.5,0.5,0.5c0,0,0,0,0,0h2.9v-1h-1.7l3.1-3.1
		L60.2,552.3z"/>
	<path style="fill:#ED4A4A;" d="M59.6,528.8v-1h-2.9c-0.3,0-0.5,0.2-0.5,0.5c0,0,0,0,0,0v2.9h1v-1.7l3.1,3.1l0.7-0.7l-3.1-3.1H59.6z
		"/>
	<path style="fill:#ED4A4A;" d="M70.2,529.3c-7.3,0-13.2,5.9-13.2,13.2c0,7.3,5.9,13.2,13.2,13.2c7.3,0,13.2-5.9,13.2-13.2
		C83.3,535.2,77.4,529.3,70.2,529.3z M76,534.2h1v1h-1V534.2z M63.3,549.8h-1v-1h1V549.8z M64.8,542l-1,0.5v2.9h-2.9v-2.9l-1-0.5
		v-2.2c0-0.7,0.6-1.3,1.3-1.3c0,0,0,0,0,0h0.1c-0.5-0.6-0.5-1.5,0.1-2.1c0.6-0.5,1.5-0.5,2.1,0.1c0.5,0.6,0.5,1.4,0,2h0.1
		c0.7,0,1.3,0.6,1.3,1.3l0,0V542z M65.8,534.2h-1v-1h1V534.2z M71.6,549.8l-1,0.5v2.9h-2.9v-2.9l-1-0.5v-2.2c0-0.7,0.6-1.3,1.3-1.3
		c0,0,0,0,0,0h0.1c-0.5-0.6-0.5-1.5,0.1-2.1c0.6-0.5,1.5-0.5,2.1,0.1c0.5,0.6,0.5,1.4,0,2h0.1c0.7,0,1.3,0.6,1.3,1.3v0V549.8z
		 M73.6,537.1l-1,0.5v2.9h-2.9v-2.9l-1-0.5v-2.2c0-0.7,0.6-1.3,1.3-1.3c0,0,0,0,0,0h0.1c-0.5-0.6-0.5-1.5,0.1-2.1
		c0.6-0.5,1.5-0.5,2.1,0.1c0.5,0.6,0.5,1.4,0,2h0.1c0.7,0,1.3,0.6,1.3,1.3c0,0,0,0,0,0V537.1z M76,551.2h-1v-1h1V551.2z M79.9,543.9
		v2.9H77v-2.9l-1-0.5v-2.2c0-0.7,0.6-1.3,1.3-1.3h0h0.1c-0.5-0.6-0.5-1.5,0.1-2.1c0.6-0.5,1.5-0.5,2.1,0.1c0.5,0.6,0.5,1.4,0,2h0.1
		c0.7,0,1.3,0.6,1.3,1.3c0,0,0,0,0,0v2.2L79.9,543.9z"/>
</g>
<text transform="matrix(1 0 0 1 235.724 751.5234)" style="font-family:'Akrobat-ExtraBold'; font-size:25.0643px;">Tests rapides</text>
<path style="fill:#3688BA;" d="M74.2,798.3c-0.9-2.1,0.1-4.4,2.2-5.2c2.1-0.9,4.4,0.1,5.2,2.2c0.9,2.1-0.1,4.4-2.2,5.2
	C77.4,801.3,75,800.4,74.2,798.3z M90.4,799.7l-1.9-0.8c0.3-1.4,0.3-2.8,0-4.3l1.9-0.8c0.4-0.2,0.7-0.7,0.5-1.2l-0.9-2.2
	c-0.2-0.4-0.7-0.7-1.2-0.5l-1.9,0.8c-0.8-1.2-1.8-2.2-3-3l0.8-1.9c0.2-0.4,0-1-0.5-1.2l-2.2-0.9c-0.4-0.2-1,0-1.2,0.5l-0.8,1.9
	c-0.8-0.1-1.7-0.2-2.5-0.2c-0.2,1.3-1.2,2.3-2.5,2.5c0,0,0,0,0,0.1c0.4,0.5,0.6,1.1,0.6,1.7c0,0.3,0,0.5-0.1,0.7h0
	c3.2-1.3,7,0.2,8.3,3.4c1.3,3.2-0.2,7-3.4,8.3c-3.2,1.3-7-0.2-8.3-3.4c-0.7-1.8-0.6-3.7,0.2-5.3c-0.8,0.1-1.6,0-2.2-0.5
	c0,0,0,0-0.1,0c-0.2,1.4-1.4,2.5-2.9,2.5c-0.1,1,0,2,0.2,3l-1.9,0.8c-0.4,0.2-0.7,0.7-0.5,1.2l0.9,2.2c0.2,0.4,0.7,0.7,1.2,0.5
	l1.9-0.8c0.8,1.2,1.8,2.2,3,3l-0.8,1.9c-0.2,0.4,0,1,0.5,1.2l2.2,0.9c0.4,0.2,1,0,1.2-0.5l0.8-1.9c1.4,0.3,2.8,0.3,4.3,0l0.8,1.9
	c0.2,0.4,0.7,0.7,1.2,0.5l2.2-0.9c0.4-0.2,0.7-0.7,0.5-1.2l-0.8-1.9c1.2-0.8,2.2-1.8,3-3l1.9,0.8c0.4,0.2,1,0,1.2-0.5l0.9-2.2
	C91.1,800.4,90.9,799.9,90.4,799.7z M59.5,786.2h-1.2c-0.4,0-0.7-0.3-0.7-0.7v-1.3c0-0.4,0.3-0.7,0.7-0.7h1.2
	c0.2-0.9,0.5-1.8,1.1-2.5l-0.8-0.8c-0.3-0.3-0.3-0.8,0-1.1l0.9-0.9c0.3-0.3,0.8-0.3,1.1,0l0.8,0.8c0.8-0.5,1.6-0.9,2.5-1v-1.2
	c0-0.4,0.3-0.7,0.7-0.7h1.3c0.4,0,0.7,0.3,0.7,0.7v1.2c0.9,0.2,1.8,0.5,2.5,1.1l0.8-0.8c0.3-0.3,0.8-0.3,1.1,0l0.9,0.9
	c0.3,0.3,0.3,0.8,0,1.1l-0.8,0.9c0.5,0.8,0.9,1.6,1,2.5h1.2c0.4,0,0.7,0.3,0.7,0.7v1.3c0,0.4-0.3,0.7-0.7,0.7h-1.2
	c-0.2,0.9-0.5,1.8-1.1,2.5l0.8,0.8c0.3,0.3,0.3,0.8,0,1.1l-0.9,0.9c-0.3,0.3-0.8,0.3-1.1,0l-0.8-0.8c-0.8,0.5-1.6,0.9-2.5,1v1.2
	c0,0.4-0.3,0.7-0.7,0.7h-1.3c-0.4,0-0.7-0.3-0.7-0.7v-1.2c-0.9-0.2-1.8-0.5-2.5-1.1l-0.8,0.8c-0.3,0.3-0.8,0.3-1.1,0l-0.9-0.9
	c-0.3-0.3-0.3-0.8,0-1.1l0.8-0.8C60,788,59.7,787.1,59.5,786.2z M64.1,787.2c1.3,1.3,3.4,1.3,4.8,0c1.3-1.3,1.3-3.4,0-4.8
	c-1.3-1.3-3.4-1.3-4.8,0C62.8,783.7,62.7,785.9,64.1,787.2z"/>
<text transform="matrix(1 0 0 1 99.5863 800.4678)" style="fill:#3688BA; font-family:'Akrobat-SemiBold'; font-size:20.8869px;">Fonctionnement</text>
<g>
	<text transform="matrix(1 0 0 1 99.5863 826.8564)"><tspan x="0" y="0" style="fill:#333333; font-family:'Akrobat-SemiBold'; font-size:22.6772px;">Détection des antigènes du Covid-19 et/ou des </tspan><tspan x="0" y="27.2" style="fill:#333333; font-family:'Akrobat-SemiBold'; font-size:22.6772px;">anticorps produits en réaction</tspan></text>
</g>
<text transform="matrix(1 0 0 1 99.5863 891.4414)" style="fill:#3688BA; font-family:'Akrobat-SemiBold'; font-size:20.8869px;">Avantages</text>
<g>
	<text transform="matrix(1 0 0 1 99.5863 918.8926)"><tspan x="0" y="0" style="fill:#333333; font-family:'Akrobat-SemiBold'; font-size:22.6772px;">Peu chers, nécessitent peu de ressources humaines </tspan><tspan x="0" y="27.2" style="fill:#333333; font-family:'Akrobat-SemiBold'; font-size:22.6772px;">et techniques, résultats après quelques minutes</tspan></text>
</g>
<text transform="matrix(1 0 0 1 92.6071 377.9414)" style="fill:#ED4A4A; font-family:'Akrobat-SemiBold'; font-size:20.8869px;">Inconvénients</text>
<g>
	<text transform="matrix(1 0 0 1 92.6071 405.3926)"><tspan x="0" y="0" style="fill:#333333; font-family:'Akrobat-SemiBold'; font-size:22.6772px;">Chers, nécessitent beaucoup de ressources humaines </tspan><tspan x="0" y="27.2" style="fill:#333333; font-family:'Akrobat-SemiBold'; font-size:22.6772px;">et techniques, résultats après plusieurs heures</tspan></text>
</g>
<text transform="matrix(1 0 0 1 99.5863 981.7412)" style="fill:#3688BA; font-family:'Akrobat-SemiBold'; font-size:20.8869px;">Inconvénients</text>
<g>
	<text transform="matrix(1 0 0 1 99.5863 1009.1934)" style="fill:#333333; font-family:'Akrobat-SemiBold'; font-size:22.6772px;">Moins fiables</text>
</g>
<text transform="matrix(1 0 0 1 99.5863 1061.3398)" style="fill:#3688BA; font-family:'Akrobat-SemiBold'; font-size:20.8869px;">Prix</text>
<g>
	<text transform="matrix(1 0 0 1 99.5863 1087.5986)" style="fill:#333333; font-family:'Akrobat-SemiBold'; font-size:22.6772px;">50 dinars environ</text>
</g>
<text transform="matrix(1 0 0 1 99.5863 1127.6172)" style="fill:#3688BA; font-family:'Akrobat-SemiBold'; font-size:20.8869px;">Capacité</text>
<g>
	<text transform="matrix(1 0 0 1 99.5863 1155.0693)" style="fill:#333333; font-family:'Akrobat-SemiBold'; font-size:22.6772px;">Plusieurs milliers par jour (estimation)</text>
</g>
<g>
	<g>
		<path style="fill:#3688BA;" d="M57.1,1045.5v15.9c0,0.8,0.7,1.6,1.6,1.6h28.6c0.8,0,1.6-0.7,1.6-1.6v-15.9c0-0.8-0.7-1.6-1.6-1.6
			H58.7C57.8,1044,57.1,1044.7,57.1,1045.5z M86.9,1059.1c-1,0-1.9,0.8-1.9,1.9H60.9c0-1-0.8-1.9-1.9-1.9v-11.4c1,0,1.9-0.8,1.9-1.9
			H85c0,1,0.8,1.9,1.9,1.9L86.9,1059.1L86.9,1059.1z"/>
		<circle style="fill:#3688BA;" cx="72.9" cy="1053.4" r="5.7"/>
	</g>
	<g>
		<path style="fill:#3688BA;" d="M89.9,1046.7h-0.4v17H59.8v0.3c0,0.8,0.7,1.6,1.6,1.6h28.6c0.8,0,1.6-0.7,1.6-1.6v-15.8
			C91.4,1047.3,90.8,1046.7,89.9,1046.7z"/>
	</g>
</g>
<g>
	<rect x="74.8" y="1114.6" style="fill:#3688BA;" width="1" height="1.5"/>
	<rect x="82.1" y="1121" style="fill:#3688BA;" width="1" height="1.5"/>
	<rect x="66" y="1119.5" style="fill:#3688BA;" width="1" height="1.5"/>
	<rect x="72.8" y="1127.3" style="fill:#3688BA;" width="1" height="1.5"/>
	<path style="fill:#3688BA;" d="M88.4,1107.8h-2.9v1h1.7l-3.1,3.1l0.7,0.7l3.1-3.1v1.7h1v-2.9C88.9,1108,88.7,1107.8,88.4,1107.8
		C88.4,1107.8,88.4,1107.8,88.4,1107.8z"/>
	<path style="fill:#3688BA;" d="M87.9,1135.4l-3.1-3.1l-0.7,0.7l3.1,3.1h-1.7v1h2.9c0.3,0,0.5-0.2,0.5-0.5c0,0,0,0,0,0v-2.9h-1
		V1135.4z"/>
	<path style="fill:#3688BA;" d="M63.7,1132.3l-3.1,3.1v-1.7h-1v2.9c0,0.3,0.2,0.5,0.5,0.5c0,0,0,0,0,0h2.9v-1h-1.7l3.1-3.1
		L63.7,1132.3z"/>
	<path style="fill:#3688BA;" d="M63.1,1108.8v-1h-2.9c-0.3,0-0.5,0.2-0.5,0.5c0,0,0,0,0,0v2.9h1v-1.7l3.1,3.1l0.7-0.7l-3.1-3.1H63.1
		z"/>
	<path style="fill:#3688BA;" d="M73.7,1109.3c-7.3,0-13.2,5.9-13.2,13.2c0,7.3,5.9,13.2,13.2,13.2c7.3,0,13.2-5.9,13.2-13.2
		C86.9,1115.2,81,1109.3,73.7,1109.3z M79.5,1114.2h1v1h-1V1114.2z M66.9,1129.8h-1v-1h1V1129.8z M68.3,1122l-1,0.5v2.9h-2.9v-2.9
		l-1-0.5v-2.2c0-0.7,0.6-1.3,1.3-1.3h0h0.1c-0.5-0.6-0.5-1.5,0.1-2.1c0.6-0.5,1.5-0.5,2.1,0.1c0.5,0.6,0.5,1.4,0,2h0.1
		c0.7,0,1.3,0.6,1.3,1.3l0,0V1122z M69.3,1114.2h-1v-1h1V1114.2z M75.2,1129.8l-1,0.5v2.9h-2.9v-2.9l-1-0.5v-2.2
		c0-0.7,0.6-1.3,1.3-1.3h0h0.1c-0.5-0.6-0.5-1.5,0.1-2.1c0.6-0.5,1.5-0.5,2.1,0.1c0.5,0.6,0.5,1.4,0,2h0.1c0.7,0,1.3,0.6,1.3,1.3
		l0,0V1129.8z M77.1,1117.1l-1,0.5v2.9h-2.9v-2.9l-1-0.5v-2.2c0-0.7,0.6-1.3,1.3-1.3h0h0.1c-0.5-0.6-0.5-1.5,0.1-2.1
		c0.6-0.5,1.5-0.5,2.1,0.1c0.5,0.6,0.5,1.4,0,2h0.1c0.7,0,1.3,0.6,1.3,1.3c0,0,0,0,0,0V1117.1z M79.5,1131.2h-1v-1h1V1131.2z
		 M83.4,1123.9v2.9h-2.9v-2.9l-1-0.5v-2.2c0-0.7,0.6-1.3,1.3-1.3c0,0,0,0,0,0h0.1c-0.5-0.6-0.5-1.5,0.1-2.1c0.6-0.5,1.5-0.5,2.1,0.1
		c0.5,0.6,0.5,1.4,0,2h0.1c0.7,0,1.3,0.6,1.3,1.3c0,0,0,0,0,0v2.2L83.4,1123.9z"/>
</g>
<polygon style="fill:#ED4A4A;" points="96.2,589.3 105.7,598.8 115.3,589.3 "/>
<g>
	<text transform="matrix(1 0 0 1 97.7963 1205.7939)" style="fill:#333333; font-family:'Akrobat-SemiBold'; font-size:22.6772px;">500 000 tests (prévisions - en attente d’importation)</text>
</g>
<polygon style="fill:#3688BA;" points="101.4,1169.3 110.9,1178.8 120.5,1169.3 "/>
<g>
	<path style="fill:#3688BA;" d="M289.9,706.5c0-0.5-0.4-0.9-0.9-0.9c-0.2,0-0.4,0.1-0.6,0.2l-4.8,4.8l-2.5-2.5
		c0.6,2.5,1.8,4.8,3.3,6.9v-1.7c0-0.6,0.2-1.2,0.7-1.7l4.5-4.5C289.8,706.9,289.9,706.7,289.9,706.5z"/>
	<path style="fill:#3688BA;" d="M312.3,705.6c-0.2,0-0.4,0.1-0.6,0.2l-4.8,4.8l-4.8-4.8c-0.1-0.1-0.3-0.2-0.6-0.2
		c-0.5,0-0.9,0.4-0.9,0.9c0,0.2,0.1,0.4,0.2,0.6l4.5,4.5c0.4,0.4,0.7,1,0.7,1.7v4c0,0.4,0.3,0.8,0.8,0.8c0.4,0,0.8-0.3,0.8-0.8v-4
		c0-0.6,0.2-1.2,0.7-1.7l4.5-4.5c0.1-0.1,0.2-0.3,0.2-0.6C313.2,706,312.8,705.6,312.3,705.6z"/>
	<path style="fill:#3688BA;" d="M297.8,700.7c0.1,0.1,0.3,0.2,0.6,0.2c0.5,0,0.9-0.4,0.9-0.9c0-0.2-0.1-0.4-0.2-0.6l-4.5-4.5
		c-0.4-0.4-0.7-1-0.7-1.7v-4c0-0.4-0.3-0.8-0.8-0.8c-0.4,0-0.8,0.3-0.8,0.8v4c0,0.6-0.2,1.2-0.7,1.7l-4.5,4.5
		c-0.1,0.1-0.2,0.3-0.2,0.6c0,0.5,0.4,0.9,0.9,0.9c0.2,0,0.4-0.1,0.6-0.2l4.8-4.8L297.8,700.7z"/>
	<path style="fill:#3688BA;" d="M317.7,695.2l-1.1,1.1c-0.1,0.1-0.2,0.3-0.2,0.6v4c0,1.3-1,2.3-2.3,2.3s-2.3-1-2.3-2.3v-4
		c0-0.2-0.1-0.4-0.2-0.6l-4.5-4.5c-0.4-0.4-0.7-1-0.7-1.7c0-1.4,1.1-2.5,2.5-2.5c0.6,0,1.2,0.2,1.7,0.7l3.7,3.7l1.1-1.1
		c-3.6-4.4-9-7.2-15.1-7.2c-10.7,0-19.5,8.7-19.5,19.5c0,0.7,0,1.4,0.1,2.1l3,3l3.7-3.7c0.4-0.4,1-0.7,1.7-0.7
		c1.4,0,2.5,1.1,2.5,2.5c0,0.6-0.2,1.2-0.7,1.7l-4.5,4.5c-0.1,0.1-0.2,0.3-0.2,0.6v3.5c3.5,3.7,8.5,6,14,6
		c10.7,0,19.5-8.7,19.5-19.5C319.5,700.4,318.9,697.6,317.7,695.2z M305.2,691.8l5.5,5.5l-1.1,1.1l-5.5-5.5l-0.8-0.8l1.1-1.1
		L305.2,691.8z M303.7,698l-1.1,1.1l-0.8-0.8l-5.5-5.5l1.1-1.1l5.5,5.5L303.7,698z M302.4,685.5c0.5,0.1,1.1,0.2,1.6,0.3l-0.3,1.5
		c-0.5-0.1-1-0.2-1.5-0.3L302.4,685.5z M300.8,685.3l-0.1,1.6c-0.5,0-1,0-1.5,0l-0.1-1.6C299.7,685.3,300.2,685.3,300.8,685.3z
		 M297.5,685.5l0.2,1.5c-0.5,0.1-1,0.2-1.5,0.3l-0.4-1.5C296.5,685.7,297,685.6,297.5,685.5z M283.4,699.1l-1.1-1.1l0.8-0.8l5.5-5.5
		l1.1,1.1l-5.5,5.5L283.4,699.1z M289.3,701.8c-0.4,0.4-1,0.7-1.7,0.7c-1.4,0-2.5-1.1-2.5-2.5c0-0.6,0.2-1.2,0.7-1.7l4.5-4.5
		c0.1-0.1,0.2-0.3,0.2-0.6v-4c0-1.3,1-2.3,2.3-2.3c1.3,0,2.3,1,2.3,2.3v4c0,0.2,0.1,0.4,0.2,0.6l4.5,4.5c0.4,0.4,0.7,1,0.7,1.7
		c0,1.4-1.1,2.5-2.5,2.5c-0.6,0-1.2-0.2-1.7-0.7l-3.7-3.7L289.3,701.8z M287,713.6l5.5-5.5l0.8-0.8l1.1,1.1l-0.8,0.8l-5.5,5.5
		L287,713.6z M300,721.2c-4.1,0-8.2-1.4-11.4-4.1l1-1.2c2.9,2.4,6.6,3.7,10.4,3.7V721.2z M301.6,721.1l-0.1-1.6c0.5,0,1-0.1,1.5-0.2
		l0.3,1.5C302.7,721,302.2,721,301.6,721.1z M302.6,714.7l-5.5-5.5l-0.8-0.8l1.1-1.1l0.8,0.8l5.5,5.5L302.6,714.7z M309.4,713.2v4
		c0,1.3-1,2.3-2.3,2.3c-1.3,0-2.3-1-2.3-2.3v-4c0-0.2-0.1-0.4-0.2-0.6l-4.5-4.5c-0.4-0.4-0.7-1-0.7-1.7c0-1.4,1.1-2.5,2.5-2.5
		c0.6,0,1.2,0.2,1.7,0.7l3.7,3.7l3.7-3.7c0.4-0.4,1-0.7,1.7-0.7c1.4,0,2.5,1.1,2.5,2.5c0,0.6-0.2,1.2-0.7,1.7l-4.5,4.5
		C309.4,712.8,309.4,713,309.4,713.2z M316.9,709.3l-5.5,5.5l-1.1-1.1l5.5-5.5l0.8-0.8l1.1,1.1L316.9,709.3z"/>
	<path style="fill:#3688BA;" d="M309.3,689.4c-0.1-0.1-0.3-0.2-0.6-0.2c-0.5,0-0.9,0.4-0.9,0.9c0,0.2,0.1,0.4,0.2,0.6l4.5,4.5
		c0.4,0.4,0.7,1,0.7,1.7v4c0,0.4,0.3,0.8,0.8,0.8s0.8-0.3,0.8-0.8v-4c0-0.6,0.2-1.2,0.7-1.7l1.5-1.5c-0.3-0.5-0.6-1-0.9-1.5l-2,2
		L309.3,689.4z"/>
	<path style="fill:#3688BA;" d="M300,680.7c-12.5,0-22.6,10.1-22.6,22.6c0,12.5,10.1,22.6,22.6,22.6s22.6-10.1,22.6-22.6
		C322.6,690.8,312.5,680.7,300,680.7z M300,724.3c-11.6,0-21-9.4-21-21c0-11.6,9.4-21,21-21s21,9.4,21,21
		C321,714.8,311.6,724.3,300,724.3z"/>
</g>
<g>
	<path style="fill:#ED4A4A;" d="M299.1,127.4l-7.2-7.2c-0.5,0.6-0.9,1.3-1.2,2l6.3,6.3C297.8,128.2,298.5,127.9,299.1,127.4z"/>
	<path style="fill:#ED4A4A;" d="M301.3,124.3l-6.3-6.3c-0.8,0.3-1.5,0.6-2.1,1.1l7.2,7.2C300.7,125.7,301.1,125,301.3,124.3z"/>
	<path style="fill:#ED4A4A;" d="M287,128.8c0.3,0,0.6,0,0.9,0.1l0.6,0c-0.2-3.8,0.1-7.6,2.6-10.2c2.8-2.8,6.9-3.1,11.1-3.1l0-1
		c0-0.2,0-0.3,0-0.5c-4.4,0-8.9,0.3-12.1,3.4C286.9,120.6,286.8,124.7,287,128.8z"/>
	<path style="fill:#ED4A4A;" d="M302.2,117.2c-1.9,0-3.8,0-5.4,0.4l5,5C302.2,120.9,302.2,119.1,302.2,117.2z"/>
	<path style="fill:#ED4A4A;" d="M306.7,114.2l0,0.9c0,0.2,0,0.3,0,0.5c4.3,0.1,8.3-0.2,11.2-2.5l-1-1
		C314.4,114.1,310.8,114.3,306.7,114.2z"/>
	<path style="fill:#ED4A4A;" d="M306.8,108.3c-0.2,1.4-0.2,2.9-0.1,4.4c1.6,0,3.1,0,4.5-0.1L306.8,108.3z"/>
	<path style="fill:#ED4A4A;" d="M313,112.3c0.8-0.2,1.6-0.5,2.3-0.9l-7.2-7.2c-0.4,0.7-0.7,1.4-0.9,2.3L313,112.3z"/>
	<path style="fill:#ED4A4A;" d="M290,129c1.8,0.1,3.6,0.2,5.2-0.1l-5-5C289.9,125.5,289.9,127.2,290,129z"/>
	<path style="fill:#ED4A4A;" d="M287.7,133.4c0.3,4.3,0.2,8.1-2,10.8l1,1c2.7-3.1,2.7-7.3,2.4-11.7
		C288.6,133.5,288.1,133.4,287.7,133.4z"/>
	<path style="fill:#ED4A4A;" d="M286.1,133.3c-1.6-0.1-3-0.2-4.3-0.1l4.5,4.5C286.3,136.3,286.2,134.9,286.1,133.3z"/>
	<path style="fill:#ED4A4A;" d="M279.8,133.4c-0.9,0.2-1.7,0.4-2.4,0.8l7.8,7.8c0.4-0.7,0.6-1.5,0.8-2.4L279.8,133.4z"/>
	<path style="fill:#ED4A4A;" d="M301.8,129c3.3-3.3,3.5-8.1,3.4-12.6v0c0-0.4,0-0.8,0-1.2l-0.1-1.8c-0.1-4.4,0-8.2,2.2-10.9l-1-1
		c-2.6,3-2.7,7.3-2.6,11.8c0,0.4,0,0.9,0,1.3l0,1.7c0.1,4.3-0.1,8.8-3,11.7c-2.8,2.8-7.2,2.8-11.3,2.5c-0.3,0-0.7,0-1-0.1l-0.6,0
		c-0.5,0-0.9-0.1-1.4-0.1c-4.6-0.3-8.9-0.4-12.2,2.4l1,1c2.9-2.4,6.9-2.3,11.5-2l0.9,0.1c0.7,0.1,1.4,0.1,2.1,0.2
		C294.1,132.3,298.6,132.3,301.8,129z"/>
</g>
<g>
	<path style="fill:#ED4A4A;" d="M323.4,132c0-0.2-0.1-0.5-0.2-0.7c-0.2-0.8-0.6-1.5-1.1-2c-0.2-0.2-0.3-0.3-0.5-0.5
		c-0.5-0.5-1.1-0.8-1.8-1c-0.2-0.1-0.5-0.1-0.7-0.2c-0.3-0.1-0.6-0.1-0.9-0.1c-0.3,0-0.7,0-1,0.1c-0.2,0-0.5,0.1-0.7,0.2
		c-0.8,0.2-1.4,0.7-2,1.2c-0.2,0.2-0.3,0.3-0.5,0.5c-0.3,0.4-0.6,0.9-0.8,1.4c-0.1,0.2-0.1,0.4-0.2,0.7c-0.1,0.4-0.1,0.8-0.1,1.2
		c0,0.3,0,0.6,0.1,0.9c0,0.2,0.1,0.5,0.2,0.7c0.2,0.6,0.5,1.2,1,1.8c0.2,0.2,0.3,0.3,0.5,0.5c0.5,0.4,1.1,0.8,1.7,1
		c0.2,0.1,0.4,0.1,0.7,0.2c0.4,0.1,0.8,0.1,1.1,0.1c0.4,0,0.8,0,1.1-0.1c0.2,0,0.5-0.1,0.7-0.2c0.7-0.3,1.4-0.7,1.9-1.2
		c0.2-0.2,0.3-0.4,0.5-0.6c0.4-0.5,0.7-1.1,0.8-1.7c0.1-0.2,0.1-0.5,0.2-0.7c0-0.2,0.1-0.5,0.1-0.7
		C323.4,132.5,323.4,132.3,323.4,132z M315,133.3c-0.2,0-0.4-0.2-0.4-0.4c0-0.2,0.2-0.4,0.4-0.4s0.4,0.2,0.4,0.4
		C315.4,133.1,315.2,133.3,315,133.3z M315.4,130.3c0-0.3,0.3-0.6,0.6-0.6c0.3,0,0.6,0.3,0.6,0.6c0,0.3-0.3,0.6-0.6,0.6
		C315.7,130.9,315.4,130.6,315.4,130.3z M316.9,136.2c-0.5,0-0.9-0.4-0.9-0.9c0-0.5,0.4-0.9,0.9-0.9c0.5,0,0.9,0.4,0.9,0.9
		C317.8,135.8,317.4,136.2,316.9,136.2z M318.4,133.6c-0.3,0-0.6-0.3-0.6-0.6c0-0.3,0.3-0.6,0.6-0.6c0.3,0,0.6,0.3,0.6,0.6
		C319,133.3,318.7,133.6,318.4,133.6z M319.9,131.5c-0.5,0-0.9-0.4-0.9-0.9c0-0.5,0.4-0.9,0.9-0.9c0.5,0,0.9,0.4,0.9,0.9
		C320.8,131.1,320.4,131.5,319.9,131.5z M320.5,134.2c0-0.5,0.4-0.9,0.9-0.9c0.5,0,0.9,0.4,0.9,0.9c0,0.5-0.4,0.9-0.9,0.9
		C320.9,135.1,320.5,134.7,320.5,134.2z"/>
</g>
<rect x="317.9" y="126.7" transform="matrix(0.9502 -0.3115 0.3115 0.9502 -23.8671 105.465)" style="fill:#ED4A4A;" width="0.7" height="1.6"/>
<rect x="317.9" y="128.1" transform="matrix(0.8327 -0.5537 0.5537 0.8327 -18.1098 197.7436)" style="fill:#ED4A4A;" width="0.7" height="1.6"/>
<rect x="317.9" y="130.4" transform="matrix(0.1746 -0.9846 0.9846 0.1746 133.4515 421.6069)" style="fill:#ED4A4A;" width="0.7" height="1.6"/>
<rect x="317.4" y="133.9" transform="matrix(0.9325 -0.3612 0.3612 0.9325 -27.0143 123.9969)" style="fill:#ED4A4A;" width="1.6" height="0.7"/>
<g>
	<g>
		<g>
			<g>
				<g>
					<path style="fill:#ED4A4A;" d="M324.2,133.5c0,0,0,0.1,0,0.3c0,0.1,0,0.2,0,0.3c0,0.1-0.1,0.2-0.1,0.3c0,0.1,0,0.2-0.1,0.3
						c0,0.1-0.1,0.2-0.1,0.2c-0.1,0.1-0.1,0.2-0.1,0.2l1.8,0.8c0,0,0-0.1,0.1-0.3c0-0.1,0.1-0.2,0.1-0.3c0-0.1,0.1-0.3,0.1-0.4
						c0-0.1,0.1-0.3,0.1-0.4c0-0.1,0-0.2,0.1-0.3c0-0.2,0.1-0.3,0.1-0.3L324.2,133.5z"/>
				</g>
				<g>
					<path style="fill:#ED4A4A;" d="M324.6,135.5c-0.3-0.1-0.4-0.3-0.6-0.5c-0.1-0.2-0.1-0.4-0.1-0.7c0-0.1,0.1-0.2,0.2-0.3
						c0.1-0.1,0.2-0.2,0.3-0.2c0.2-0.1,0.5-0.2,0.7-0.2c0.3,0,0.5,0.2,0.7,0.4c0.1,0.1,0.1,0.2,0.2,0.4c0,0.1,0,0.3,0,0.4
						c-0.1,0.3-0.3,0.5-0.5,0.6C325.2,135.6,324.9,135.6,324.6,135.5z"/>
				</g>
			</g>
		</g>
		<g>
			<g>
				<g>
					<path style="fill:#ED4A4A;" d="M323,136.4c0,0-0.1,0.1-0.2,0.2c-0.1,0.1-0.2,0.3-0.4,0.4c-0.2,0.1-0.3,0.3-0.4,0.4
						c-0.1,0.1-0.2,0.2-0.2,0.2l1.2,1.6c0,0,0.1-0.1,0.3-0.2c0.2-0.1,0.4-0.3,0.6-0.5c0.2-0.2,0.4-0.4,0.5-0.6
						c0.1-0.2,0.2-0.3,0.2-0.3L323,136.4z"/>
				</g>
				<g>
					<path style="fill:#ED4A4A;" d="M322.4,138.4c-0.2-0.2-0.2-0.5-0.2-0.7c0-0.2,0.1-0.5,0.2-0.6c0.2-0.2,0.4-0.2,0.6-0.2
						c0.2,0,0.5,0.1,0.7,0.2c0.2,0.2,0.4,0.4,0.4,0.7c0,0.3-0.1,0.5-0.3,0.8c-0.2,0.2-0.5,0.3-0.8,0.3
						C322.8,138.7,322.6,138.6,322.4,138.4z"/>
				</g>
			</g>
		</g>
		<g>
			<g>
				<g>
					<path style="fill:#ED4A4A;" d="M320.5,138.3c0,0-0.1,0-0.2,0.1c-0.1,0-0.2,0.1-0.2,0.1c-0.1,0-0.2,0.1-0.3,0.1
						c-0.1,0-0.2,0.1-0.3,0.1c-0.1,0-0.2,0-0.3,0c-0.2,0-0.3,0-0.3,0l0.2,2c0,0,0.1,0,0.3-0.1c0.1,0,0.2,0,0.3-0.1
						c0.1,0,0.3-0.1,0.4-0.1c0.1,0,0.3-0.1,0.4-0.1c0.1,0,0.2-0.1,0.3-0.1c0.2-0.1,0.3-0.1,0.3-0.1L320.5,138.3z"/>
				</g>
				<g>
					<path style="fill:#ED4A4A;" d="M319.1,139.7c0-0.3,0-0.5,0.2-0.7c0.1-0.1,0.1-0.2,0.2-0.3c0.1-0.1,0.2-0.1,0.3-0.2
						c0.2,0,0.4,0,0.7,0.1c0.2,0.1,0.4,0.3,0.5,0.6c0.1,0.3,0.1,0.5,0,0.8c-0.1,0.2-0.3,0.4-0.6,0.5c-0.1,0-0.3,0-0.4,0
						c-0.1,0-0.3-0.1-0.4-0.2C319.2,140.2,319.1,140,319.1,139.7z"/>
				</g>
			</g>
		</g>
		<g>
			<g>
				<g>
					<path style="fill:#ED4A4A;" d="M317.5,138.7c0,0-0.1,0-0.3,0c-0.1,0-0.2,0-0.3,0c-0.1,0-0.2-0.1-0.3-0.1c-0.1,0-0.2,0-0.3-0.1
						c-0.1,0-0.2-0.1-0.2-0.1c-0.1-0.1-0.2-0.1-0.2-0.1l-0.8,1.8c0,0,0.1,0,0.3,0.1c0.1,0,0.2,0.1,0.3,0.1c0.1,0,0.3,0.1,0.4,0.1
						c0.1,0,0.3,0.1,0.4,0.1c0.1,0,0.2,0,0.3,0.1c0.2,0,0.3,0.1,0.3,0.1L317.5,138.7z"/>
				</g>
				<g>
					<path style="fill:#ED4A4A;" d="M315.5,139.2c0.1-0.3,0.3-0.4,0.5-0.6c0.2-0.1,0.4-0.1,0.7-0.1c0.1,0,0.2,0.1,0.3,0.2
						c0.1,0.1,0.2,0.2,0.2,0.3c0.1,0.2,0.2,0.5,0.2,0.7c0,0.3-0.2,0.5-0.4,0.7c-0.1,0.1-0.2,0.1-0.4,0.2c-0.1,0-0.3,0-0.4,0
						c-0.3-0.1-0.5-0.3-0.6-0.5C315.4,139.7,315.4,139.5,315.5,139.2z"/>
				</g>
			</g>
		</g>
		<g>
			<g>
				<g>
					<path style="fill:#ED4A4A;" d="M314.6,137.6c0,0-0.1-0.1-0.2-0.2c-0.1-0.1-0.3-0.2-0.4-0.4c-0.1-0.2-0.3-0.3-0.4-0.4
						c-0.1-0.1-0.2-0.2-0.2-0.2l-1.6,1.2c0,0,0.1,0.1,0.2,0.3c0.1,0.2,0.3,0.4,0.5,0.6c0.2,0.2,0.4,0.4,0.6,0.5
						c0.2,0.1,0.3,0.2,0.3,0.2L314.6,137.6z"/>
				</g>
				<g>
					<path style="fill:#ED4A4A;" d="M312.6,137c0.2-0.2,0.5-0.2,0.7-0.2c0.2,0,0.5,0.1,0.6,0.2c0.2,0.2,0.2,0.4,0.2,0.6
						c0,0.2-0.1,0.5-0.2,0.7c-0.2,0.2-0.4,0.4-0.7,0.4c-0.3,0-0.5-0.1-0.8-0.3c-0.2-0.2-0.3-0.5-0.3-0.8
						C312.3,137.4,312.4,137.2,312.6,137z"/>
				</g>
			</g>
		</g>
		<g>
			<g>
				<g>
					<path style="fill:#ED4A4A;" d="M312.7,135.1c0,0,0-0.1-0.1-0.2c0-0.1-0.1-0.2-0.1-0.2c0-0.1-0.1-0.2-0.1-0.3
						c0-0.1-0.1-0.2-0.1-0.3c0-0.1,0-0.2,0-0.3c0-0.2,0-0.3,0-0.3l-2,0.2c0,0,0,0.1,0.1,0.3c0,0.1,0,0.2,0.1,0.3
						c0,0.1,0.1,0.3,0.1,0.4c0,0.1,0.1,0.3,0.1,0.4c0,0.1,0.1,0.2,0.1,0.3c0.1,0.2,0.1,0.3,0.1,0.3L312.7,135.1z"/>
				</g>
				<g>
					<path style="fill:#ED4A4A;" d="M311.3,133.6c0.3,0,0.5,0,0.7,0.2c0.1,0.1,0.2,0.1,0.3,0.2c0.1,0.1,0.1,0.2,0.2,0.3
						c0,0.2,0,0.4-0.1,0.7c-0.1,0.2-0.3,0.4-0.6,0.5c-0.3,0.1-0.5,0.1-0.8,0c-0.2-0.1-0.4-0.3-0.5-0.6c0-0.1,0-0.3,0-0.4
						c0-0.1,0.1-0.3,0.2-0.4C310.8,133.8,311,133.7,311.3,133.6z"/>
				</g>
			</g>
		</g>
		<g>
			<g>
				<g>
					<path style="fill:#ED4A4A;" d="M312.2,132c0,0,0-0.1,0-0.3c0-0.1,0-0.2,0-0.3c0-0.1,0.1-0.2,0.1-0.3c0-0.1,0-0.2,0.1-0.3
						c0-0.1,0.1-0.2,0.1-0.2c0.1-0.1,0.1-0.2,0.1-0.2l-1.8-0.8c0,0,0,0.1-0.1,0.3c0,0.1-0.1,0.2-0.1,0.3c0,0.1-0.1,0.3-0.1,0.4
						c0,0.1-0.1,0.3-0.1,0.4c0,0.1,0,0.2-0.1,0.3c0,0.2-0.1,0.3-0.1,0.3L312.2,132z"/>
				</g>
				<g>
					<path style="fill:#ED4A4A;" d="M311.8,130.1c0.3,0.1,0.4,0.3,0.6,0.5c0.1,0.2,0.1,0.4,0.1,0.7c0,0.1-0.1,0.2-0.2,0.3
						c-0.1,0.1-0.2,0.2-0.3,0.2c-0.2,0.1-0.5,0.2-0.7,0.2c-0.3,0-0.5-0.2-0.7-0.4c-0.1-0.1-0.1-0.2-0.2-0.4c0-0.1,0-0.3,0-0.4
						c0.1-0.3,0.3-0.5,0.5-0.6C311.2,130,311.5,130,311.8,130.1z"/>
				</g>
			</g>
		</g>
		<g>
			<g>
				<g>
					<path style="fill:#ED4A4A;" d="M313.4,129.2c0,0,0.1-0.1,0.2-0.2c0.1-0.1,0.2-0.3,0.4-0.4c0.2-0.1,0.3-0.3,0.4-0.4
						c0.1-0.1,0.2-0.2,0.2-0.2l-1.2-1.6c0,0-0.1,0.1-0.3,0.2c-0.2,0.1-0.4,0.3-0.6,0.5c-0.2,0.2-0.4,0.4-0.5,0.6
						c-0.1,0.2-0.2,0.3-0.2,0.3L313.4,129.2z"/>
				</g>
				<g>
					<path style="fill:#ED4A4A;" d="M314,127.2c0.2,0.2,0.2,0.5,0.2,0.7c0,0.2-0.1,0.5-0.2,0.6c-0.2,0.2-0.4,0.2-0.6,0.2
						c-0.2,0-0.5-0.1-0.7-0.2c-0.2-0.2-0.4-0.4-0.4-0.7c0-0.3,0.1-0.5,0.3-0.8c0.2-0.2,0.5-0.3,0.8-0.3
						C313.6,126.9,313.8,127,314,127.2z"/>
				</g>
			</g>
		</g>
		<g>
			<g>
				<g>
					<path style="fill:#ED4A4A;" d="M315.9,127.2c0,0,0.1,0,0.2-0.1c0.1,0,0.2-0.1,0.2-0.1c0.1,0,0.2-0.1,0.3-0.1
						c0.1,0,0.2-0.1,0.3-0.1c0.1,0,0.2,0,0.3,0c0.2,0,0.3,0,0.3,0l-0.2-2c0,0-0.1,0-0.3,0.1c-0.1,0-0.2,0-0.3,0.1
						c-0.1,0-0.3,0.1-0.4,0.1c-0.1,0-0.3,0.1-0.4,0.1c-0.1,0-0.2,0.1-0.3,0.1c-0.2,0.1-0.3,0.1-0.3,0.1L315.9,127.2z"/>
				</g>
				<g>
					<path style="fill:#ED4A4A;" d="M317.3,125.8c0,0.3,0,0.5-0.2,0.7c-0.1,0.1-0.1,0.2-0.2,0.3c-0.1,0.1-0.2,0.1-0.3,0.2
						c-0.2,0-0.4,0-0.7-0.1c-0.2-0.1-0.4-0.3-0.5-0.6c-0.1-0.3-0.1-0.5,0-0.8c0.1-0.2,0.3-0.4,0.6-0.5c0.1,0,0.3,0,0.4,0
						c0.1,0,0.3,0.1,0.4,0.2C317.2,125.3,317.3,125.6,317.3,125.8z"/>
				</g>
			</g>
		</g>
		<g>
			<g>
				<g>
					<path style="fill:#ED4A4A;" d="M318.9,126.8c0,0,0.1,0,0.3,0c0.1,0,0.2,0,0.3,0c0.1,0,0.2,0.1,0.3,0.1c0.1,0,0.2,0,0.3,0.1
						c0.1,0,0.2,0.1,0.2,0.1c0.1,0.1,0.2,0.1,0.2,0.1l0.8-1.8c0,0-0.1,0-0.3-0.1c-0.1,0-0.2-0.1-0.3-0.1c-0.1,0-0.3-0.1-0.4-0.1
						c-0.1,0-0.3-0.1-0.4-0.1c-0.1,0-0.2,0-0.3-0.1c-0.2,0-0.3-0.1-0.3-0.1L318.9,126.8z"/>
				</g>
				<g>
					<path style="fill:#ED4A4A;" d="M320.9,126.3c-0.1,0.3-0.3,0.4-0.5,0.6c-0.2,0.1-0.4,0.1-0.7,0.1c-0.1,0-0.2-0.1-0.3-0.2
						c-0.1-0.1-0.2-0.2-0.2-0.3c-0.1-0.2-0.2-0.5-0.2-0.7c0-0.3,0.2-0.5,0.4-0.7c0.1-0.1,0.2-0.1,0.4-0.2c0.1,0,0.3,0,0.4,0
						c0.3,0.1,0.5,0.3,0.6,0.5C321,125.8,321,126.1,320.9,126.3z"/>
				</g>
			</g>
		</g>
		<g>
			<g>
				<g>
					<path style="fill:#ED4A4A;" d="M321.8,128c0,0,0.1,0.1,0.2,0.2c0.1,0.1,0.3,0.2,0.4,0.4c0.1,0.2,0.3,0.3,0.4,0.4
						c0.1,0.1,0.2,0.2,0.2,0.2l1.6-1.2c0,0-0.1-0.1-0.2-0.3c-0.1-0.2-0.3-0.4-0.5-0.6c-0.2-0.2-0.4-0.4-0.6-0.5
						c-0.2-0.1-0.3-0.2-0.3-0.2L321.8,128z"/>
				</g>
				<g>
					<path style="fill:#ED4A4A;" d="M323.8,128.6c-0.2,0.2-0.5,0.2-0.7,0.2c-0.2,0-0.5-0.1-0.6-0.2c-0.2-0.2-0.2-0.4-0.2-0.6
						c0-0.2,0.1-0.5,0.2-0.7c0.2-0.2,0.4-0.4,0.7-0.4c0.3,0,0.5,0.1,0.8,0.3c0.2,0.2,0.3,0.5,0.3,0.8
						C324.1,128.2,324,128.4,323.8,128.6z"/>
				</g>
			</g>
		</g>
		<g>
			<g>
				<g>
					<path style="fill:#ED4A4A;" d="M323.7,130.4c0,0,0,0.1,0.1,0.2c0,0.1,0.1,0.2,0.1,0.2c0,0.1,0.1,0.2,0.1,0.3
						c0,0.1,0.1,0.2,0.1,0.3c0,0.1,0,0.2,0,0.3c0,0.2,0,0.3,0,0.3l2-0.2c0,0,0-0.1-0.1-0.3c0-0.1,0-0.2-0.1-0.3
						c0-0.1-0.1-0.3-0.1-0.4c0-0.1-0.1-0.3-0.1-0.4c0-0.1-0.1-0.2-0.1-0.3c-0.1-0.2-0.1-0.3-0.1-0.3L323.7,130.4z"/>
				</g>
				<g>
					<path style="fill:#ED4A4A;" d="M325.1,131.9c-0.3,0-0.5,0-0.7-0.2c-0.1-0.1-0.2-0.1-0.3-0.2c-0.1-0.1-0.1-0.2-0.2-0.3
						c0-0.2,0-0.4,0.1-0.7c0.1-0.2,0.3-0.4,0.6-0.5c0.3-0.1,0.5-0.1,0.8,0c0.2,0.1,0.4,0.3,0.5,0.6c0,0.1,0,0.3,0,0.4
						c0,0.1-0.1,0.3-0.2,0.4C325.6,131.7,325.4,131.9,325.1,131.9z"/>
				</g>
			</g>
		</g>
	</g>
</g>
<rect x="317.4" y="137.9" transform="matrix(0.1924 -0.9813 0.9813 0.1924 121.2733 423.9356)" style="fill:#ED4A4A;" width="1.6" height="0.7"/>
<rect x="317.4" y="136.4" transform="matrix(0.644 -0.765 0.765 0.644 8.6873 292.0961)" style="fill:#ED4A4A;" width="1.6" height="0.7"/>
<rect x="317.9" y="137.5" transform="matrix(0.9707 -0.2405 0.2405 0.9707 -23.9182 80.5818)" style="fill:#ED4A4A;" width="0.7" height="1.6"/>
<rect x="317.9" y="135.8" transform="matrix(0.8491 -0.5283 0.5283 0.8491 -24.1049 188.7069)" style="fill:#ED4A4A;" width="0.7" height="1.6"/>
<rect x="317.4" y="126.9" transform="matrix(0.3535 -0.9354 0.9354 0.3535 86.6622 379.9313)" style="fill:#ED4A4A;" width="1.6" height="0.7"/>
<rect x="317.9" y="133.3" transform="matrix(0.4122 -0.9111 0.9111 0.4122 64.8702 368.7286)" style="fill:#ED4A4A;" width="0.7" height="1.6"/>
<rect x="317.4" y="131.1" transform="matrix(0.9275 -0.3738 0.3738 0.9275 -26.0754 128.4744)" style="fill:#ED4A4A;" width="1.6" height="0.7"/>
<rect x="317.4" y="128.3" transform="matrix(0.7044 -0.7098 0.7098 0.7044 2.7312 263.8927)" style="fill:#ED4A4A;" width="1.6" height="0.7"/>
<path style="fill:#ED4A4A;" d="M323.4,133.4h-11.6v-1.2H324c0.3,0,0.6,0.3,0.6,0.6"/>
<path style="fill:#ED4A4A;" d="M324.3,143.2h-12.2c-2.6,0-4.6-2.1-4.6-4.6v-12.2c0-2.6,2.1-4.6,4.6-4.6h12.2c2.6,0,4.6,2.1,4.6,4.6
	v12.2C328.9,141.2,326.8,143.2,324.3,143.2z M312.1,123c-1.9,0-3.4,1.5-3.4,3.4v12.2c0,1.9,1.5,3.4,3.4,3.4h12.2
	c1.9,0,3.4-1.5,3.4-3.4v-12.2c0-1.9-1.5-3.4-3.4-3.4H312.1z"/>
<g>
	<path style="fill:#ED4A4A;" d="M70.8,291c-7.7,0-14,6.3-14,14c0,7.7,6.3,14,14,14s14-6.3,14-14C84.8,297.3,78.5,291,70.8,291z
		 M76.5,307h-3.8v3.8c0,1.1-0.9,2-2,2s-2-0.9-2-2V307H65c-1.1,0-2-0.9-2-2c0-1.1,0.9-2,2-2h3.8v-3.8c0-1.1,0.9-2,2-2
		c1.1,0,2,0.9,2,2v3.8h3.8c1.1,0,2,0.9,2,2C78.6,306.1,77.6,307,76.5,307z"/>
</g>
<g>
	<path style="fill:#ED4A4A;" d="M70.8,355.5c-7.7,0-14,6.3-14,14c0,7.7,6.3,14,14,14s14-6.3,14-14C84.8,361.7,78.5,355.5,70.8,355.5
		z M68.7,371.4H65c-1.1,0-2-0.9-2-2c0-1.1,0.9-2,2-2h3.8h4h3.8c1.1,0,2,0.9,2,2c0,1.1-0.9,2-2,2h-3.8H68.7z"/>
</g>
<g>
	<path style="fill:#3688BA;" d="M74.3,871c-7.7,0-14,6.3-14,14s6.3,14,14,14s14-6.3,14-14S82,871,74.3,871z M80.1,887h-3.8v3.8
		c0,1.1-0.9,2-2,2s-2-0.9-2-2V887h-3.7c-1.1,0-2-0.9-2-2s0.9-2,2-2h3.8v-3.8c0-1.1,0.9-2,2-2c1.1,0,2,0.9,2,2v3.8h3.8
		c1.1,0,2,0.9,2,2S81.2,887,80.1,887z"/>
</g>
<g>
	<path style="fill:#3688BA;" d="M74.3,959.2c-7.7,0-14,6.3-14,14s6.3,14,14,14s14-6.3,14-14S82,959.2,74.3,959.2z M72.2,975.2h-3.7
		c-1.1,0-2-0.9-2-2s0.9-2,2-2h3.8h4h3.8c1.1,0,2,0.9,2,2s-0.9,2-2,2h-3.8H72.2z"/>
</g>
</svg>
