<?xml version="1.0" encoding="utf-8"?>
<!-- Generator: Adobe Illustrator 22.0.0, SVG Export Plug-In . SVG Version: 6.00 Build 0)  -->
<svg version="1.1" id="Layer_1" xmlns="http://www.w3.org/2000/svg" xmlns:xlink="http://www.w3.org/1999/xlink" x="0px" y="0px"
	 width="600px" height="1300px" viewBox="0 0 600 1300" style="enable-background:new 0 0 600 1300;" xml:space="preserve">
<g>
	<text transform="matrix(1 0 0 1 26.2217 1259.3903)" style="fill:#262626; font-family:'FuturaLT'; font-size:16.25px;">Source : Ministry of Justice</text>
</g>
<line style="fill:none;stroke:#262626;stroke-width:0.65;stroke-miterlimit:10;" x1="518.9" y1="74.1" x2="92.5" y2="74.1"/>
<line style="fill:none;stroke:#262626;stroke-width:5.2;stroke-miterlimit:10;" x1="348.3" y1="74.1" x2="260.5" y2="74.1"/>
<g>
	<g>
		<polygon style="fill:#1F333E;" points="459.3,1276.1 459.3,1261.7 473.8,1261.7 473.8,1261.7 		"/>
		<polygon style="fill:#44606D;" points="459.3,1247.2 459.3,1261.7 466.6,1254.4 		"/>
		<polygon style="fill:#547482;" points="466.6,1254.4 473.8,1261.7 473.8,1247.2 		"/>
		<polygon style="fill:#90C2D9;" points="466.6,1240 473.8,1247.2 473.8,1232.7 		"/>
		<polygon style="fill:#2A404A;" points="459.3,1261.7 473.8,1261.7 466.6,1254.4 		"/>
		<polygon style="fill:#6A8FA1;" points="459.3,1247.2 473.8,1247.2 466.6,1254.4 		"/>
		<polygon style="fill:#77A1B4;" points="459.3,1247.2 473.8,1247.2 466.6,1240 		"/>
	</g>
	<g>
		<path style="fill:#1A171B;" d="M487.5,1238.7v2.6h-2.1v-2.6H487.5z M487.5,1244.2v17.4h-2.1v-17.4H487.5z"/>
		<path style="fill:#1A171B;" d="M492.1,1261.7v-17.4h1.3l0.6,1.1c0.5-0.9,1.4-1.5,2.6-1.5c2.5,0,3.4,1.3,3.4,4v13.8h-2.1v-13.8
			c0-1.3-0.5-2.2-1.7-2.2c-1.3,0-1.8,0.8-1.8,2.2v13.7H492.1z"/>
		<path style="fill:#1A171B;" d="M506.7,1251.8l3.4-7.6h2.3l-3.9,8.4l4.3,9h-2.3l-3.7-8.2v8.2h-2.1v-24.7h2.1V1251.8z"/>
		<path style="fill:#1A171B;" d="M514.8,1267.4v-1.9c0.3,0.1,0.9,0.2,1.4,0.2c1,0,1.7-0.6,2-2l0.4-2.1l-3.4-17.4h2.2l2.3,13.6
			l2.2-13.6h2.2l-3.8,19.6c-0.5,2.6-1.5,3.8-4,3.8C515.8,1267.6,515.1,1267.5,514.8,1267.4z"/>
		<path style="fill:#1A171B;" d="M533.2,1236.8v1.8c-0.3-0.2-0.8-0.2-1.3-0.2c-1.3,0-1.7,0.6-1.7,2.1v3.8h2.5v1.8h-2.5v15.6h-2.1
			v-15.6h-1.6v-1.8h1.6v-3.8c0-2.5,0.8-3.9,3.7-3.9C532.3,1236.6,532.8,1236.7,533.2,1236.8z"/>
		<path style="fill:#1A171B;" d="M535.6,1255.8c0-2.7,1.3-4.1,5.7-5.4v-2.5c0-1.3-0.5-2.2-1.7-2.2c-1.4,0-1.7,0.9-1.7,2.2v0.8h-2.1
			v-0.8c0-2.3,0.8-4,3.8-4c3,0,3.8,1.6,3.8,4v13.8h-1.2l-0.6-1c-0.5,0.9-1.2,1.4-2.5,1.4c-2.5,0-3.5-1.3-3.5-4V1255.8z M541.3,1252
			c-3,0.9-3.6,2-3.6,3.8v2.3c0,1.4,0.5,2.2,1.8,2.2c1.3,0,1.8-0.9,1.8-2.2V1252z"/>
		<path style="fill:#1A171B;" d="M554.4,1261.7l-0.6-1.1c-0.5,0.9-1.3,1.4-2.6,1.4c-2.5,0-3.4-1.3-3.4-4v-10.1c0-2.7,0.9-4,3.3-4
			c1,0,1.9,0.5,2.4,1.3v-8.2h2.1v24.7H554.4z M553.6,1248c0-1.4-0.5-2.3-1.8-2.3c-1.3,0-1.7,0.9-1.7,2.2v10c0,1.4,0.5,2.2,1.7,2.2
			c1.3,0,1.8-0.9,1.8-2.2V1248z"/>
		<path style="fill:#1A171B;" d="M560,1255.8c0-2.7,1.3-4.1,5.7-5.4v-2.5c0-1.3-0.5-2.2-1.7-2.2c-1.4,0-1.7,0.9-1.7,2.2v0.8h-2.1
			v-0.8c0-2.3,0.8-4,3.8-4c3,0,3.8,1.6,3.8,4v13.8h-1.2l-0.6-1c-0.5,0.9-1.2,1.4-2.5,1.4c-2.5,0-3.5-1.3-3.5-4V1255.8z M565.7,1252
			c-3,0.9-3.6,2-3.6,3.8v2.3c0,1.4,0.5,2.2,1.8,2.2c1.3,0,1.8-0.9,1.8-2.2V1252z"/>
	</g>
</g>
<text transform="matrix(1 0 0 1 75.479 49.9429)" style="fill:#262626; font-family:'FuturaLT-Bold'; font-size:22.75px;">The cases that made it to court (2017) </text>
<rect x="228.2" y="125.9" style="fill:#EA341C;" width="49.6" height="41.7"/>
<g>
	<text transform="matrix(1 0 0 1 235.2732 156.3281)" style="fill:#FFFFFF; font-family:'FuturaLT-Bold'; font-size:24.7px;">18</text>
</g>
<text transform="matrix(1 0 0 1 287.5598 154.293)" style="fill:#262626; font-family:'FuturaLT-Bold'; font-size:19.5px;">Cases</text>
<rect x="185.7" y="486.8" style="fill:#EA341C;" width="37.9" height="41.7"/>
<g>
	<text transform="matrix(1 0 0 1 196.1736 517.1777)" style="fill:#FFFFFF; font-family:'FuturaLT-Bold'; font-size:24.7px;">1</text>
</g>
<text transform="matrix(1 0 0 1 238.1121 500.5928)"><tspan x="0" y="0" style="fill:#262626; font-family:'FuturaLT-Bold'; font-size:19.5px;">Conviction </tspan><tspan x="0" y="25" style="fill:#262626; font-family:'FuturaLT'; font-size:20.8px;">(1 month prison sentence)</tspan></text>
<g>
	<line style="fill:none;stroke:#262626;stroke-width:0.65;stroke-miterlimit:10;" x1="300" y1="166" x2="300" y2="198.3"/>
	<polygon points="300,201.2 294.3,194.4 305.7,194.4 	"/>
</g>
<g>
	<line style="fill:none;stroke:#262626;stroke-width:0.65;stroke-miterlimit:10;" x1="300.8" y1="432.8" x2="300" y2="464.3"/>
	<polygon points="300,467.2 294.3,460.4 305.7,460.4 	"/>
</g>
<g>
	<line style="fill:none;stroke:#262626;stroke-width:0.65;stroke-miterlimit:10;" x1="291" y1="640" x2="291" y2="707.3"/>
	<polygon points="291,710.2 285.3,703.4 296.7,703.4 	"/>
</g>
<g>
	<line style="fill:none;stroke:#262626;stroke-width:0.65;stroke-miterlimit:10;" x1="305.9" y1="1026" x2="305.9" y2="1056.3"/>
	<polygon points="305.9,1059.2 300.2,1052.4 311.7,1052.4 	"/>
</g>
<g>
	<text transform="matrix(1 0 0 1 141.4734 286.1929)"><tspan x="0" y="0" style="fill:#262626; font-family:'FuturaLT'; font-size:20.8px;">Human </tspan><tspan x="0" y="25" style="fill:#262626; font-family:'FuturaLT'; font-size:20.8px;">trafficking</tspan></text>
</g>
<g>
	<text transform="matrix(1 0 0 1 141.4734 258.042)" style="fill:#EA341C; font-family:'FuturaLT-Bold'; font-size:24.7px;">7</text>
</g>
<g>
	<text transform="matrix(1 0 0 1 403.8477 286.1929)"><tspan x="0" y="0" style="fill:#262626; font-family:'FuturaLT'; font-size:20.8px;">Economic </tspan><tspan x="0" y="25" style="fill:#262626; font-family:'FuturaLT'; font-size:20.8px;">exploitation</tspan></text>
</g>
<g>
	<text transform="matrix(1 0 0 1 403.8477 258.042)" style="fill:#EA341C; font-family:'FuturaLT-Bold'; font-size:24.7px;">6</text>
</g>
<g>
	<text transform="matrix(1 0 0 1 153.1238 398.1929)" style="fill:#262626; font-family:'FuturaLT'; font-size:20.8px;">Begging</text>
</g>
<g>
	<text transform="matrix(1 0 0 1 153.1238 370.042)" style="fill:#EA341C; font-family:'FuturaLT-Bold'; font-size:24.7px;">3</text>
</g>
<g>
	<text transform="matrix(1 0 0 1 402.9492 398.1929)"><tspan x="0" y="0" style="fill:#262626; font-family:'FuturaLT'; font-size:20.8px;">Sexual </tspan><tspan x="0" y="25" style="fill:#262626; font-family:'FuturaLT'; font-size:20.8px;">exploitation</tspan></text>
</g>
<g>
	<text transform="matrix(1 0 0 1 402.9492 370.042)" style="fill:#EA341C; font-family:'FuturaLT-Bold'; font-size:24.7px;">2</text>
</g>
<g>
	<text transform="matrix(1 0 0 1 268.4044 1145.1934)" style="fill:#262626; font-family:'FuturaLT'; font-size:20.8px;">Boys</text>
</g>
<g>
	<text transform="matrix(1 0 0 1 268.4044 1117.042)" style="fill:#EA341C; font-family:'FuturaLT-Bold'; font-size:24.7px;">12</text>
</g>
<g>
	<text transform="matrix(1 0 0 1 436.1046 1145.1934)" style="fill:#262626; font-family:'FuturaLT'; font-size:20.8px;">Men</text>
</g>
<g>
	<text transform="matrix(1 0 0 1 436.1046 1117.042)" style="fill:#EA341C; font-family:'FuturaLT-Bold'; font-size:24.7px;">2</text>
</g>
<g>
	<text transform="matrix(1 0 0 1 126.0548 1145.1934)" style="fill:#262626; font-family:'FuturaLT'; font-size:20.8px;">Girls</text>
</g>
<g>
	<text transform="matrix(1 0 0 1 126.0548 1117.042)" style="fill:#EA341C; font-family:'FuturaLT-Bold'; font-size:24.7px;">14</text>
</g>
<path style="fill:#404040;" d="M91.8,1126.7c0.1,0.8,0.4,1.6,0.3,2.3c-0.2,2.2-0.4,4.4-0.7,6.7c-0.1,1-0.4,2.1-0.6,3.1
	c-0.2,1.2-0.4,2.5-0.7,3.6c-0.3,0.9,0.1,1.7,0.3,2.5c0.2,0.8,0.1,1.6-0.1,2.3c-0.3,0.9-0.7,1.8-1,2.7c-0.1,0.3-0.4,0.6-0.6,0.9
	c-0.1,0.1-0.1,0.2-0.2,0.4c0.4,0.1,0.7,0.1,0.9,0.2c0.3,0.1,0.5-0.1,0.5-0.3c0.1-0.3,0.3-0.3,0.5-0.2c0.5,0.1,1.1,0.3,1.6,0.5
	c0.2,0.1,0.5,0,0.8,0c0.6-0.1,1.4,0.4,1.5,1c0.2,1,0.3,2.1,0.3,3.1c-0.1,1.1,0.1,2.1,0.2,3.2c0,0.5,0.1,1,0.2,1.5
	c0,0.5-0.2,0.9-0.7,1.2c-0.1,0.1-0.2,0.3-0.2,0.4c0,0.5-0.3,0.8-0.6,1.2c-0.2,0.3-0.5,0.5-0.8,0.7c-0.2,0.2-0.4,0.3-0.3,0.7
	c0,0.3-0.1,0.5,0,0.8c0,0.2,0.1,0.4,0.3,0.5c0.6,0.4,1.2,0.4,1.9,0.5c0.6,0,1.1-0.1,1.7-0.1c0.3,0,0.5-0.3,0.6-0.6
	c0.1-0.2,0.1-0.5,0.2-0.7c0.1-0.2,0.3-0.4,0.5-0.5c0.7-0.3,0.8-0.5,0.8-1.3c0-0.5-0.1-1,0.1-1.5c0.2-0.7-0.1-1.2-0.2-1.8
	c-0.1-0.7-0.1-1.5-0.1-2.2c0-1.5,0.1-2.9,0.1-4.4c0-0.3,0.1-0.7,0.1-1c0.1-0.4,0.7-1,1-1c0.1,0,0.3,0.1,0.3,0.2
	c0.1,0.3,0.3,0.7,0.4,1.1c0.1,0.6,0,1.2,0,1.8c0,0.5,0.1,1.1,0.1,1.6c0,0.8-0.1,1.6-0.2,2.4c-0.1,0.8-0.2,1.5-0.1,2.3
	c0.1,0.7-0.1,1.4,0.3,2c0.1,0.1,0.1,0.3,0.1,0.4c0,0.4,0.1,0.7,0.4,0.9c0.5,0.3,0.4,0.8,0.5,1.2c0.1,0.6,0.5,0.8,0.9,0.8
	c0.8,0,1.6,0.1,2.3,0c0.4,0,0.7-0.2,1-0.4c0.4-0.3,0.2-1.8-0.2-2.1c-0.6-0.5-1.3-1-1.3-1.9c0-0.1-0.1-0.2-0.2-0.2
	c-0.7-0.5-0.9-1.2-0.9-1.9c0-0.8,0.1-1.7,0.2-2.5c0.1-1.1,0.3-2.1,0.5-3.2c0.1-0.7,0.3-0.9,1-0.9c0.2,0,0.4,0,0.6,0
	c0.3,0,0.5,0,0.5-0.4c0-0.1,0.3-0.3,0.4-0.4c0.3-0.1,0.7-0.1,1-0.2c0.4-0.2,0.9,0,1.3-0.2c0.2-0.1,0.3-0.1,0.3-0.4
	c-0.1-0.6-0.2-1.2-0.2-1.8c0-0.4-0.1-0.7-0.1-1.1c-0.1-0.4-0.3-0.7-0.4-1.1c-0.2-0.4-0.4-0.8-0.5-1.2c-0.2-0.9-0.3-1.7-0.3-2.6
	c-0.1-2.3-0.1-4.6-0.2-6.9c0-1-0.2-2-0.3-3c0-0.3,0-0.6-0.1-0.9c0,0,0.1,0,0.1,0c0.1,0.1,0.2,0.1,0.2,0.2c0.1,0.4,0.2,0.8,0.1,1.2
	c-0.1,0.8,0,1.5,0.2,2.2c0.1,0.3,0,0.6,0,0.9c0,0.1-0.1,0.3-0.1,0.4c0,0.2,0.1,0.5,0.4,0.6c0.3,0.1,0.5-0.2,0.5-0.5
	c0-0.1,0-0.1,0.1-0.2c0.2,0.3,0.1,0.8-0.2,1c-0.2,0.2-0.4,0.3-0.3,0.6c0,0.1-0.1,0.1-0.1,0.2c-0.1,0.2-0.1,0.4-0.2,0.7
	c0.5-0.1,0.7-0.1,0.7,0.4c0,0.2,0.2,0.3,0.4,0.1c0.6-0.5,1.1-1.1,1.2-1.9c0.1-0.8,0-1.7,0-2.6c0-0.1,0-0.3-0.1-0.4
	c-0.3-0.6-0.3-1.3-0.3-1.9c0-1.4,0-2.7,0-4.1c0-0.3-0.1-0.7-0.3-1c-0.1-0.3,0-0.5,0.1-0.8c0.1-0.3,0.1-0.7,0.2-1.1
	c0-0.1-0.2-0.2-0.2-0.3c-0.1-0.1-0.2-0.1-0.3-0.2c0.4-0.4,0.4-0.8,0.3-1.3c-0.2-0.6-0.3-1.2-0.4-1.8c-0.5-1.9-0.5-3.9-0.6-5.9
	c0-1.1-0.2-2.2-0.7-3.2c-0.3-0.6-0.8-1.2-1.6-1.4c-0.2-0.1-0.4-0.3-0.5-0.5c-0.3-0.4-0.6-0.9-0.9-1.3c-0.1-0.1-0.2-0.3-0.3-0.5
	c0,0,0.1-0.1,0.1-0.1c0.4,0.5,0.8,1,1.3,1.5c0.1,0,0.1-0.1,0.2-0.1c-0.8-1-1.6-1.9-1.5-3.3c0.1,0.1,0.2,0.1,0.3,0.2
	c0,0,0.1-0.1,0.1-0.1c-0.3-1.5,0.1-2.9-0.2-4.4c-0.2-1.5-0.4-2.9-1-4.3c-0.4-1-1.1-1.6-2-2.1c-0.3-0.2-0.6-0.3-0.9-0.4
	c-0.7-0.3-1.3-0.4-2.1-0.2c-0.9,0.2-1.8,0.3-2.5,0.9c-0.4,0.3-0.7,0.7-0.9,1.2c-0.7,1.2-0.9,2.6-1.1,4c-0.3,1.9-0.3,3.8-0.2,5.7
	c0,0.5-0.1,1-0.4,1.4c-0.1,0.2-0.2,0.4-0.3,0.6c-0.2,0.3-0.3,0.6-0.7,0.7c-0.5,0.1-0.9,0.4-1.2,0.8c-0.3,0.4-0.7,0.6-0.9,1
	c-0.4,0.6-0.7,1.3-1,1.9c-0.3,0.6-0.7,1.3-1.1,1.9c-0.4,0.8-0.8,1.6-1.1,2.4c-0.3,0.8,0,1.6,0.4,2.3c0.9,1.5,2.2,2.6,3.5,3.7
	c0.3,0.3,0.6,0.5,1,0.8C91.8,1126.6,91.8,1126.6,91.8,1126.7z M90.4,1120.7c-0.1-0.1,0-0.4,0-0.6c0.2-0.4,0.4-0.7,0.7-1.1
	c0.3-0.5,0.6-1,1.2-1.3c0.2,1,0.3,1.9,0.4,2.8c0,0.1-0.1,0.3-0.1,0.5c0,0.3-0.1,0.6,0,1c0.1,0.5,0.2,1,0.3,1.5
	c0,0.1-0.1,0.2-0.1,0.3c-0.1,0-0.3-0.1-0.4-0.2C91.6,1122.8,91,1121.8,90.4,1120.7z"/>
<path style="fill:#404040;" d="M243.9,1130.8c0.2,0.3,0.3,0.7,0.1,1c-0.2,0.2-0.2,0.5-0.2,0.8c0,0.5-0.1,0.9-0.2,1.4
	c-0.1,0.4-0.2,0.7,0,1.1c0,0.1,0,0.2-0.1,0.3c-0.2,0.4-0.4,0.9-0.6,1.3c-0.3,0.9-0.2,1.7,0,2.6c0.1,0.4,0.2,0.9,0.1,1.4
	c-0.2,0.9-0.2,1.9-0.2,2.8c0,1.2-0.1,2.4-0.5,3.6c-0.1,0.4-0.1,0.8,0.1,1.1c0.2,0.3,0.2,0.6-0.1,0.9c-0.4,0.5-0.4,1-0.3,1.6
	c0.1,0.3,0.1,0.6,0,0.9c-0.1,0.7-0.1,1.3,0.1,2c0.1,0.6,0.1,0.8-0.5,1c-0.2,0.1-0.4,0.2-0.5,0.5c-0.1,0.4-0.2,0.7-0.2,1.1
	c0,0.1,0,0.3,0.1,0.4c0.3,0.3,0.2,0.7,0.2,1.1c0,0.5,0.2,1,0.6,1.3c0,0,0.1,0.1,0.1,0.2c-0.2,0.1-0.3,0.2-0.5,0.3
	c-0.3,0.2-0.4,0.3-0.3,0.7c0.1,0.3,0.1,0.6,0,0.9c-0.1,0.2,0,0.4,0,0.6c0.1,0.3,0.1,0.6-0.1,0.9c-0.4,0.7-0.9,1.3-1.4,1.9
	c-0.5,0.5-0.6,1.1-0.5,1.7c0,0.1,0,0.1,0.1,0.2c0.4,0.1,0.6,0.5,1.1,0.4c0.6-0.1,1.2-0.1,1.8-0.2c0.7-0.1,1.4-0.4,2-0.8
	c0.5-0.3,1-0.4,1.5-0.7c0.4-0.2,0.4-0.2,0.4-0.7c0-0.7,0-1.3,0-2c0-0.6,0.1-1.2,0.1-1.8c0-0.1,0-0.3,0-0.4c-0.1-0.4,0-0.8,0-1.2
	c0-0.5,0.2-0.9,0.7-1.1c0.2-0.1,0.2-0.3,0.1-0.5c0-0.1,0-0.3,0.1-0.3c0.7-0.4,0.7-1,0.6-1.7c-0.1-0.6-0.1-1.3-0.2-1.9
	c-0.1-0.4-0.2-0.8-0.3-1.2c-0.1-0.4-0.1-0.7,0.1-0.9c0.2-0.3,0.3-0.6,0.3-0.9c0-0.3,0.2-0.5,0.3-0.7c0.4-0.5,0.6-1,0.6-1.6
	c-0.1-0.9,0.3-1.7,0.6-2.5c0.6-1.3,1.1-2.7,1.7-4c0.1-0.2,0.1-0.5,0.2-0.8c0.3,0.6,0.5,1.2,0.7,1.8c0.1,0.2,0.2,0.5,0.3,0.7
	c0.2,0.6,0.1,1.1,0,1.7c-0.3,1.5-0.6,3-0.6,4.6c0,1.3,0.1,2.5,0.8,3.6c0.4,0.7,0.3,1.4-0.1,2.1c-0.2,0.5-0.4,0.9-0.1,1.3
	c0.1,0.2,0.2,0.4,0.1,0.6c-0.1,0.5-0.2,0.9-0.3,1.4c0,0.2-0.1,0.5-0.1,0.7c0,0.6,0.1,1.3,0.1,1.9c0,0.6,0.1,1.2,0.2,1.8
	c0,0.3,0.3,0.5,0.6,0.7c0.6,0.2,1.3,0.3,2,0.3c0.5,0,1,0.1,1.4,0.4c0.2,0.1,0.5,0.1,0.8,0.2c1,0.1,2,0.1,3-0.3
	c0.3-0.1,0.6-0.3,1-0.5c0.2-0.1,0.3-0.3,0.2-0.6c-0.2-0.6-0.6-1-1.2-1.3c-1-0.4-2-0.9-2.8-1.7c-0.1-0.1-0.2-0.3-0.2-0.5
	c0-0.1,0-0.3-0.1-0.4c-0.1-0.2-0.2-0.4,0.2-0.5c0.1,0,0.1-0.2,0.1-0.3c0-0.1,0-0.3,0-0.4c0-0.2-0.1-0.4-0.4-0.3c0,0,0-0.1,0-0.1
	c0.1-0.1,0.2-0.2,0.4-0.3c0.4-0.1,0.6-0.4,0.6-0.9c0-0.3,0.1-0.6,0.1-0.9c0-0.4-0.1-0.7-0.5-1c-0.3-0.2-0.3-0.4-0.1-0.7
	c0.1-0.1,0.2-0.2,0.3-0.2c0.7-0.5,1-1.3,0.6-2.1c-0.1-0.3-0.2-0.5-0.3-0.8c-0.2-0.5-0.1-0.9,0.3-1.2c0.5-0.3,0.6-0.8,0.7-1.3
	c0.1-1.3,0-2.6-0.3-3.8c-0.1-0.4-0.1-0.8,0.1-1.2c0.1-0.1,0.1-0.3,0.1-0.4c0-1,0.3-1.9,0.1-2.9c-0.1-0.3,0.1-0.7,0.1-1.1
	c0-0.5,0-1,0-1.5c-0.1-0.6-0.2-1.2-0.3-1.7c0-0.1-0.1-0.3-0.1-0.4c-0.3-0.8-0.5-1.6-0.6-2.4c-0.1-0.3,0-0.8,0.1-1.1
	c0.1-0.5,0.2-1.1,0.2-1.6c0-0.6,0.3-0.8,0.9-0.9c0.1,0,0.1,0,0.2,0c0.4,0,0.6-0.1,0.7-0.5c0.1-0.3,0.3-0.6,0.5-0.8
	c0.2-0.1,0.3-0.4,0.4-0.6c0.1-0.4,0.3-0.7,0.6-1c0.2-0.1,0.2-0.3,0.1-0.5c-0.1-0.2,0-0.4,0.2-0.6c0.2-0.2,0.3-0.5,0.3-0.8
	c0-0.3,0-0.5,0.3-0.7c0.2-0.2,0.3-0.4,0.3-0.7c0-0.5,0-0.9,0-1.4c0-0.2-0.1-0.3-0.2-0.4c-0.1-0.2-0.3-0.4-0.3-0.6
	c-0.1-1.2-0.7-2.1-1.2-3.1c-0.3-0.7-0.6-1.3-0.9-2c-0.4-1.1-0.9-2.3-1.9-3.1c-0.6-0.5-1.3-0.8-2-1.2c-0.8-0.4-1.7-0.7-2.5-1.1
	c-0.1,0-0.2-0.1-0.2-0.2c-0.1-0.5-0.2-0.9-0.4-1.4c0,0,0-0.1,0-0.1c0.2-0.4,0.3-0.8,0.5-1.2c0-0.1,0.1-0.2,0.1-0.2
	c0.5,0,0.6-0.5,0.7-0.8c0.2-0.5,0.3-1.1,0.5-1.6c0.1-0.2,0.1-0.4,0.1-0.6c0-0.3-0.2-0.4-0.4-0.2c0,0-0.1,0-0.1,0.1
	c0.1-0.4,0.2-0.8,0.1-1.1c0-0.9-0.1-1.9-0.2-2.8c0-0.2-0.1-0.4-0.2-0.5c-0.4-0.6-0.8-1.2-1.3-1.7c-0.4-0.5-1.1-0.7-1.7-0.7
	c-0.9,0-1.9,0-2.8,0.2c-0.5,0.1-1,0.2-1.3,0.7c0,0.1-0.1,0.1-0.1,0.1c-1,0.6-1.4,1.7-1.5,2.8c-0.1,0.5,0,1.1,0,1.6
	c0,0.5,0.1,1.1,0.2,1.6c0,0,0,0-0.1,0c-0.4-0.2-0.7,0-0.6,0.5c0.1,0.3,0.2,0.6,0.3,0.9c0.1,0.4,0.3,0.7,0.4,1.1
	c0.1,0.4,0.6,0.8,1,0.8c0.1,0,0.2,0.1,0.2,0.1c0.1,0.3,0.1,0.5,0.2,0.8c0.1,0.3,0.1,0.6-0.1,0.9c-0.1,0.1-0.1,0.3-0.1,0.4
	c0,0.3-0.1,0.4-0.3,0.6c-0.2,0.1-0.4,0.2-0.6,0.4c-1,0.5-2,1-2.9,1.6c-0.7,0.4-1.2,1.1-1.6,1.8c-0.9,1.7-1.9,3.3-2.6,5.1
	c-0.2,0.4-0.2,0.4-0.1,0.7c-0.2,0.1-0.3,0.2-0.3,0.4c0,0.1-0.1,0.2-0.1,0.3c-0.1,0.8-0.6,1.4-0.7,2.2c-0.1,0.9,0.1,1.8,0.6,2.6
	c0.4,0.8,1,1.5,1.5,2.2c0.4,0.6,0.8,1.1,1.2,1.7c0.3,0.4,0.6,0.7,1.1,0.8c0.2,0.1,0.4,0.2,0.5,0.4c0.3,0.3,0.6,0.5,1,0.3
	C243.4,1130.5,243.7,1130.5,243.9,1130.8z M243,1124.3c0.1,0.4,0.1,0.8,0.2,1.3c-0.5,0-1-0.5-1-1c0-0.3-0.1-0.4-0.3-0.6
	c-0.3-0.2-0.3-0.4-0.1-0.7c0.1-0.2,0.2-0.4,0.3-0.6c0.2-0.4,0.3-0.9,0.5-1.3c0,0,0.1-0.1,0.1-0.2c0.1,0.8,0.3,1.5,0.2,2.3
	C242.9,1123.9,242.9,1124.1,243,1124.3z M256.5,1124.8c0.1-0.7,0.2-1.3,0.2-2c0-0.5,0-1.1,0-1.6c0.4,0.2,0.4,0.5,0.5,0.9
	c0,0.2,0.1,0.4,0.2,0.6c0.2,0.3,0.3,0.5,0.2,0.8c-0.1,0.4-0.1,0.7-0.2,1.1c0,0,0,0.1-0.1,0.1c-0.2,0.2-0.5,0.3-0.8,0.6
	C256.5,1125.1,256.5,1124.9,256.5,1124.8z"/>
<rect x="60.5" y="107.5" style="fill:none;stroke:#262626;stroke-width:0.65;stroke-miterlimit:10;" width="481" height="448"/>
<path style="fill:#404040;" d="M376.2,257c-0.9-0.1-1.8-0.2-2.6-0.2c-1.2-0.1-2.3-0.2-3.5,0c0,0-0.1,0-0.1,0c-0.4-0.2-0.7-0.1-1.1,0
	c-1,0.3-2,0.7-3,1c-0.1,0-0.2,0.1-0.2,0.1c-0.5-0.1-0.8,0.1-1.1,0.4c-0.2,0.1-0.3,0.2-0.5,0.1c-0.6-0.3-1.1-0.2-1.6,0.1
	c0,0-0.1,0.1-0.2,0.1c-0.2-0.2-0.5-0.3-0.7-0.5c-0.2-0.1-0.3-0.3-0.5-0.5c-0.2-0.1-0.3-0.3-0.4-0.5c-0.1-0.2-0.2-0.4-0.3-0.5
	c-0.3-0.1-0.3-0.3-0.3-0.5c0-0.3-0.2-0.5-0.4-0.7c-0.2-0.1-0.3-0.3-0.4-0.6c0-0.2-0.1-0.4-0.2-0.6c-0.1-0.2-0.2-0.3-0.1-0.5
	c0.1-0.2,0.1-0.4,0-0.6c-0.2-0.6-0.3-1.2-0.5-1.7c0-0.1-0.1-0.2-0.2-0.3c-1.1-0.7-2.3-1.4-3.5-2.2c-0.3-0.2-0.6-0.4-0.9-0.7
	c0.9,0,0.9,0,1-1c0-0.1,0-0.2,0.1-0.2c0.2-0.1,0.2-0.3,0.2-0.5c-0.1-0.7,0.3-1.6,0.8-1.9c0.3-0.1,0.5-0.5,0.4-0.8
	c0-0.5,0-0.5,0.3-0.6c0.5-0.2,0.6-0.3,0.2-0.8c-0.2-0.3-0.4-0.5-0.6-0.8c-0.1-0.1-0.1-0.3,0-0.3c0.2-0.2,0.2-0.5,0.1-0.7
	c-0.1-0.3-0.2-0.6-0.4-0.9c-0.2-0.5-0.5-1.1-0.9-1.5c-0.5-0.5-1.1-0.7-1.8-0.9c-0.9-0.2-1.9-0.2-2.8,0.1c-0.6,0.3-1.2,0.7-1.5,1.4
	c-0.5,1-0.4,2-0.3,3.1c0,0.7,0.2,1.3,0.2,2c0,0.2,0,0.5-0.1,0.7c-0.1,0.1-0.2,0.2-0.3,0.3c0,0-0.1,0-0.1,0.1
	c-0.3,0.1-0.5,0.2-0.8,0.2c0,0.1,0,0.1-0.1,0.2c-0.2,0.3-0.6,0.4-0.9,0.4c-0.7,0.1-1.5,0.1-2.2,0.1c-0.5,0-0.9,0-1.4,0.1
	c-0.5,0.1-1.3,0.3-2,0.3c-0.2,0.1-0.3,0.2-0.5,0.2c-0.2,0-0.4,0.1-0.6,0.2c-0.2,0.1-0.4,0.1-0.5,0.1c-0.4,0-0.7-0.1-1.1,0.1
	c-0.1,0-0.2,0-0.2,0c-0.2-0.2-0.4-0.1-0.7-0.1c-0.2,0-0.5,0.1-0.7,0c-0.2-0.1-0.4-0.2-0.7-0.1c-0.1,0-0.2,0-0.2-0.1
	c-0.2-0.2-0.4-0.2-0.7-0.2c-0.6,0.1-1.1,0.2-1.6-0.2c0,0-0.1,0-0.2,0c-0.4,0-0.7-0.2-1.1-0.3c-1-0.4-2-0.9-3.1-0.9
	c-0.4,0-0.9-0.1-1.3-0.2c-0.6-0.2-1.3-0.4-1.9-0.6c-0.3-0.1-0.5-0.1-0.8-0.2c-0.2-0.1-0.2,0-0.3,0.1c-0.1,0-0.1,0-0.2-0.1
	c-0.9-0.4-1.8-0.6-2.6-1.2c-0.4-0.3-0.8-0.5-1.3-0.6c-1.1-0.1-2.3-0.2-3.5-0.2c-0.1,0-0.2,0.1-0.4,0.2c0.1,0.1,0.2,0.3,0.3,0.3
	c0.3,0.1,0.6,0.2,1,0.3c0.4,0.1,0.7,0.2,1.1,0.3c0.2,0.1,0.2,0.2,0,0.4c-0.1,0.1-0.3,0.2-0.4,0.3c-0.1,0.1-0.2,0.4-0.1,0.5
	c0.1,0.3,0.4,0.5,0.4,0.9c0,0,0.1,0.1,0.1,0.1c0.1,0.1,0.2,0.3,0.3,0.4c0.1,0.1,0.1,0.2,0.2,0.2c0.3,0.2,0.5,0.1,0.8,0
	c0.2-0.1,0.3-0.1,0.5-0.1c0.4,0,0.7,0.1,1.1,0.1c0.5,0,0.9-0.1,1.4,0.1c0.3,0.2,0.6,0.3,0.9,0.5c0.1-0.3,0.1-0.6,0.2-1c0,0,0,0,0,0
	c0,0,0,0,0,0c-0.1,0.8-0.3,1.6-0.5,2.4c0,0.3,0,0.4,0.2,0.4c0.5,0.1,1,0.2,1.5,0.4c0.8,0.2,1.7,0.3,2.5,0.6c0.9,0.3,1.8,0.8,2.9,0.8
	c0.2,0,0.4,0.1,0.5,0.2c0.4,0.6,1,0.6,1.5,0.6c0.3,0,0.7,0,1,0c0.6,0.2,1.3,0.4,1.9,0.6c0.9,0.3,1.8,0.4,2.8,0.5c0,0,0.1,0,0.1,0
	c0.1,0,0.1,0,0.2,0c0.1,0,0.3,0,0.4-0.1c0,0,0,0,0,0c0.4,0.1,0.4,0.1,0.4,0.6c0.1,0.3,0.1,0.7,0.3,1c0.1,0.7,0.2,1.3,0.3,2
	c0,0.1,0,0.3,0,0.4c0.1,0.4,0.1,0.8,0.1,1.3c0.1,0.5,0.2,1,0.1,1.5c-0.1,0.6-0.3,1.1-0.2,1.6c0,0.2,0.1,0.4,0.1,0.6
	c0,0.3-0.1,0.6-0.1,1c-0.6,2.2-0.1,4.6-0.9,6.6c-0.2,0.4-0.4,0.8-0.5,1.2c0,0.1,0,0.1,0,0.2c-0.2,0.5-0.4,1-0.5,1.5
	c-0.1,0-0.1,0.1-0.2,0.1c0,0,0,0.1,0.1,0.1c0,0,0,0,0,0c-0.2,0.7-0.3,1.5-0.3,2.2c0,0.2,0,0.3,0.1,0.5c-0.1,0.7-0.2,1.4-0.2,2.1
	c-0.2,2.6,0.2,5.4-1.2,7.6c-0.2,0.3-0.5,0.6-0.6,1c-0.2,0.4-0.2,0.7-0.3,1.1c-1,5.4-1.9,10.9-2.1,16.4c0,0.3,0,0.7,0.1,1
	c0.1,0.3,0.2,0.6,0.3,0.9c0.4,1.6-1,3.3-0.6,4.8c0.5,1.7,2.9,2.5,4.1,1.2c0.7-0.7,0.7-1.8,0.7-2.8s-0.2-2,0.2-2.9
	c0.3-0.6,0.7-1.1,0.8-1.8c0-0.3-0.1-0.6-0.1-0.9c0-0.3,0.2-0.6,0.4-1c0.4-0.7,0.5-1.6,0.7-2.4c0.4-2.2,0.9-4.4,1.3-6.6
	c0.1-0.5,0.2-0.9,0.4-1.3c0.1-0.2,0.2-0.4,0.4-0.6c0.3-0.5,0.4-1.1,0.5-1.7c0.6-2.6,1.3-5.2,2.3-7.7c0.2-0.4,0.3-0.9,0.4-1.3
	c0.1,2,0.6,4,0.5,6c0,0.8-0.2,1.6,0,2.4c0.1,0.5,0.3,1,0.5,1.5c0.1,0.5,0.2,1.1,0.2,1.6c0.1,0.8,0.2,1.6,0.3,2.4
	c0.2,1.7,0.4,3.3,0.9,4.9c0.2,0.7,0.5,1.4,0.6,2.1c0.2,1.6-0.7,3.4-0.2,4.9c0.1,0.3,0.2,0.5,0.4,0.7c0.2,0.1,0.4,0.2,0.6,0.3
	c1.2,0.4,2.4,0.8,3.6,1.2c1.2,0.4,2.4,0.8,3.6,0.7c0.4,0,0.8-0.1,1.1-0.3c0.1-0.1,0.2-0.1,0.2-0.2c0.2-0.1,0.3-0.2,0.3-0.5
	c0-0.4,0-0.5-0.3-0.6c-0.1-0.2-0.3-0.3-0.4-0.4c-1.2-1-3.3-2.5-3.8-4.2c-0.4-1.5-0.3-3.7-0.2-5.3c0.1-3.1,0.3-6.3,0.4-9.4
	c0-0.8,0.1-1.5-0.1-2.3c-0.1-0.4-0.2-0.8-0.3-1.3c-0.1-0.7-0.1-1.5,0-2.2c0.1-2.1,0.4-4.2,0.7-6.2c0,0,0,0,0,0
	c0.2-0.1,0.3-0.3,0.2-0.6c-0.1-0.2-0.3-0.5-0.4-0.7c-0.2-0.5-0.6-0.9-0.6-1.5c0-0.4,0-0.8,0-1.3c0-0.7,0.1-1.4-0.2-2
	c-0.3-0.7-0.3-1.5-0.1-2.2c0.3-1.5,0.6-3,1.2-4.5c0.2-0.5,0.4-1.1,0.8-1.4c0.5-0.4,1-0.9,1.2-1.6c0.1,0.1,0.2,0.2,0.3,0.2
	c0.9,0.8,1.7,1.7,2.6,2.5c0.8,0.8,1.8,1.2,2.9,1c1.2-0.1,2.5-0.4,3.7-0.6c0.8-0.1,1.6-0.3,2.3-0.5c0.7-0.1,1.4-0.3,2.1-0.4
	c0.2,0,0.4-0.1,0.4-0.5c0-0.6,0-1.1,0-1.7c0-0.1,0.1-0.3,0.2-0.3c0.2-0.1,0.5-0.1,0.7-0.1c0,0.3,0.2,0.4,0.3,0.4
	c0.5,0.2,1,0.2,1.5-0.1c0.5-0.2,0.7-0.4,0.4-1c0-0.1-0.1-0.2-0.1-0.3c-0.1-0.2,0-0.3,0.2-0.3c0.3,0,0.7,0.1,1,0
	c0.5-0.1,1-0.2,1.4-0.3c0.1,0,0.1-0.2,0.2-0.3C376.4,257.1,376.3,257,376.2,257z"/>
<path style="fill:#404040;" d="M396.5,283.2c-0.2-0.2-0.3-0.5-0.4-0.7c-0.4-0.9-0.8-1.9-1.2-2.8c-0.2-0.4-0.4-0.8-0.6-1.2
	c-0.2-0.5-0.4-1.1-0.6-1.6c-0.7-2-1.6-3.9-2.6-5.7c-0.9-1.5-1.8-3-3.3-4c-0.2-0.2-0.2-0.4,0-0.5c0.2-0.1,0.4-0.3,0.6-0.4
	c0.7-0.4,1.3-0.8,1.9-1.4c0.5-0.5,0.9-1.1,1-1.9c0.2-1.4-0.2-2.6-0.9-3.7c-0.5-0.6-1.1-1.1-1.7-1.6c-0.9-0.6-1.8-1.1-2.8-1.3
	c-0.8-0.1-1.5-0.1-2.3,0.2c-0.4,0.2-0.6,0.5-0.6,0.9c0,0.1,0,0.2-0.1,0.3c-0.3,0.5-0.6,1-0.8,1.5c-0.1,0.4-0.4,0.7-0.7,0.7
	c-0.1,0-0.3,0.1-0.4,0.1c-0.4,0.2-0.7,0.5-0.2,1c0,0,0,0.1,0,0.1c0,0.1-0.1,0.1-0.1,0.2c-0.3,0.5-0.3,0.6,0.1,1
	c0.2,0.2,0.2,0.3-0.1,0.5c-0.1,0.1-0.2,0.1-0.2,0.1c-0.1,0.1-0.2,0.2-0.2,0.3c0,0.1,0,0.3,0,0.5c-0.2,0.3-0.4,0.7-0.1,1
	c-0.1,0.1,0,0.2,0.1,0.3c0.1,0.1,0.2,0.2,0.4,0.3c0.2,0.1,0.3,0.2,0.5,0.3c0.7,0.4,1.2,1,1.3,1.9c0.1,0.6,0.2,1.1,0.3,1.7
	c0,0.2,0.1,0.4,0.1,0.6c0,1-0.1,1.9-0.2,2.9c0,1.5,0,3.1,0.3,4.6c0.3,1.4,0.6,2.8,0.8,4.2c0,0.2,0,0.3-0.1,0.4
	c-0.3,0.4-0.6,0.9-0.9,1.3c-0.1,0.3-0.3,0.5-0.5,0.7c-0.2,0.1-0.3,0.3-0.4,0.4c-0.2,0.3-0.4,0.6-0.4,0.9c0,0.2-0.1,0.4-0.1,0.6
	c0,0.2-0.1,0.4-0.2,0.6c-0.1,0.5,0.2,0.9,0.7,0.9c0.4,0,0.7-0.1,1.1-0.2c0,0,0.1,0,0.1,0c0.1-0.2,0.3-0.1,0.5-0.1
	c0.2,0.1,0.3,0,0.3-0.3c0-0.1,0-0.3-0.1-0.4c0-0.1,0-0.2,0.1-0.3c0.1-0.4,0.3-0.7,0.4-1.1c0.1-0.2,0.1-0.4,0.1-0.7
	c0.1,0.2,0.2,0.4,0.3,0.6c0.1,0.3,0.2,0.6,0.1,0.9c0,0.3,0,0.6,0.1,0.8c0.1,0.4,0.3,0.8,0.4,1.2c0.1,0.5,0.2,1,0.2,1.5
	c0,0.4-0.2,0.8,0.1,1.1c0,0,0,0,0,0.1c-0.1,0.6-0.1,1.2-0.3,1.7c-0.2,0.7-0.2,1.5,0,2.2c0.2,0.5,0.3,1,0.1,1.6
	c-0.1,0.4-0.2,0.9-0.3,1.3c-0.2,1.2-0.4,2.4-0.6,3.6c-0.1,0.5-0.1,1-0.4,1.4c-0.1,0.2-0.2,0.4-0.2,0.6c0,0-0.1,0.1-0.1,0.1
	c-0.1-0.3-0.2-0.4-0.4-0.3c-0.2,0.1-0.3,0.2-0.5,0.3c-0.6,0.5-1.3,0.8-2,0.9c-0.5,0-1,0.2-1.5,0.4c-0.1,0-0.3,0.2-0.3,0.3
	c-0.1,0.7,0.1,1.5,0.9,1.6c0.9,0.2,1.7,0.2,2.6,0c0.6-0.1,1.2-0.1,1.7-0.1c0.5,0,0.9,0.1,1.4,0.2c-0.1,0.1-0.1,0.2-0.2,0.3
	c-0.2,0.2-0.4,0.5-0.5,0.7c-0.2,0.4-0.5,0.6-0.9,0.7c-0.2,0.1-0.4,0.2-0.6,0.3c-0.4,0.2-0.5,0.6-0.4,1c0.1,0.4,0.4,0.7,0.8,0.8
	c0.3,0.1,0.6,0.2,0.9,0.3c1,0.2,2.1,0.2,3-0.4c0.4-0.2,0.7-0.5,1.1-0.7c0.2-0.1,0.3-0.3,0.5-0.4c0.2-0.2,0.4-0.5,0.4-0.9
	c0-0.4-0.1-0.8-0.2-1.2c-0.2-0.5-0.1-0.8,0.2-1.2c0.1-0.1,0.1-0.2,0-0.4c-0.1-0.1-0.1-0.3,0-0.4c0.2-0.4,0.5-0.9,0.7-1.3
	c0.4-0.8,0.8-1.7,1.2-2.5c0.4-0.8,0.4-1.7,0.5-2.6c0.1-0.8,0-1.5-0.2-2.2c-0.1-0.2-0.1-0.4-0.1-0.7c0-1.2,0.3-2.4,0.6-3.6
	c0.1-0.4,0.3-0.8,0.4-1.2c0.2-0.3,0.3-0.6,0.4-0.9c0,0,0.1,0,0.2,0c0-0.1-0.1-0.1-0.1-0.1c0-0.1,0.1-0.1,0.1-0.2c0,0,0,0.1,0,0.1
	c0,0,0.1,0,0.1-0.1c0-0.1,0-0.1-0.1-0.2c0-0.1,0.1-0.1,0.1-0.2c0,0,0,0,0.1,0.1c0,0,0-0.1,0-0.1c0.1-0.1,0.2-0.3,0.3-0.4
	c0,0,0,0,0,0c0,0,0.1,0,0.1-0.1c0.1-0.1,0.1-0.2,0.2-0.4c0.4-0.7,0.7-1.4,0.9-2.2c0-0.2,0.1-0.3,0.2-0.5c0.4-0.5,0.8-1,1.3-1.5
	C396.7,283.9,396.7,283.5,396.5,283.2z M387.9,301c-0.2,0.8-0.4,1.7-0.6,2.5c0,0.2-0.1,0.4-0.3,0.5c-0.1,0-0.1,0.2-0.1,0.2
	c0,0.1,0,0.2,0,0.3c0,0,0,0-0.1,0c0-0.1,0-0.1,0-0.2c-0.1-0.2-0.1-0.5-0.2-0.7c0-0.1,0-0.3,0.1-0.4c0.1-0.2,0.2-0.4,0-0.6
	c0,0,0-0.1,0-0.2c0.4-1.1,0.8-2.2,1.4-3.2c0,0,0,0,0,0c0,0,0,0,0.1,0C388.1,299.8,388,300.4,387.9,301z"/>
<path style="fill:#404040;" d="M112.5,351.3c0.2-0.5,0.6-0.6,1-0.8c0,0,0-0.1,0-0.1c-0.3,0.1-0.5,0.2-0.8,0.3
	c0.3-0.4,0.7-0.5,1.2-0.5c0.4,0,0.8,0.1,1.3,0.2c0,0,0,0,0.1-0.1c-0.2-0.2-0.4-0.4-0.6-0.6c0.4,0,0.6,0.3,0.8,0.5
	c0.1-0.1,0.2-0.1,0.2-0.1c-0.2-0.3-0.3-0.5-0.4-0.7c0.5,0.3,0.5,0.3,1,0.1c0.1,0,0.1,0,0.2-0.1c0.6-0.1,0.9,0.1,1,0.6
	c0.1,0.3,0.4,0.4,0.6,0.2c0.1,0,0.1-0.1,0.1-0.2c0,0,0.1,0,0.1,0c-0.1,0.2-0.2,0.4-0.3,0.7c0,0,0,0,0,0.1c0.2-0.2,0.4-0.3,0.6-0.5
	c0,0.1-0.1,0.3-0.1,0.4c0.3,0,0.7,0,0.9-0.2c0.2-0.2,0.3-0.5,0.4-0.7c0.2,0.3,0,0.6-0.1,1c0.1,0,0.2,0,0.3,0c0.5-0.1,1.1,0,1.5,0.2
	c0.6,0.3,1.1,0.6,1.7,0.8c0.8,0.3,1.1,1.1,1.4,1.8c0.1,0.3,0.3,0.6,0.6,0.9c0.3,0.2,0.6,0.4,1,0.2c-0.1,0.4-0.4,0.4-0.6,0.5
	c0.2,0.5,0.2,1,0,1.5c0-0.2-0.1-0.4-0.1-0.6c0,0-0.1,0-0.1,0c-0.1,0.8-0.1,1.5-0.2,2.3c-0.3,0.2-0.4,0.4-0.2,0.8
	c0.1,0.3,0.3,0.5,0.4,0.7c0.2,0.4,0.1,0.6-0.3,0.9c-0.1,0.1-0.2,0.2-0.2,0.3c0,0.1,0,0.2,0,0.3c0,0.3-0.1,0.4-0.4,0.5
	c-0.4,0.1-0.6,0.4-0.4,0.8c0.1,0.2,0.1,0.4-0.1,0.5c-0.1,0.2-0.2,0.3-0.3,0.5c-0.2,0.7-0.6,0.9-1.3,0.7c-0.1,0-0.1-0.1-0.2-0.1
	c-0.2,0-0.3,0.1-0.4,0.3c0,0.2,0.1,0.2,0.2,0.3c0.1,0,0.2,0.1,0.4,0.1c1.6,0.8,2.7,2,3.1,3.8c0.2,0.9,0.7,1.5,1.4,2
	c0.5,0.3,0.8,0.7,1,1.2c0.2,0.3,0.3,0.6,0.4,0.9c0.3-0.3,0.5-0.2,0.8-0.2c0.4,0,0.8-0.1,1.2-0.2c0.3-0.5,0.8-0.7,1.3-0.9
	c0.8-0.4,1.6-0.9,2.4-1.3c0.2-0.1,0.4-0.3,0.6-0.2c0.3,0.1,0.5,0,0.7-0.1c0.4-0.2,0.8-0.4,1.1-0.7c0.5-0.4,1.1-0.5,1.8-0.5
	c0.2,0,0.4,0.2,0.6,0.3c0.3,0.2,0.5,0.3,0.9,0.3c0.5,0,1,0,1.6,0c0-0.1,0.1-0.3,0.2-0.4c0.1-0.2,0.1-0.3,0.2-0.4
	c0.1-0.2,0.7-0.2,0.9,0c0,0,0,0.1,0,0.2c0,0.4-0.1,0.7-0.1,1.1c-0.1,0.6-0.1,1.2-0.8,1.5c-0.5,0.2-1,0.4-1.6,0.6
	c-0.6,0.2-1.3,0-1.9-0.2c-0.7-0.2-1.4,0.2-1.6,0.9c-0.1,0.3-0.1,0.6-0.2,0.9c-0.2,0.7-0.6,1.3-1.3,1.6c-1,0.4-1.9,0.8-2.9,1.2
	c-0.6,0.3-1.2,0.6-1.8,0.8c-0.5,0.2-1.1,0.3-1.7,0.4c-0.4,0.1-0.7,0.2-1.1,0.2c0,0.1,0,0.2,0,0.3c0.1,1.6,0.2,3.2,0.2,4.7
	c0,0.7-0.1,1.4-0.5,2.1c-0.2,0.3-0.2,0.8-0.1,1.1c0,0.4,0,0.5-0.4,0.7c-0.4,0.1-0.8,0.2-1.3,0.3c-0.2,0-0.4,0.1-0.4,0.3
	c-0.1,0.7-0.4,1.4-0.4,2.1c0,1.9-0.7,3.6-1.3,5.3c-0.3,0.7-0.5,1.3-0.5,2c-0.1,0.6,0,1.1-0.1,1.7c-0.1,0.9-0.5,1.8-1,2.6
	c-0.1,0.1-0.1,0.2-0.1,0.3c0,1.1,0,2.1,0,3.2c0,0.3,0,0.6,0,0.8c0.4,0,0.7,0,1.1,0.1c0.7,0.1,0.9,0.3,1,1c0,0.1,0,0.1,0,0.2
	c0,0.9-0.1,1.8-0.1,2.7c0,0.1,0,0.2,0,0.3c0,0.3,0.1,0.5,0.1,0.8c0,0.5,0.2,0.8,0.4,1.2c0.5,0.7,1.2,0.9,2.1,1
	c0.5,0,1.1,0.1,1.6,0.3c0.5,0.2,0.9,0.5,1,1.1c0,0.1,0,0.1,0.1,0.2c0.2,0.6,0.1,1-0.4,1.3c-0.4,0.3-0.8,0.4-1.3,0.6
	c-0.2,0.1-0.3,0.2-0.2,0.4c0.1,0.2,0,0.5-0.1,0.7c-0.3,0.8-1,1.3-1.8,1.7c-1.1,0.5-2.2,0.5-3.4,0.3c-0.5-0.1-1.1-0.1-1.6-0.3
	c-0.8-0.4-1.5-0.5-2.4-0.3c-0.9,0.2-1.9,0-2.7-0.5c-0.3-0.2-0.6-0.4-0.6-0.9c0-0.6,0.1-1.2,0.2-1.8c0.1-0.5,0.4-1,0.3-1.6
	c0-0.5,0-1,0-1.5c0-1,0.1-2.1-0.1-3.1c-0.1-0.3-0.1-0.7,0.2-0.9c0.3-0.2,0.2-0.3,0.2-0.6c-0.3-1.5-0.2-3,0-4.5
	c0.1-0.8,0.3-1.7,0.4-2.5c0.1-1.5,0.4-2.9,0.7-4.3c0.2-1.1,0.4-2.2,0.6-3.3c0-0.2,0-0.5,0.1-0.7c0-0.1,0-0.2,0-0.4
	c0-0.1-0.1-0.2-0.1-0.4c0-0.2,0-0.4,0-0.5c0-0.7-0.4-1.3-0.7-2c-0.7-2-0.7-3.9,0.4-5.7c0.1-0.1,0.1-0.2,0-0.3
	c-0.2-0.2-0.1-0.3,0-0.5c0.4-0.3,0.6-0.8,0.7-1.2c-0.3-0.2-0.6-0.4-0.9-0.6c-1.1-1.1-1.3-2.5-1-3.9c0.2-1.3,0.3-2.7-0.1-4
	c-0.3-1.3-0.7-2.5-0.6-3.8c0-1,0.2-2,0.3-3c0.1-0.5,0.1-1,0.4-1.4c0.3-0.3,0.3-0.7,0-1.1c-0.4-0.7-0.2-1.2,0.5-1.5
	c0.4-0.2,0.4-0.3,0.4-0.7c0-0.2-0.1-0.4-0.1-0.6c-0.2,0.3-0.4,0.6-0.7,0.9c0,0-0.1,0-0.1,0c0.2-0.3,0.3-0.7,0.1-1.1
	c-0.1,0.2-0.3,0.4-0.4,0.6c0-0.1,0-0.1,0-0.2c0.2-0.6,0.1-1.1-0.2-1.6c-1.2-1.9-1.3-3.8-0.4-5.9c0.1-0.3,0.3-0.6,0.4-0.8
	c-0.3-0.1-0.4-0.3-0.4-0.7c0-0.1,0-0.1-0.1-0.2c-0.4-0.3-0.5-0.7-0.3-1.2c-0.6-0.1-1.2,0-1.6,0.5c0-0.1,0.1-0.2,0.1-0.3
	c0.3-0.2,0.6-0.3,0.9-0.5C113.5,350.6,112.9,350.8,112.5,351.3z"/>
<g>
	<g>
		<path style="fill:#404040;" d="M382.3,389.1L382.3,389.1C382.3,389.1,382.3,389.1,382.3,389.1z"/>
		<path style="fill:#404040;" d="M393.2,410.2c-0.2-1.1-0.2-2.2-0.1-3.2c0.1-0.8,0.1-1.6-0.1-2.3c-0.3-1-0.4-1.9-0.5-2.9
			c-0.1-0.7-0.1-1.3-0.4-1.9c-0.4-0.8-0.8-1.6-1.2-2.3c-0.8-1.4-1.8-2.6-3.1-3.6c-0.4-0.3-0.9-0.6-1.3-0.9c0,0,0,0,0,0
			c0.3,0.1,0.5,0.2,0.8,0.2c-0.7-0.4-1.6-0.5-2.2-1c0.4,0,0.7,0.1,1.1,0.2c0.3,0.1,0.6-0.1,0.7-0.4c-0.3,0.4-0.6,0.3-1,0.2
			c-0.2-0.1-0.3-0.1-0.5-0.2c-0.6-0.1-0.8-0.5-1.2-1c0.2,0,0.4,0.1,0.6,0.1c0,0,0-0.1,0-0.1c-0.7,0-1.2-0.6-1.7-0.9c0,0,0-0.1,0-0.1
			c0.6,0.2,1.3,0.4,1.9,0.6c-0.4-0.2-0.8-0.5-1.3-0.6c-0.6-0.1-1.1-0.4-1.5-0.9c0,0,0.1,0,0.1,0c-0.3-0.3-0.6-0.6-0.9-1
			c0,0,0,0,0-0.1c0.2,0.1,0.3,0.1,0.5,0.2c0,0,0-0.1,0-0.1c-0.3-0.3-0.8-0.2-1-0.6c-0.1-0.2-0.4-0.3-0.6-0.5c0,0-0.1,0-0.2-0.1
			c0,0,0.1-0.1,0.1-0.1c0.8,0.3,1.6,0.5,2.4,0.8c-0.1,0-0.2-0.1-0.2-0.2c-0.9-0.5-1.9-0.8-2.9-1.1c-0.4-0.1-0.7-0.3-1.1-0.5
			c0,0,0,0,0-0.1c0.2,0,0.4,0,0.6,0c-0.1-0.1-0.3-0.1-0.4-0.1c-0.4,0-0.8,0-1.1-0.2c-0.3-0.1-0.6-0.2-0.9-0.2
			c-0.3-0.1-0.6-0.1-0.9-0.1c0,0,0,0,0-0.1c0.3-0.1,0.6-0.2,0.9-0.3c0,0,0,0,0-0.1c-0.6,0.2-1.2,0.3-1.8,0.5c0-0.2,0-0.2,0.1-0.3
			c-0.1,0.1-0.2,0.2-0.3,0.3c-0.4,0.2-0.8,0.3-1.3,0.4c0.1-0.2,0.3-0.4,0.4-0.5c0,0,0,0,0,0c-0.3,0.4-0.6,0.8-1,1.3
			c0-0.2-0.1-0.3-0.1-0.4c-0.1,0.2-0.1,0.3-0.1,0.5c0,0.3-0.2,0.4-0.5,0.4c-0.4-0.1-0.8-0.1-1.2,0.1c0.4,0,0.8-0.1,1.2,0.1
			c-0.3,0.5-0.9,0.7-1.1,1.3c0.1-0.1,0.2-0.3,0.3-0.4c0,0.2-0.1,0.4-0.1,0.5c-0.1,0.4-0.2,0.7-0.5,1c-0.1,0.2-0.2,0.4-0.3,0.6
			c0,0,0,0,0,0c0.2-0.2,0.4-0.5,0.6-0.7c0,0.4-0.1,0.7-0.1,1.1c0,0,0,0,0.1,0c0-0.1,0-0.2,0.1-0.4c0.4,0.7-0.1,1.1-0.3,1.7
			c0.1-0.1,0.2-0.3,0.4-0.4c0,0,0,0,0.1,0c-0.1,0.4-0.2,0.7-0.4,1.1c0.1,0,0.1-0.1,0.2-0.1c0,0.5-0.1,0.9-0.1,1.3
			c0,0.4,0.1,0.8,0.1,1.2c0,0,0,0,0.1,0c0-0.4,0-0.7-0.1-1.1c0.2,0.3,0.3,0.6,0.4,1c0.1,0.3,0.3,0.6,0.5,0.9
			c0.2,0.3,0.4,0.6,0.6,0.9c0.2,0.3,0.4,0.5,0.6,0.8c-0.2-0.5-0.5-0.9-0.7-1.3c-0.2-0.4-0.4-0.9-0.6-1.4c0,0,0.1,0,0.1,0
			c0.1,0.1,0.1,0.3,0.2,0.4c0.1,0.1,0.2,0.3,0.2,0.4c0.1,0.1,0.2,0.2,0.3,0.4c-0.5-1.2-0.6-1.6-0.5-1.9c0.1,0.2,0.3,0.5,0.4,0.7
			c-0.2-0.6-0.4-1.1-0.3-1.7c0.2,0.5,0.4,1,0.6,1.4c0,0,0,0,0.1,0c-0.1-0.2-0.1-0.4-0.2-0.5c0.2,0.2,0.3,0.4,0.5,0.6
			c0.4,0.6,0.8,1.2,0.6,2c-0.1,0.2,0.1,0.3,0.3,0.3c0.2,0,0.4-0.1,0.6-0.1c0.1,0,0.2,0,0.2,0.1c0.2,0.3,0.4,0.4,0.7,0.4
			c0.1,0.1,0.2,0.3,0.3,0.4c0.3,0.1,0.2,0.2,0.1,0.3c-0.3,0.3-0.6,0.6-0.9,0.9c-0.2,0.2-0.4,0.3-0.6,0.1c-0.1-0.1-0.3-0.1-0.4-0.2
			c-0.4-0.1-0.7,0-0.9,0.2c-0.3,0.3-0.5,0.5-0.8,0.8c-0.4,0.4-0.7,0.9-0.4,1.5c0,0.1,0.1,0.2,0.1,0.3c0.1,0.1,0,0.3,0,0.4
			c-0.2,0.3-0.4,0.7-0.4,1.1c-0.1,0.5,0.1,0.9,0.6,1.1c0.1,0,0.2,0.1,0.3,0.1c0,0.1-0.1,0.2-0.1,0.3c-1.1,2.3-2.1,4.5-3.2,6.8
			c-0.2,0.4-0.3,0.9-0.5,1.3c-0.3,0.5-0.5,1-0.8,1.5c-0.4,0.6-0.7,1.2-1.3,1.6c-1.2,0.9-2.5,1.5-3.9,2c-0.4,0.1-0.8,0.2-1.2,0.4
			c-0.3,0.1-0.3,0.4,0,0.6c0.2,0.1,0.4,0.2,0.6,0.2c1,0.2,2,0.2,3.1,0.1c0.4,0,0.8-0.1,1.1-0.2c0.8-0.3,1.6-0.3,2.4,0
			c0.5,0.2,1,0.3,1.6,0.3c0.8,0,1.1-0.3,1-1.2c0-0.1,0-0.1,0-0.2c-0.1-0.4-0.2-0.8-0.2-1.2c-0.1-0.3-0.1-0.6,0.1-0.9
			c0.3-0.4,0.5-0.8,0.7-1.2c0.1-0.1,0.2-0.4,0.4-0.4c0.2,0,0.3-0.1,0.4-0.2c0.1-0.1,0.1-0.2,0.2-0.2c1.1-1.3,2.1-2.5,3.2-3.8
			c0.8-1,1.3-2.2,1.7-3.4c0.1-0.4,0.2-0.7,0.3-1.2c1,3.4,2.1,6.6,3.9,9.5c-0.5,0.4-0.6,0.5-0.1,1.1c0.6,0.8,1.3,1.6,2,2.3
			c0.5,0.6,1.2,0.8,1.9,0.9c1.3,0.1,2.6,0.1,3.9,0c0.2,0,0.3-0.1,0.5-0.2c0.1,0,0.3-0.1,0.4-0.1c0.4,0.1,0.7,0,0.9-0.3
			c0.2-0.2,0.3-0.4,0.4-0.6c0.3-0.7,0.5-1.5,0.6-2.3c0-0.2,0.1-0.3,0.3-0.4c0.5-0.2,0.6-0.4,0.6-0.9c0-0.1,0-0.2,0-0.3
			c0-0.3,0.1-0.5,0.3-0.7c0.3-0.2,0.4-0.5,0.4-0.8C393.3,411.2,393.3,410.7,393.2,410.2z"/>
	</g>
</g>
<path style="fill:#404040;" d="M335.7,377.5c0,0.7,0.2,1.5,0.4,2.2c0.2,0.9,0.4,1.7,0.5,2.6c0.1,0.3,0.2,0.7,0.2,1
	c0,0.2,0,0.5,0,0.8c0,0.2,0.1,0.5,0.1,0.8c-0.2,0.3-0.2,0.5,0,0.8c0,0.1,0,0.2,0,0.2c0,0.5-0.1,0.9-0.2,1.4c0,0.6-0.1,1.2-0.1,1.8
	c0,0.2,0,0.5,0.1,0.7c0,0.2,0.2,0.3,0.4,0.3c0.2,0,0.2,0.1,0.2,0.2c0.1,0.2,0.1,0.5,0.2,0.7c0.1,0.2,0.3,0.4,0.6,0.3
	c0,0,0.2,0.1,0.2,0.2c0.1,0.1,0.1,0.3,0.1,0.4c0.1,0.2,0.3,0.3,0.5,0.2c0.2,0,0.2-0.2,0.2-0.4c0-0.4-0.1-0.9-0.1-1.3
	c0-0.1,0-0.2,0-0.3c0,0,0.1,0,0.1,0c0.1,0.3,0.1,0.6,0.2,1c0.1,0.4,0.2,0.7,0.3,1.1c-0.1,0.2-0.2,0.5-0.3,0.7
	c-0.9,2.7-0.2,5.6-0.5,8.5c-0.1,1.3-0.5,2.6-0.6,3.9c-0.1,1.3,0.1,2.5,0.3,3.8c0.2,1.5,0.4,2.9,0.6,4.4c-0.1,0.3-0.1,0.6,0,0.9
	c0.1,0.4,0.1,0.8,0.2,1.2c0,0.2,0.1,0.3,0.2,0.5c0.1,0.1,0.1,0.1,0.1,0.2c0,0.6,0.1,1.1,0.1,1.7c0,0.2,0,0.4,0,0.7
	c0,0.2,0.1,0.4,0.2,0.5c0,0.1,0.1,0.1,0.1,0.2c0.1,0.3,0.4,0.5,0.6,0.7c0.2,0.2,0.4,0.3,0.6,0.5c0.2,0.4,0.6,0.7,1.2,0.8
	c0.2,0,0.3,0.1,0.5,0.1c0.4,0.2,0.7,0.3,1.1,0.4c0.2,0,0.4,0.1,0.6,0.1c0.2,0.1,0.4,0.1,0.6,0.1c0.8,0.1,1.8,0.1,2.2-0.4
	c0.6-0.8-0.3-2.1-0.7-2.8c-0.7-1.3-1.5-2.5-1.9-3.9c-0.1-0.5-0.2-1-0.4-1.5c0.1-0.2,0-0.2-0.1-0.4c0-0.3,0-0.5,0-0.8
	c-0.1-2.1-0.1-4.2,0-6.3c0.1-2,0.3-4,0.5-6c0.1-0.1,0.2-0.2,0.2-0.3c0.2-0.3,0.2-0.7,0.2-1.2c0-0.2-0.1-0.4-0.1-0.6
	c0.2-1.1,0.4-2.2,0.6-3.3c0,0,0,0,0,0c0.1-0.4,0.2-0.8,0.2-1.2c0-0.2,0.1-0.4,0.1-0.6c0-0.1,0-0.1,0-0.2c0,0,0-0.1,0-0.1
	c0-0.2,0-0.4,0-0.6c0-0.1,0.1-0.2,0.1-0.3c0,0,0.1-0.1,0.1-0.1c0.1,0,0.2,0.1,0.2,0.1c0.1,0.3,0.2,0.7,0.2,1c0,0.3,0,0.7-0.1,1
	c-0.2,0.7-0.1,1.4,0.3,2c0.1,0.3,0.3,0.5,0.4,0.8c0,0.8,0.1,1.5,0.2,2.3c0,0.7,0,1.5,0,2.2c0,0.1,0,0.1,0,0.2
	c-0.1,1.5,0.3,3,0.4,4.5c0,0.6,0.1,1.2,0.1,1.9c0,0.7-0.1,1.4-0.3,2.1c-0.2,1-0.3,2.2,0.5,2.7c0.2,0.1,0.3,0.2,0.5,0.2
	c-0.1,0.5-0.1,1.1,0,1.6c0,0.4,0.1,0.9,0.2,1.3c-0.1,0.8-0.1,0.9,0.5,1c0.1,0.1,0.1,0.1,0.2,0.2c0.6,0.5,1.5,0.5,2.3,0.5
	c1,0,2.1-0.1,3.1-0.1c0.2,0,0.4,0.1,0.5,0.1c1.3,0.1,2.6,0.1,3.9-0.3c0.2-0.1,0.5-0.2,0.7-0.3c0.1-0.1,0.2-0.2,0.2-0.3
	c0.1-0.1,0.1-0.2,0.1-0.3c0-0.4-0.5-0.6-0.9-0.7c-1.5-0.4-2.9-1-4.2-1.9c-0.5-0.4-1-0.8-1.5-1.3c0.2-0.5,0.2-0.7,0-1
	c0.2-0.7,0-1.6-0.1-2.3c-0.3-5.9-0.6-11.8,0.3-17.6c0.1-0.6,0.2-1.2,0.1-1.7c0.2,0,0.3-0.1,0.5-0.3c0.2-0.2,0.4-0.5,0.5-0.7
	c0.1-0.3,0.2-0.5,0.3-0.8c0.1-0.3,0.1-0.6,0.1-0.9c0-0.4-0.1-0.8-0.2-1.1c-0.1-0.5-0.4-0.9-0.6-1.4c-0.1-0.1-0.1-0.3,0-0.4
	c0.2,0,0.2-0.2,0.2-0.5c0-0.3,0-0.7,0-1c-0.3-4.1,0-8.2,0-12.3c0-0.1,0-0.1,0-0.2c0-0.3,0-0.7,0-1c0-0.1,0-0.3,0.1-0.4
	c0.7-1.7,0.7-3.5,0.7-5.3c0-0.7-0.1-1.3-0.5-1.9c-0.2-0.2-0.3-0.4-0.5-0.6c-0.1-0.2-0.2-0.3,0-0.4c0.2-0.2,0.5-0.3,0.5-0.7
	c0-0.2,0.7-0.3,1-0.2c0.3,0.2,0.6,0.1,0.7-0.3c0.1-0.2,0.2-0.5,0.3-0.7c0.1-0.3,0.2-0.5,0.5-0.5c0.7-0.1,1-0.6,1.2-1.2
	c0.1-0.3,0.2-0.6,0.3-0.8c0.1-0.3,0.2-0.6,0.5-0.8c0.4-0.2,0.4-0.9,0.2-1.3c-0.1-0.1-0.1-0.3-0.1-0.5c0,0,0-0.1,0-0.1
	c-0.3-0.3,0-0.9-0.4-1.2c-0.1-0.1-0.1-0.3-0.2-0.5c-0.1-0.2-0.3-0.4-0.5-0.6c-0.1-0.2-0.2-0.3-0.4-0.5c-0.1-0.1-0.1-0.2-0.2-0.3
	c-0.4-0.2-0.8-0.5-1.3-0.6c-0.6-0.2-1.1-0.2-1.7-0.1c-0.3,0.1-0.7,0.1-1,0.2c0,0-0.1,0-0.1,0c-0.5,0.2-0.9,0.5-1.4,0.8
	c-1,0.6-1.3,1.6-1.5,2.6c-0.1,0.6-0.3,1.2-0.7,1.6c-0.1,0.1-0.2,0.3-0.3,0.4c-0.2,0.1-0.4,0.3-0.7,0.2c-0.3-0.1-0.5,0-0.7,0.2
	c-0.3,0.4-0.7,0.7-1.1,1.1c-0.2,0.2-0.5,0.3-0.8,0.3c-1.5,0.3-2.9,0.7-4.1,1.5c-1.2,0.7-2.1,1.7-2.7,2.9c-0.6,1.3-1.2,2.7-1.7,4.1
	c-0.2,0.6-0.3,1.3-0.4,1.9c-0.4,2.1-0.9,4.1-1.6,6.1C335.9,374.4,335.6,375.9,335.7,377.5z M341.9,371.6c-0.6,1.1-0.8,2.3-0.8,3.6
	c0,0.8-0.1,1.6-0.6,2.3c0-0.1,0-0.2,0-0.3c0.1-0.8,0.3-1.6,0.4-2.5c0.2-1.2,0.3-2.4,0.8-3.5c0.1-0.1,0.1-0.3,0.2-0.5
	C342,371.1,342.1,371.4,341.9,371.6z"/>
<path style="fill:#404040;" d="M103.7,260.1c0.4,0.3,0.8,0.7,1.3,1c0.2,0.1,0.2,0.2,0.2,0.4c-0.3,1.2-0.6,2.5-0.8,3.7
	c-0.1,0.7-0.2,1.5-0.2,2.2c-0.1,1.9,0.3,3.8,0.4,5.7c0.2,1.9,0.4,3.8,0.2,5.7c-0.1,1.2,0.2,2.2,0.9,3.2c0.3,0.4,0.8,0.6,1.2,0.9
	c0.1,0,0.2,0,0.3-0.1c0.1,0,0.2-0.2,0.2-0.2c0.1,0.1,0.3,0.1,0.3,0.2c0.1,0.3,0,0.5,0.1,0.8c0.1,1.2,0.2,2.4,0.4,3.5
	c0.1,0.9,0.2,1.8,0.4,2.7c0.2,1.1-0.1,2.2-0.1,3.3c-0.1,1.4-0.1,2.9-0.1,4.3c0,0.6,0.1,1.2,0.1,1.8c0,0.6-0.1,1.3-0.2,1.9
	c-0.1,0.5-0.2,0.9,0.1,1.4c0.1,0.2,0.1,0.4,0.2,0.6c0.1,0.2,0.2,0.4,0.4,0.6c0.3,0.2,0.2,0.4,0.1,0.7c-0.1,0.3-0.2,0.5-0.3,0.8
	c-0.1,0.5-0.2,1-0.3,1.5c-0.1,0.8,0.3,1.4,0.9,1.8c0.6,0.4,1.3,0.7,2.1,0.7c0.6,0,1-0.3,1.4-0.8c0.3-0.5,0.4-0.9,0.3-1.5
	c-0.1-0.4,0-0.9,0-1.3c0-0.2,0.1-0.3,0.2-0.5c0.1-0.3,0.2-0.5,0.3-0.8c0.1-0.4,0.2-0.8,0.3-1.1c0.1-0.6,0.2-1.2,0.2-1.8
	c0-1.2-0.2-2.5-0.2-3.7c0-0.1,0-0.2-0.1-0.2c-0.2-0.4-0.1-0.7,0-1.1c0.3-0.7,0.3-1.3,0.2-2c-0.1-0.9-0.1-1.8,0.2-2.7
	c0.3-1,0.5-2,0.8-2.9c0.2-0.7,0.5-1.3,0.7-1.9c0.2-0.7,0.3-1.5,0.5-2.2c0,0,0-0.1,0.1-0.1c0,0.2,0,0.5,0,0.7
	c0.1,0.9,0.1,1.8,0.2,2.6c0.1,0.8,0.1,1.5,0.2,2.3c0.1,0.6,0.2,1.3,0.3,1.9c0.2,1.2,0.4,2.4,0.3,3.7c-0.1,0.7-0.2,1.3-0.2,2
	c0,0.1,0,0.3,0,0.4c0.2,0.6,0,1.3,0,1.9c0,0.8-0.1,1.6-0.1,2.4c0,0.4,0.2,0.6,0.5,0.9c0.5,0.6,1,1.1,1.8,1.3
	c0.5,0.1,0.6,0.4,0.7,0.8c0.2,0.9,0.4,1.7,0.8,2.5c0.5,0.9,1.3,1.3,2.2,1.4c0.2,0,0.5,0,0.7-0.1c0.1-0.1,0.1-0.3,0.2-0.4
	c0.3,0,0.6-0.1,0.8-0.4c0.3-0.4,0.5-0.8,0.4-1.4c-0.1-0.2-0.1-0.5-0.2-0.7c-0.3-0.9-0.7-1.8-1.3-2.5c-0.3-0.4-0.6-0.9-0.8-1.4
	c0-0.1-0.1-0.2,0-0.3c0.1-0.6,0-1.1,0-1.6c-0.1-0.5,0-1,0-1.5c0-0.9-0.1-1.9,0-2.8c0-0.7,0.1-1.3,0.1-2c0-0.8,0-1.6,0.1-2.3
	c0-0.4,0.1-0.9,0.1-1.3c0.1-1.1,0.1-2.3,0.2-3.4c0.1-1.1,0.2-2.3,0.3-3.4c0-0.5,0.1-0.9,0.5-1.3c0.3-0.3,0.4-0.7,0.5-1.1
	c0,0,0,0,0,0c0.3-0.4,0.5-0.8,0.3-1.3c0,0,0,0,0,0c0-0.3,0-0.6,0-0.8c0-1,0-2,0.2-3c0.2-1.5,0.5-3.1,0.7-4.6
	c0.1-0.9,0.2-1.8,0.3-2.8c0.1-1.2-0.1-2.4-0.4-3.7c-0.3-1.1-0.4-2.2-0.6-3.3c0-0.2,0-0.3,0.2-0.3c0.4-0.2,0.8-0.4,1.2-0.6
	c0.3-0.1,0.3-0.3,0.2-0.6c-0.5-1.6-0.9-3.1-1.6-4.6c-0.6-1.2-1.4-2.1-2.8-2.4c-0.9-0.2-1.8-0.6-2.6-1c-0.1,0-0.1-0.1-0.2-0.1
	c-0.3-0.3-0.6-0.6-0.9-0.9c-0.2-0.2-0.2-0.4,0-0.5c0.6-0.6,1-1.3,1.2-2c0-0.1,0.2-0.1,0.2-0.2c0.2-0.1,0.4-0.2,0.5-0.3
	c0.3-0.5,0.6-1,0.8-1.5c0.1-0.2,0.1-0.5,0.1-0.7c0-0.1,0-0.2-0.1-0.3c-0.3-0.2-0.2-0.4-0.2-0.7c0.2-1,0.2-2,0.2-3
	c0-0.6-0.2-1.2-0.6-1.7c-0.3-0.4-0.6-0.9-1.1-1.2c-1.1-0.6-2.2-0.9-3.4-0.8c-0.3,0-0.7-0.1-1,0c-0.8,0.1-1.5,0.4-2.1,0.9
	c-0.3,0.3-0.6,0.6-0.9,0.9c-0.2,0.2-0.4,0.5-0.6,0.8c-0.3,0.4-0.3,0.9-0.4,1.4c-0.1,0.7-0.1,1.4-0.1,2.1c0,0.2,0,0.3-0.3,0.3
	c-0.1,0-0.3,0.2-0.3,0.3c-0.2,0.6-0.1,1.2,0.2,1.7c0.2,0.3,0.4,0.7,0.6,1c0.3,0.4,0.5,0.4,1,0.2c0.1,0.2,0.1,0.4,0.2,0.6
	c0.2,0.7,0.3,1.3,0.5,2c0.1,0.2,0,0.4-0.3,0.4c-0.4,0.1-0.8,0.4-1,0.8c-0.1,0.3-0.4,0.4-0.7,0.4c-1.2,0.3-2.4,0.7-3.6,1.2
	c-0.7,0.3-1.2,0.8-1.5,1.5c-0.6,1.2-1.2,2.3-1.6,3.6c-0.1,0.4-0.4,0.7-0.5,1C103.5,259.8,103.5,259.9,103.7,260.1z M121.8,266.8
	c0.1-1.1,0.2-2.1,0.3-3.2c0-0.1,0-0.1,0.1-0.2c0,0,0,0,0.1,0c0.5,2.6,0.4,5.3,0.5,8c-0.2-0.3-0.3-0.7-0.3-1.1c0-0.5,0-1.1,0.1-1.6
	c0-0.4-0.1-0.7-0.4-0.9C121.8,267.5,121.7,267.1,121.8,266.8z M106.6,274.5c0.1-2,0.3-4,0.4-6c0.1-0.9,0.1-1.8,0.2-2.7
	c0.1-0.9,0.3-1.8,0.5-2.8c0.1-0.4,0.2-0.9,0.3-1.3c0,0,0.1,0,0.1,0c0,0.3,0.1,0.5,0.1,0.8c0.2,1.7,0.1,3.5-0.1,5.2
	c-0.1,0.5-0.1,1.1-0.2,1.6c0,0.3,0,0.6-0.1,0.8c-0.1,0.5-0.2,0.9,0,1.4c0.2,0.4,0.1,0.7-0.1,1.1c-0.2,0.5-0.5,1-0.7,1.5
	c-0.1,0.2,0,0.4,0.1,0.6c0.1,0.1,0.2,0.2,0.3,0.3c0.3,0.2,0.3,0.4,0.3,0.8c0,1.3,0,2.6-0.1,3.9c0,0.2,0,0.5,0,0.7
	c-0.7-0.5-0.8-0.7-0.7-1.4c0.1-0.8,0.1-1.6-0.2-2.4C106.5,276,106.5,275.3,106.6,274.5z"/>
<rect x="57.7" y="968.5" style="fill:none;stroke:#262626;stroke-width:0.65;stroke-miterlimit:10;" width="484.7" height="220.6"/>
<rect x="212.1" y="604.6" style="fill:#EA341C;" width="49.6" height="41.7"/>
<g>
	<text transform="matrix(1 0 0 1 220.4635 634.978)" style="fill:#FFFFFF; font-family:'FuturaLT-Bold'; font-size:24.7px;">21</text>
</g>
<text transform="matrix(1 0 0 1 272.4503 631.9429)" style="fill:#262626; font-family:'FuturaLT-Bold'; font-size:19.5px;">Defendants</text>
<g>
	<text transform="matrix(1 0 0 1 158.0881 766.4429)"><tspan x="0" y="0" style="fill:#262626; font-family:'FuturaLT'; font-size:20.8px;">Under </tspan><tspan x="0" y="25" style="fill:#262626; font-family:'FuturaLT'; font-size:20.8px;">arrest </tspan></text>
</g>
<g>
	<text transform="matrix(1 0 0 1 158.0881 738.292)" style="fill:#EA341C; font-family:'FuturaLT-Bold'; font-size:24.7px;">8</text>
</g>
<g>
	<text transform="matrix(1 0 0 1 431.8879 766.4112)" style="fill:#262626; font-family:'FuturaLT'; font-size:20.8px;">Let go </text>
</g>
<g>
	<text transform="matrix(1 0 0 1 431.8879 738.2603)" style="fill:#EA341C; font-family:'FuturaLT-Bold'; font-size:24.7px;">7</text>
</g>
<g>
	<text transform="matrix(1 0 0 1 153.9875 881.4429)"><tspan x="0" y="0" style="fill:#262626; font-family:'FuturaLT'; font-size:20.8px;">Convicted </tspan><tspan x="0" y="25" style="fill:#262626; font-family:'FuturaLT'; font-size:20.8px;">(at large)</tspan></text>
</g>
<g>
	<text transform="matrix(1 0 0 1 153.9875 853.292)" style="fill:#EA341C; font-family:'FuturaLT-Bold'; font-size:24.7px;">1</text>
</g>
<g>
	<text transform="matrix(1 0 0 1 430.6897 881.4429)"><tspan x="0" y="0" style="fill:#262626; font-family:'FuturaLT'; font-size:20.8px;">At </tspan><tspan x="0" y="25" style="fill:#262626; font-family:'FuturaLT'; font-size:20.8px;">liberty</tspan></text>
</g>
<g>
	<text transform="matrix(1 0 0 1 430.6897 853.292)" style="fill:#EA341C; font-family:'FuturaLT-Bold'; font-size:24.7px;">1</text>
</g>
<rect x="59" y="589.5" style="fill:none;stroke:#262626;stroke-width:0.65;stroke-miterlimit:10;" width="482.5" height="345"/>
<g>
	<g>
		<path style="fill:#404040;" d="M368.3,834.9c0-0.7-0.1-1.2-1-1.4c-5.8-1.4-11.7-2.8-17.5-4.1c-1.2-0.3-2.1,0.2-2,1.5
			c0.1,1.1,0,2.1,0,3.3h-24.4c-0.2,1.2,0.7,0.6,1.2,1c0,1.8,0,3.7,0,5.6c0,0.2-0.2,0.3-0.3,0.4c-0.3,0.2-0.6,0.3-0.9,0.5
			c0.3,0.1,0.7,0.2,1,0.4c0.1,0,0.1,0.1,0.2,0.1v13.1c-0.5,0.1-0.8,0.2-1.2,0.3c0,0.1,0,0.2,0,0.3c0.4,0.1,0.8,0.1,1.3,0.2v1.1
			c0,3.7,0,7.5,0,11.2c0,0.9-0.2,1.4-1.2,1.3c0,0,0,0.1-0.1,0.2c0.4,0.1,0.8,0.1,1.3,0.2v13.4c-0.6,0.1-0.9,0.2-1.3,0.3
			c1.3,0.6,1.3,0.6,1.3,2.1c0,3.4,0,6.8,0,10.2c0,1.3,0,1.3-1.3,1.7c-0.1,1,0.8,0.4,1.2,0.7c0.1,1.8,0.1,3.7,0.1,5.5
			c0,0.2-0.4,0.4-0.6,0.6c-0.2,0.2-0.5,0.4-0.8,0.5c0,0.1,0.1,0.2,0.1,0.3h17c2.2,0,4.3,0,6.5,0c0.7,0,0.9,0.2,0.8,0.9c0,1,0,2,0,3
			c0,0.7,0.3,1.1,0.9,1.1c0.4,0,0.8,0,1.2,0c3.9-0.9,7.9-1.9,11.8-2.9c2.2-0.5,4.4-1.1,6.6-1.6V852
			C368.3,846.3,368.3,840.6,368.3,834.9z M345.8,868.7c0,0.8-0.2,1-1,1c-2.1-0.1-1.8,0.3-1.8-1.8c0-3.6,0-7.2,0-10.7V856h2.7
			c0,0.8,0.1,1.5,0.1,2.3C345.8,861.8,345.7,865.2,345.8,868.7z M345.7,870.7c0,3.9,0,7.9,0,11.8c0,0.3-0.1,0.7-0.3,1.1h-2.1
			c-0.1,0-0.2,0-0.3,0V870h2.6C345.7,870.3,345.7,870.5,345.7,870.7z M343,839.3c0-1.2,0-2.4,0-3.6c0-0.6,0.2-0.8,0.7-0.7
			c0.6,0,1.2,0,2,0c0,2,0,3.9,0,5.7c0,0.2-0.3,0.3-0.5,0.5c0,0-0.1,0-0.2,0C342.5,841.2,343,841.5,343,839.3z M344,842
			c2.1,0.1,1.8-0.3,1.8,1.8c0,3.5,0,7,0,10.5v1.2h-2.7c0-0.3-0.1-0.6-0.1-0.8c0-3.9,0-7.7,0-11.6C343,842.2,343.2,842,344,842z
			 M340.2,835c2.5,0.1,2-0.3,2,2c0,0.4,0,0.8,0,1.2c0,0,0,0,0,0c0,0.8,0,1.7,0,2.5c0,0.2-0.4,0.4-0.6,0.6c0,0-0.1,0-0.2,0
			c-2.4,0-1.9,0.3-2-1.9c0-1.2,0-2.4,0-3.6C339.4,835.2,339.6,835,340.2,835z M336,839.4c0-1.3,0-2.6,0-4c0-0.1,0.1-0.2,0.1-0.3
			c0.1,0,0.2-0.1,0.2-0.1c2.4-0.2,2.4-0.2,2.4,2.2c0,1.1,0,2.2,0,3.2c0,0.6-0.1,0.8-0.8,0.8C335.5,841.2,336,841.5,336,839.4z
			 M336.9,842c0.5,0.1,1.1,0,1.7,0v13.4H336c0-0.3-0.1-0.6-0.1-0.8c0-3.9,0-7.7,0-11.6C335.9,842.2,336.2,841.9,336.9,842z
			 M332.5,835.1h2.6v6.1h-2.6V835.1z M332.5,842h2.6v13.3h-2.6V842z M332.4,856h2.7v13.6c-0.6,0-1.1,0.1-1.6,0.1h-1V856z M329.7,835
			c2.4,0.1,1.9-0.3,2,1.9c0,0.4,0,0.9,0,1.3c0,0.8,0,1.5,0,2.3c0,0.5-0.1,0.7-0.7,0.7c-2.1,0.1-2.1,0.1-2.1-1.9c0-1.2,0-2.4,0-3.5
			C328.9,835.2,329.1,835,329.7,835z M328.9,842.7c0-0.6,0.2-0.8,0.7-0.8c0.6,0,1.2,0,1.9,0v13.3H329v-8.5
			C329,845.5,329,844.1,328.9,842.7z M328.9,857V856h2.7v13.6c-0.2,0-0.5,0-0.7,0.1h-1.7c-0.3-0.2-0.3-0.6-0.3-1
			C329,864.7,328.9,860.8,328.9,857z M325.9,855.4c-0.2,0-0.4-0.4-0.4-0.5c0-4.1,0-8.1,0-12.2c0-0.2,0.3-0.6,0.5-0.6
			c0.7-0.1,1.3,0,2.1,0v13.4C327.4,855.4,326.6,855.4,325.9,855.4z M328.1,856v13.6c-0.7,0-1.5,0-2.2,0c-0.2,0-0.5-0.3-0.5-0.5
			c0-4.3,0-8.6,0-13.1H328.1z M326.1,835c0.6,0,1.3,0,2,0v6.1c-0.1,0.1-0.2,0.1-0.3,0.1c-2.4,0.2-2.4,0.2-2.4-2.2c0-1.1,0-2.2,0-3.3
			C325.4,835.2,325.6,835,326.1,835z M328.1,904.6c-0.7,0-1.5,0-2.1,0c-0.2,0-0.5-0.4-0.5-0.6c0-1.8,0-3.6,0-5.6h2.7V904.6z
			 M328.1,897.5c-0.2,0.1-0.2,0.1-0.3,0.1c-2.4,0.2-2.4,0.2-2.4-2.2c0-3.4,0-6.8,0-10.2c0-0.9,0.3-1.2,1.1-1.1c0.5,0.1,1,0,1.6,0
			V897.5z M328.2,883.5c-0.2,0.1-0.3,0.1-0.3,0.1c-2.4,0.2-2.4,0.2-2.4-2.2c0-2.1-0.1-4.2-0.1-6.4c0-1.6,0-3.3,0-5h2.9V883.5z
			 M331.7,904.2c0,0.1-0.3,0.4-0.5,0.4c-0.6,0.1-1.2,0.1-1.8,0c-0.2,0-0.5-0.3-0.5-0.5c0-1.8,0-3.7,0-5.7h2.7
			C331.7,900.4,331.7,902.3,331.7,904.2z M330.6,897.6c-0.5-0.1-1,0-1.7,0v-2.9c0-3.2,0-6.4,0-9.6c0-0.7,0.1-0.9,0.9-0.9
			c2.3,0.1,1.9-0.3,1.9,1.8c0,3.5,0,7.1,0,10.6C331.7,897.4,331.5,897.8,330.6,897.6z M331.7,871.4c-0.1,3.7,0,7.4,0,11v1
			c-0.2,0.1-0.2,0.1-0.2,0.1c-2.5,0.3-2.5,0.3-2.5-2.2c0-1.9,0-3.7,0-5.6c0-1.6-0.2-3.3-0.1-4.9c0-0.3,0.2-0.6,0.5-0.9h2.1
			C331.7,870.3,331.7,870.8,331.7,871.4z M332.4,870.1h2.7v13.5h-2.7V870.1z M335.2,904.2c0,0.1-0.3,0.4-0.5,0.4c-0.7,0-1.4,0-2.2,0
			v-6.1h2.7C335.2,900.4,335.2,902.3,335.2,904.2z M335.2,897.5h-2.7v-13.4c0.7,0,1.5,0,2.2,0c0.2,0,0.4,0.3,0.4,0.4
			C335.2,888.9,335.2,893.2,335.2,897.5z M338.7,904.2c0,0.1-0.3,0.4-0.5,0.4c-0.6,0.1-1.2,0.1-1.8,0c-0.2,0-0.5-0.3-0.5-0.5
			c0-1.8,0-3.7,0-5.6h2.7C338.7,900.4,338.7,902.3,338.7,904.2z M337.7,897.6c-1.8,0-1.8,0-1.8-1.8v-11.6c2.8-0.4,2.8-0.4,2.8,2.1
			c0,3.4,0,6.9,0,10.3C338.7,897.4,338.5,897.7,337.7,897.6z M336,881.4V870h2.7v13.4c-0.1,0.1-0.2,0.1-0.2,0.1
			C336,883.8,336,883.8,336,881.4z M337.7,869.6c-0.1,0-0.2,0-0.3,0c-1.6,0-1.4,0.1-1.4-1.4c0-1-0.2-2.1-0.2-3.1
			c0.1-3,0.2-6.1,0.3-9.2h2.6c0,0.4,0,0.7,0,1c0,3.8,0,7.7,0,11.5C338.7,869.4,338.5,869.8,337.7,869.6z M340.5,842
			c1.7,0,1.7,0,1.7,1.7v11.7h-2.7c0-0.3-0.1-0.6-0.1-0.9c0-3.8,0-7.7,0-11.5C339.4,842.1,339.7,842,340.5,842z M342.2,904.2
			c0,0.1-0.2,0.4-0.4,0.4c-0.6,0-1.3,0.1-1.9,0c-0.2,0-0.4-0.3-0.4-0.5c0-1.9,0-3.7,0-5.7h2.8C342.2,900.4,342.2,902.3,342.2,904.2z
			 M341.4,897.6c-2.4-0.1-2,0.3-2-1.9c0-3.5,0-7,0-10.6c0-0.8,0.2-1,1-1c1.8,0,1.8,0,1.8,1.8v5c0,1.9,0,3.9,0,5.8
			C342.3,897.4,342.1,897.6,341.4,897.6z M341.3,883.6c-2.2-0.1-1.8,0.3-1.9-1.9c0-3.5,0-7,0-10.6v-1.1h2.7c0,0.3,0.1,0.6,0.1,0.9
			c0,3.9,0,7.8,0,11.8C342.3,883.4,342.1,883.7,341.3,883.6z M341.3,869.6c-2.1-0.1-1.8,0.3-1.8-1.8c0-3.6,0-7.2,0-10.7V856h2.7
			c0,0.3,0,0.6,0.1,0.9c0,3.9,0,7.8,0,11.7C342.3,869.4,342,869.7,341.3,869.6z M345.7,904.1c0,0.2-0.2,0.4-0.3,0.4
			c-0.7,0-1.4,0-2,0c-0.1,0-0.3-0.3-0.3-0.4c0-1.9,0-3.8,0-5.7h2.7C345.7,900.4,345.7,902.2,345.7,904.1z M345.7,886.8
			c0,3.3,0,6.6,0,9.9c0,0.7-0.2,0.9-0.9,0.9c-2.2-0.1-1.9,0.3-1.9-1.8c0-3.4,0-6.9,0-10.3c0-0.9,0.1-1.5,1.2-1.3c0.1,0,0.2,0,0.3,0
			c0,0,0,0,0.1-0.1h0.7c0,0,0,0,0,0c0.1,0.1,0.5,0.3,0.8,0.4C345.9,885.2,345.8,886,345.7,886.8z M346.5,835.1
			c1.3-0.2,1.3-0.2,1.3,0.9c0,1.7,0,3.4,0,5c-1.2,0.3-1.3,0.3-1.3-0.9C346.5,838.5,346.5,836.8,346.5,835.1z M347.7,842.1v13.3h-1.2
			v-13.3H347.7z M347.8,904.2c0,0.2-0.7,0.4-1.2,0.7v-6.4h1.2C347.8,900.4,347.8,902.3,347.8,904.2z M347.8,896.6
			c0,1.1,0,1.1-1.3,0.9v-13.3c0.4,0,0.7,0,1.2-0.1c0,0.4,0.1,0.7,0.1,1C347.8,889,347.8,892.8,347.8,896.6z M346.6,883.6v-13.5h1.2
			v13.5H346.6z M346.6,869.5V856h1.3v1c0,3.8,0,7.7,0,11.5C347.8,869.4,347.6,869.8,346.6,869.5z M362.1,838.9c0.1-1,0-2,0-3
			c0-0.9,0-0.9,1.2-0.8c0,1.5,0,2.9,0,4.3c0,0.2,0,0.4-0.1,0.5C362.4,840,362.1,839.7,362.1,838.9z M363.5,868.8v0.3
			c-0.1,0.1-0.2,0.2-0.3,0.4h-1v-1.6c0-0.2,0-0.4,0-0.5c0-3.4,0-6.8,0-10.2V856h1.2v12.8C363.4,868.8,363.4,868.8,363.5,868.8z
			 M363.2,842.1v12.6c-0.9,0.2-1.1-0.1-1.1-0.9c0-3.6,0-7.2,0-10.8C362.1,842.1,362.4,841.8,363.2,842.1z M361.4,867.7L361.4,867.7
			l0,1.1c0,0.2-0.1,0.5-0.1,0.7h-0.7c0-2.9,0-5.8,0-8.7c0-1.3,0-2.6,0-3.9c0-0.3,0.2-0.6,0.4-0.9c0.2,0.3,0.4,0.6,0.4,0.9
			c0,3.5,0,7,0,10.6C361.4,867.5,361.4,867.6,361.4,867.7z M361.3,883c0,0.2-0.3,0.4-0.4,0.6c-0.1-0.2-0.4-0.4-0.4-0.6
			c0-1.6,0-3.3,0-4.9c0-0.2,0.3-0.4,0.4-0.6c0.1,0.2,0.4,0.4,0.4,0.6c0,0.8,0,1.6,0,2.4C361.4,881.4,361.4,882.2,361.3,883z
			 M360.5,846.4c0-0.3,0-0.6,0-0.9v0c0-0.3,0-0.6,0-0.9v-2c0,0,0,0,0,0c0.1-0.2,0.3-0.4,0.4-0.6c0.1,0.2,0.4,0.5,0.4,0.7
			c0,3.7,0,7.3,0,11c0,0.3-0.3,0.6-0.4,0.9c-0.1-0.3-0.4-0.6-0.4-0.9C360.5,851.3,360.5,848.8,360.5,846.4z M361.3,839.5
			c-0.1,0.1-0.2,0.1-0.3,0.2c-0.2-0.2-0.5-0.4-0.5-0.6c-0.1-1.2,0-2.3,0-3.5c0-0.2,0.3-0.3,0.4-0.5c0.1,0.2,0.4,0.3,0.4,0.5
			C361.4,836.8,361.3,838.1,361.3,839.5z M359,832.6c0.7,0.1,1.3,0.2,1.8,0.4c0.2,0.1,0.4,0.5,0.4,0.7c0,0.1-0.3,0.4-0.5,0.4
			c-0.5,0.1-1.1,0-1.7,0V832.6z M359,878.3c0-0.2,0.2-0.4,0.4-0.6c0.1,0.2,0.4,0.4,0.4,0.6c0,1.6,0,3.2,0,4.8c0,0.2-0.3,0.4-0.4,0.6
			c-0.1-0.2-0.3-0.4-0.3-0.6c0-0.8,0-1.6,0-2.4C359,879.8,359,879,359,878.3z M359.1,877.1c-2.1,0.2-2.1,0.2-2.1-1.9v-5.1h2.9v1.3
			c0,0,0,0.1,0,0.1c0,1.6-0.1,3.3,0,4.9C359.8,876.9,359.6,877.1,359.1,877.1z M357,896.7c0-3.4,0-6.9,0-10.3c0-0.9,0.3-1.1,1.2-0.9
			c0,1.5,0,2.9,0,4.3c0,2.4,0.1,4.9,0.1,7.3c0,0.2-0.3,0.6-0.3,0.6c-0.3-0.1-0.7-0.3-1-0.5C356.9,897.1,357,896.9,357,896.7z
			 M357,900.8c0.3,0,0.7-0.1,1.2-0.1c0,1.2,0,2.3,0,3.4c0,0.2-0.4,0.5-0.6,0.5c-0.2,0-0.6-0.3-0.6-0.5C357,903,357,902,357,900.8z
			 M357,842.9c0-0.2,0-0.5,0.1-0.8c0.9-0.3,1.2,0,1.2,0.8c0,3.5,0,7,0,10.5c0,0.3,0,0.5-0.1,0.8c-0.8,0.2-1.2,0-1.2-0.9
			C357,849.8,357,846.3,357,842.9z M357.6,869.6c-0.8,0-0.7-0.5-0.7-0.9v-11.8c0-0.3,0-0.5,0.1-0.8h1.1c0,0.3,0.1,0.6,0.1,0.9
			c0,3.9,0,7.9,0,11.8C358.2,869.1,358.4,869.6,357.6,869.6z M357,878.2c0-0.2,0.4-0.4,0.6-0.4c0.2,0,0.5,0.3,0.5,0.4
			c0,1.8,0,3.6,0,5.4c-0.5,0-0.8,0-1.2-0.1C357,881.7,357,879.9,357,878.2z M359.8,868.8c0,0.2-0.2,0.4-0.3,0.6h-0.1
			c-0.1-0.2-0.3-0.4-0.3-0.6c0-4,0-8.1,0-12.1c0-0.2,0.3-0.5,0.4-0.7c0.1,0.2,0.3,0.5,0.3,0.7c0,2,0,4.1,0,6.1
			C359.8,864.8,359.8,866.8,359.8,868.8z M359.8,844.3c-0.1,0.6-0.1,1.3-0.1,1.9c0,2.7,0,5.4,0,8c-0.1,0.1-0.2,0.1-0.3,0.2
			c-0.1-0.2-0.4-0.5-0.4-0.7c0-3.7,0-7.5,0-11.2c0-0.2,0.2-0.4,0.4-0.6c0.1,0.2,0.3,0.4,0.4,0.6c0.1,0.1,0.1,0.2,0.2,0.4v1.1
			C359.9,844.2,359.8,844.3,359.8,844.3z M359,835.5c0-0.2,0.2-0.3,0.3-0.5c0.1,0.2,0.4,0.3,0.4,0.5c0,1.2,0,2.5,0,3.7
			c-0.1,0.1-0.2,0.1-0.3,0.2c-0.1-0.2-0.4-0.4-0.4-0.7C359,837.6,359,836.6,359,835.5z M357.5,841.2c-0.9-0.2-0.3-0.9-0.5-1.4
			c0.7,0,1.3,0,1.2,0.8C358.2,841.2,357.9,841.3,357.5,841.2z M357,835.5c0-0.2,0.6-0.4,1.1-0.7v4.2c-0.4-0.1-0.7-0.1-1.1-0.2
			C357,837.7,357,836.6,357,835.5z M355.8,831.9c2.5,0.3,2.5,0.4,2.3,2.2h-2.3V831.9z M356.2,835.1v3.5
			C355.6,838.1,355.5,835.9,356.2,835.1z M356.1,839.6v1.6c-0.1,0-0.2,0-0.3,0v-1.6C356,839.6,356.1,839.6,356.1,839.6z
			 M355.9,842.1c0.4,0.5,0.5,11.2,0.1,12C355.6,853.5,355.6,843,355.9,842.1z M355.9,877.2v-7.1h0.3v7.1
			C356,877.2,356,877.2,355.9,877.2z M356.1,877.9v5.7h-0.3v-5.7H356.1z M356.2,856v13.6C355.6,869.1,355.6,856.9,356.2,856z
			 M356.2,885.7v12C355.6,897.1,355.6,886.4,356.2,885.7z M354.9,853.9c-1.4,0.1-1.4,0.1-1.4-1.2V842h1.4V853.9z M354.8,855.6
			c-0.5-0.2-0.9-0.3-1.3-0.5c0.2-0.2,0.3-0.4,0.5-0.4C354.4,854.6,355,854.5,354.8,855.6z M354.9,856v13.5c-1.4,0.1-1.4,0.1-1.4-1.1
			c0-3.8,0-7.5,0-11.3V856H354.9z M354.9,870.1c0,2.3,0,4.6,0,6.9c0,0.8-0.6,0.9-1.4,0.8v-7.6H354.9z M354.9,885.8v11.7
			c-1.3,0.4-1.4,0.3-1.4-1V887C353.5,885.8,353.5,885.8,354.9,885.8z M353.5,898.5c1.5-0.4,1.5-0.4,1.4,1.9c-0.5,0-0.9,0-1.4,0.1
			V898.5z M354.8,841.1c-1.4,0.3-1.7-0.1-1.2-1.9C355,839.2,355.1,839.3,354.8,841.1z M353.5,837v-0.8c0-1.3,0-1.3,1.4-1.2v3.2
			C353.6,838.4,353.5,838.2,353.5,837z M352.4,831.1c0.8,0.2,1.6,0.4,2.5,0.5v2.5h-2.5V831.1z M352.6,856.1v13.4c-0.1,0-0.1,0-0.2,0
			v-13.4H352.6z M352.5,853.7v-11.6c0.1,0,0.1,0,0.2,0v11.6C352.6,853.7,352.5,853.7,352.5,853.7z M352.4,841.1v-2.2
			c0.1,0,0.1,0,0.2,0v2.2C352.6,841.1,352.5,841.1,352.4,841.1z M352.6,837.8h-0.2v-2.7c0.1,0,0.1,0,0.2,0V837.8z M352.4,870.1
			c0.1,0,0.1,0,0.2,0v7.6c-0.1,0-0.1,0-0.2,0V870.1z M352.4,898.5c0.1,0,0.1,0,0.2,0v2.2c-0.1,0-0.1,0-0.2,0V898.5z M352.5,897.5
			v-11.5l0.2,0v11.5C352.6,897.5,352.5,897.5,352.5,897.5z M351.5,900.6c-0.1,0.3-0.8,0.5-1.4,0.9v-3.1h1.5
			C351.5,899.2,351.6,900,351.5,900.6z M350.7,897.6c-0.5,0-0.7-0.1-0.7-0.7c0-3.4,0-6.7,0-10.1c0-1.2,0.9-0.5,1.6-1v5.4
			c0,1.9,0,3.8,0,5.7C351.5,897.6,351.2,897.6,350.7,897.6z M350,869.5V856h1.5v12.4C351.5,869.7,351.5,869.7,350,869.5z
			 M351.5,871.2c0,1.9,0,3.7,0,5.6c0,1.3,0,1.3-1.5,1.2v-7.8h1.4C351.5,870.5,351.5,870.8,351.5,871.2z M351.5,842v11.5
			c-1.3,0.3-1.5,0.2-1.5-1.1V842H351.5z M350,838.3c0.6,0.2,1.4,0.3,1.4,0.5c0.2,0.7,0.1,1.5,0,2.2c0,0.1-0.6,0.2-1,0.2
			c-0.2,0-0.4-0.3-0.4-0.4C350,840,350,839.3,350,838.3z M351.4,855.4H350v-1C351.3,854.1,351.5,854.3,351.4,855.4z M351.5,837.5
			c-1.6,0.2-1.8-0.2-1.4-2.5c1.4-0.2,1.4-0.2,1.4,1.2V837.5z M349.5,830.4c0.6,0.1,1.1,0.2,1.7,0.4c0.2,0.1,0.3,0.4,0.3,0.6
			c0,0.9,0,1.8,0,2.8h-2V830.4z M349.4,909.2c0-1.1,0-2.2,0-3.3c0-0.2,0.3-0.4,0.5-0.5c0.3-0.1,0.6-0.1,0.9-0.1
			c0.5-0.1,0.7,0.1,0.7,0.6c0,0.4,0,0.9,0,1.3C351.5,909.1,351.5,909.1,349.4,909.2z M351.7,902.7c0,0.3-0.2,0.7-0.1,1
			c0.2,0.8-0.2,1-0.9,1c-0.7,0.1-0.9-0.3-0.8-0.9c0.1-0.7-0.1-1.6,1.1-1.7C351.7,901.9,351.7,902.2,351.7,902.7z M352.7,901.8v2.8
			C351.9,903.2,352,901.9,352.7,901.8z M354.9,908.1c-0.8,0.2-1.6,0.4-2.5,0.6c0-1,0-1.9,0-2.8c0-0.1,0.2-0.4,0.4-0.4
			c0.7,0,1.4,0,2.2,0V908.1z M354.9,904.5c-1.3,0.3-1.3,0.2-1.4-1c0-0.2,0-0.3,0-0.5c-0.2-1.5-0.1-1.6,1.4-1.6
			c0.1,0.4,0.2,0.8,0.2,1.2C355,903.2,354.9,903.9,354.9,904.5z M355.6,899.3c0.2-0.3,0-0.9,0.5-1v1.8c0,0.1,0,0.1-0.1,0.2
			C355.5,900.1,355.4,899.8,355.6,899.3z M356.2,901.1v3.4C355.4,903.3,355.5,901.4,356.2,901.1z M358.2,906.6
			c0,0.5-0.2,0.8-0.7,0.9c-0.6,0.1-1.1,0.2-1.8,0.4c0-0.7,0-1.3,0-1.9c0-0.2,0.3-0.4,0.4-0.4c0.3-0.1,0.6,0,0.9,0
			C358,905.3,358.3,905.7,358.2,906.6z M358.2,899.9c-0.6,0.3-0.9,0.1-1.2-0.3v-1.2c0.4,0,0.9,0,1.3,0
			C358.3,898.9,358.2,899.4,358.2,899.9z M359,886c0-0.5,0-0.9,0.8-0.7v1.8c0,2.3,0,4.6,0,6.9h0v3h0.2c-0.1,0.1-0.1,0.1-0.2,0.2
			c-0.2,0.2-0.3,0.4-0.5,0.5c-0.2-0.2-0.5-0.5-0.5-0.7C358.9,893.4,358.9,889.7,359,886z M358.9,898.8c0.2-0.2,0.6-0.4,0.9-0.6
			c0.1,0.1,0.2,0.3,0.3,0.4c-0.3,0.3-0.5,0.5-0.8,0.8C359.1,899.3,358.8,898.9,358.9,898.8z M359,900.9c0-0.2,0.3-0.4,0.5-0.6
			c0.1,0,0.2,0.1,0.3,0.1c0,1.2,0,2.4,0,3.7c0,0.1-0.2,0.3-0.4,0.4c-0.1-0.1-0.4-0.3-0.4-0.4C359,903.1,359,902,359,900.9z
			 M361,906.6c-0.6,0.2-1.2,0.3-1.9,0.5v-1.6c0.6,0,1.2,0,1.8,0c0.2,0,0.5,0.3,0.4,0.4C361.3,906.1,361.1,906.5,361,906.6z
			 M361.3,904.2c0,0.1-0.2,0.3-0.4,0.4c-0.1-0.2-0.4-0.3-0.4-0.5c0-1.1,0-2.3,0-3.4c0-0.2,0.3-0.4,0.5-0.7c0.1,0.1,0.2,0.1,0.4,0.2
			C361.3,901.5,361.4,902.8,361.3,904.2z M361.4,896.7c-0.1,0.3-0.3,0.7-0.4,1c-0.2-0.2-0.4-0.5-0.6-0.7v-0.7
			c0.1-0.2,0.1-0.4,0.1-0.5c0-3.3,0-6.6,0-9.9c0-0.5,0.1-0.9,0.9-0.7c0,0.8,0,1.5,0,2.3c0,2.7,0.1,5.5,0.1,8.2
			C361.5,896,361.4,896.4,361.4,896.7z M360.5,874.8v-4.5c0-0.1,0-0.2,0-0.3h2.5c0.1,0.1,0.2,0.2,0.2,0.3c0,2.2,0,4.3,0,6.4
			c-0.2,0.1-0.2,0.1-0.3,0.1C360.5,877.3,360.5,877.3,360.5,874.8z M362.1,878.4c0-0.8,0.3-1.1,1.1-0.9v6c-0.8,0.3-1.1,0-1.1-0.8
			C362.2,881.3,362.2,879.8,362.1,878.4z M362,894c0-0.6,0.1-1.2,0.1-1.8c0-2.1,0-4.2,0-6.3c0-0.8,0.2-1.1,1.2-0.9v12.6
			c-1.2,0.1-1.4-0.2-1.3-1.1C362.1,895.6,362,894.8,362,894z M362.1,903.7c0-1,0.1-2,0-3c0-0.8,0.2-1.1,1.1-1v4.7
			C362.4,904.7,362.1,904.6,362.1,903.7z M362.3,906.3c-0.2-0.9,0.4-1.1,2-0.5C363.6,905.9,363,906.1,362.3,906.3z M364.3,842.1
			v12.7h-0.2v-12.6C364.2,842.1,364.2,842.1,364.3,842.1z M364.1,840v-4.9c0.1,0,0.1,0,0.2,0v4.9C364.2,840,364.2,840,364.1,840z
			 M364.3,856.1v13.4h-0.1c-0.1-0.2-0.2-0.3-0.3-0.3v-1c0.1-0.2,0.1-0.4,0.1-0.6c0-3.5,0-7,0-10.6c0-0.3,0-0.6,0-0.9
			C364.1,856.1,364.2,856.1,364.3,856.1z M364.1,897.5v-12.6h0.2v12.6H364.1z M364.3,899.6v4.8h-0.2v-4.8H364.3z M364.1,883.5v-6
			h0.2v6C364.2,883.5,364.2,883.5,364.1,883.5z M364.1,876.8v-6.7h0.2v6.7H364.1z M362.3,833.3c0.7,0.2,1.4,0.3,2.1,0.5
			C363,834.5,362.1,834.2,362.3,833.3z M365.1,835.1h1.3v5.4c-1.3-0.1-1.3-0.1-1.3-1.3C365.1,837.9,365.1,836.5,365.1,835.1z
			 M365.1,853.9c0-3.6,0-7.2,0-10.8c0-0.3,0-0.6,0-1h1.3V855C365.1,855.1,365.1,855.1,365.1,853.9z M366.4,856v13.5
			c-1.3,0.2-1.3,0.2-1.3-1c0-3.8,0-7.6,0-11.4V856H366.4z M365.1,871.1c0-0.3,0-0.6,0-1h1.3v13.4c-1.3,0.2-1.3,0.2-1.3-1
			c0-1.8,0.2-3.6,0.2-5.3C365.3,875.1,365.2,873.1,365.1,871.1z M366.5,904.5c-1.2,0.3-1.3,0.2-1.3-1c0-1,0-2.1,0-3.1
			c0-1.2,0-1.2,1.3-1.2V904.5z M366.5,897.5c-1.4,0.2-1.4,0.2-1.4-1c0-3.6,0-7.1,0-10.7v-1.1c0.5-0.1,0.8-0.1,1.4-0.2V897.5z"/>
		<path style="fill:#404040;" d="M414.6,835.1v-0.9h-25.1c-1.2,0-1.3,0.1-1.3,1.3c0,22.9,0,45.9,0,68.8c0,0.9,0.3,1.1,1.2,1.1
			c7.8,0,15.7,0,23.5,0h1.7v-0.9c-0.4,0-0.9,0-1.5,0v-6.2h1.5v-0.8h-1.4v-13.4h1.4v-0.7h-1.4V870h1.4v-0.4c-0.4,0-0.9,0-1.4,0V856
			h1.4v-0.7h-1.5v-13.3h1.5v-0.8c-0.4,0-0.9,0-1.4,0v-6.2H414.6z M409.7,835.6c0-0.2,0.3-0.6,0.5-0.6c0.7-0.1,1.5,0,2.2,0v6.2
			c-0.8,0-1.5,0-2.3,0c-0.2,0-0.4-0.4-0.4-0.6C409.6,838.9,409.6,837.3,409.7,835.6z M409.6,851.6c0-2.9,0.1-5.9,0.1-8.8
			c0-0.7,0.2-0.9,0.9-0.9c0.6,0,1.2,0,1.9,0v13.4h-2.9C409.6,854.1,409.6,852.9,409.6,851.6z M409.6,885.2c0-0.8,0.3-1.1,1.1-1
			c0.5,0.1,1.1,0,1.7,0v13.3c-0.1,0.1-0.1,0.1-0.2,0.1c-2.6,0.3-2.6,0.3-2.6-2.3C409.6,891.9,409.7,888.5,409.6,885.2z M409.6,875.3
			c0-1.5,0-3,0-4.5c0-0.6,0.2-0.8,0.8-0.7c0.6,0,1.3,0,2,0v13.6c-0.7,0-1.3,0-1.9,0c-0.7,0-0.8-0.2-0.8-0.9
			C409.7,880.3,409.6,877.8,409.6,875.3z M410.2,869.6c-0.6,0-0.5-0.5-0.5-0.9c0-3.2,0-6.5,0-9.7v-3h2.8v13.6H410.2z M406.1,835.6
			c0-0.2,0.3-0.6,0.5-0.6c0.7-0.1,1.5,0,2.2,0v6.2c-0.8,0-1.5,0-2.3,0c-0.2,0-0.4-0.4-0.4-0.6C406.1,838.9,406.1,837.3,406.1,835.6z
			 M407.1,842c0.5,0.1,1.1,0,1.8,0v13.3h-2.7c0-0.3-0.1-0.5-0.1-0.8c0-3.9,0-7.7,0-11.6C406.1,842.2,406.4,841.9,407.1,842z
			 M402.6,835.2c0.2-0.1,0.2-0.1,0.2-0.1c2.6-0.3,2.6-0.3,2.6,2.2c0,1.1,0,2.1,0,3.1c0,0.6-0.1,0.8-0.8,0.8c-2,0-2,0.1-2-2V835.2z
			 M405.4,852v1.2c0,2.5-0.1,2.6-2.8,2.1V842c0.8,0,1.5,0,2.2,0c0.6,0,0.5,0.5,0.5,0.9C405.4,845.9,405.4,849,405.4,852z
			 M405.4,881.2c0,0.8-0.1,1.6-0.2,2.4h-2.5V870c0.8,0,1.5,0,2.2,0c0.7,0,0.5,0.5,0.5,0.9C405.4,874.3,405.4,877.7,405.4,881.2z
			 M399.1,835.1h2.7v6.1h-2.7V835.1z M401.9,842.1v13.3h-2.7v-13.3H401.9z M399.1,856h2.7v13.5h-2.7V856z M399.1,870.1h2.7v13.5
			h-2.7V870.1z M396.3,835c2.5,0.1,2-0.3,2.1,2c0,0.4,0,0.8,0,1.2c0,0.8,0,1.6,0,2.4c0,0.5-0.2,0.6-0.6,0.7c-2.1,0.1-2.1,0.2-2.1-2
			c0-1.2,0-2.3,0-3.5C395.6,835.2,395.8,835,396.3,835z M398.4,844.2v11.1h-2.7v-13.2c0.2-0.1,0.2-0.1,0.3-0.1
			C398.4,841.8,398.4,841.8,398.4,844.2z M388.7,835.6c0-0.2,0.4-0.4,0.6-0.6c0,0,0.1,0,0.2,0c2.3,0,1.9-0.3,1.9,1.9
			c0,1.2,0,2.5,0,3.7c0,0.5-0.2,0.7-0.7,0.7c-2,0.1-2,0.1-2-1.9v-1.3C388.7,837.3,388.7,836.4,388.7,835.6z M391.4,854.2v1.1h-2.6
			v-13.3c0.1,0,0.2-0.1,0.2-0.1c2.4-0.3,2.4-0.3,2.4,2.1C391.4,847.5,391.4,850.9,391.4,854.2z M391.4,904.1c0,0.2-0.3,0.4-0.5,0.5
			c-0.5,0.1-1.1,0.1-1.7,0c-0.2,0-0.5-0.3-0.5-0.5c0-1.8,0-3.7,0-5.6h2.7C391.4,900.4,391.4,902.2,391.4,904.1z M391.4,872.3
			c0,1.3,0,2.6,0,4c0,0.6-0.2,0.8-0.8,0.8c-0.6,0-1.2,0-1.9,0v-7h2.6C391.4,870.8,391.4,871.5,391.4,872.3z M390.4,897.6
			c-0.5-0.1-1,0-1.6,0v-13.3c2.5-0.5,2.6-0.4,2.6,2c0,3.5,0,6.9,0,10.4C391.4,897.5,391.2,897.8,390.4,897.6z M390.4,869.6
			c-0.3,0-0.6,0-0.9,0c-0.6,0-0.7-0.3-0.7-0.8c0-1.8,0-3.6,0-5.4V856h2.6c0,0.3,0.1,0.6,0.1,0.9c0,3.9,0,7.8,0,11.7
			C391.4,869.4,391.1,869.7,390.4,869.6z M392.1,839.3c0-1.3,0-2.6,0-3.9c0-0.1,0-0.2,0.1-0.4h2.6c0,0.4,0.1,0.9,0.1,1.3
			c0,1.4,0,2.8,0,4.3c0,0.5-0.2,0.7-0.7,0.7C391.6,841.2,392.1,841.6,392.1,839.3z M394.8,842.1v13.3h-2.7v-13.3H394.8z
			 M394.9,904.2c0,0.1-0.3,0.4-0.5,0.4c-0.6,0.1-1.2,0.1-1.9,0c-0.2,0-0.4-0.3-0.4-0.4c0-1.9,0-3.8,0-5.7h2.8
			C394.9,900.4,394.9,902.3,394.9,904.2z M392.1,884.8c0-0.2,0.3-0.6,0.5-0.6c0.7-0.1,1.5,0,2.2,0v13.4c-0.8,0-1.5,0-2.2,0
			c-0.2,0-0.5-0.4-0.5-0.6C392.1,892.9,392.1,888.9,392.1,884.8z M393.9,883.6c-1.8,0-1.8,0-1.8-1.9V870h2.7c0,0.3,0.1,0.6,0.1,0.9
			c0,3.9,0,7.8,0,11.7C394.9,883.4,394.7,883.6,393.9,883.6z M393.9,869.6c-2-0.1-1.8,0.3-1.8-1.8c0-3.6,0-7.2,0-10.7
			c0-0.4,0-0.7,0-1.1h2.7c0,0.4,0,0.7,0,1c0,3.8,0,7.7,0,11.5C394.9,869.3,394.8,869.7,393.9,869.6z M398.4,904
			c0,0.2-0.4,0.4-0.6,0.6c0,0-0.1,0-0.2,0c-2.4,0-1.9,0.3-2-1.9c0-1.3,0-2.7,0-4c0-0.1,0.1-0.2,0.1-0.3h2.7
			C398.4,900.4,398.4,902.2,398.4,904z M397.6,897.6c-2.5-0.1-2,0.3-2-2c0-3.5,0-7,0-10.5c0-0.8,0.2-1.1,1-1.1
			c1.8,0.1,1.8,0,1.8,1.8v4.9c0,2,0,3.9,0,5.9C398.4,897.4,398.2,897.7,397.6,897.6z M397.4,883.6c-1.8,0-1.8,0-1.8-1.8V870h2.7
			c0,0.3,0.1,0.6,0.1,0.8c0,3.9,0,7.8,0,11.8C398.4,883.4,398.2,883.6,397.4,883.6z M397.4,869.6c-1.8-0.1-1.8,0-1.8-1.8V856h2.8v1
			c0,3.8,0,7.6,0,11.5C398.4,869.3,398.3,869.7,397.4,869.6z M401.9,904.2c0,0.1-0.3,0.4-0.4,0.4c-0.7,0-1.5,0-2.3,0v-6.1h2.8
			C401.9,900.4,401.9,902.3,401.9,904.2z M401.8,897.4c0,0,0,0.1-0.1,0.1h-2.6v-13.4c0.8,0,1.6,0,2.3,0c0.2,0,0.5,0.3,0.5,0.5
			C402,889,401.9,893.2,401.8,897.4z M405.4,904.2c-0.6,0.8-1.5,0.3-2.2,0.4c-0.2,0-0.6-0.4-0.6-0.6c0-1.8,0-3.6,0-5.6h2.8
			L405.4,904.2C405.4,904.1,405.4,904.2,405.4,904.2z M404.5,897.6c-0.6,0-1.2,0-1.8,0c0-0.2-0.1-0.4-0.1-0.5c0-4,0-8-0.1-12
			c0-0.4,0-0.8,0.2-1h2.5c0.1,0.3,0.2,0.6,0.2,0.8c0,3.9,0,7.8,0,11.8C405.4,897.4,405.2,897.7,404.5,897.6z M404.5,869.6
			c-0.6-0.1-1.2,0-1.8,0V856h2.7v3.7c0,3,0,6,0,9C405.4,869.4,405.3,869.7,404.5,869.6z M406.1,870.1h2.8v13.5h-2.8V870.1z
			 M406.1,884.9c0-0.6,0.2-0.8,0.7-0.8c0.6,0,1.3,0,2,0v13.4c-0.8,0-1.6,0.1-2.3,0c-0.2,0-0.4-0.5-0.4-0.8c0-2.3,0-4.7,0-7
			C406.1,888.1,406.1,886.5,406.1,884.9z M408.9,904c0,0.2-0.4,0.4-0.6,0.6c0,0-0.1,0-0.1,0c-2.1,0.1-2.1,0.1-2.1-2v-4.2h2.8
			C408.9,900.4,408.9,902.2,408.9,904z M408,869.6c-1.9,0-1.9,0-1.9-1.9V856h2.8c0,0.3,0,0.6,0,0.9c0,3.9,0,7.8,0,11.7
			C409,869.4,408.8,869.7,408,869.6z M411.6,904.7c-0.5,0.1-1.1,0.1-1.6,0c-0.2,0-0.5-0.3-0.5-0.5c0-1.9,0-3.8,0-5.8h2.9v4
			c0,0.4-0.1,0.9,0,1.3C412.7,904.5,412.2,904.7,411.6,904.7z"/>
	</g>
</g>
<path d="M387.3,891.9c-0.1-0.1-0.2-0.2-0.1-0.3c0.1-0.1,0.2-0.2,0.2-0.3c0,0.1,0.1,0.1,0.1,0.2C387.5,891.7,387.4,891.7,387.3,891.9
	z"/>
<path style="fill:#404040;" d="M399.7,908.6c-0.2-0.7-0.9-0.9-1.6-0.7c-0.4,0.2-0.8,0.3-1.3,0.1c0,0-0.1,0-0.2,0
	c0.1,0.1,0.1,0.2,0.2,0.4c-0.2-0.1-0.5-0.1-0.6-0.3c-0.2-0.3-0.5-0.4-0.8-0.4c-0.1,0-0.2-0.1-0.2-0.2c-0.3-0.4-0.5-0.8-0.8-1.2
	c-0.3-0.4-0.5-0.9-0.7-1.3c-0.2-0.5-0.5-1-1-1.3c-0.5-0.2-0.5-0.4-0.4-0.9c0.1-0.7,0.3-1.4,0.2-2.2c0-1.3-0.4-2.6-0.6-4
	c-0.2-0.8-0.3-1.7-0.3-2.5c-0.1-0.7-0.5-1.4-1.1-1.6c-0.3-0.1-0.3-0.3-0.2-0.5c0.1-0.3,0.2-0.6,0.2-0.9c0.1-0.9-0.2-1.8-0.6-2.6
	c-0.5-0.9-0.9-1.8-1.1-2.8c-0.1-0.5-0.3-1-0.5-1.4c-0.1-0.2-0.1-0.4,0-0.6c0.2-0.5,0.5-1,0.6-1.5c0.2-1.3,0.2-2.6,0.1-3.9
	c0-0.6-0.1-1.1-0.1-1.7c0-0.1,0-0.1,0-0.2c0.1-0.2,0.2-0.4,0.2-0.5c0-0.6-0.1-1.2-0.1-1.8c0-0.4-0.1-0.8,0-1.2c0.1-0.4,0-0.7-0.1-1
	c-0.2-0.5-0.3-1-0.4-1.6c-0.1-0.5-0.2-1-0.2-1.5c0-0.4-0.3-0.8,0-1.2c0,0.1,0.1,0.1,0.1,0.1c0.5,1.1,1.2,2.1,2,3
	c1.1,1.3,2.4,2.4,3.7,3.6c0.5,0.4,0.9,0.8,1,1.5c0,0.2,0.1,0.4,0.2,0.5c0.4,0.7,0.9,1.5,1.4,2.2c0.3,0.5,0.3,0.8-0.3,1.1
	c-0.2,0.1-0.2,0.3-0.1,0.5c0.2,0.3,0.4,0.4,0.7,0.2c0.2,0.4,0.2,0.4,0.6,0.2c0.1,0,0.1-0.1,0.2-0.1c0.4-0.1,0.8-0.3,1-0.7
	c0.3-0.5,0.4-1,0.2-1.6c-0.2-0.8-0.6-1.5-1.2-2.1c-0.3-0.3-0.5-0.7-0.8-1.1c-0.7-1-1.3-2.1-2-3.1c-0.6-0.9-1.2-1.8-1.6-2.8
	c-0.5-1-1-1.9-1.7-2.7c-0.4-0.5-0.8-1-1.1-1.7c-0.3-0.9-0.7-1.9-1-2.8c-0.1-0.3-0.3-0.6-0.1-0.9c0-0.1,0-0.2,0-0.3
	c-0.1-0.5-0.2-1-0.3-1.5c-0.1-0.6-0.1-1.1-0.3-1.7c-0.1-0.6-0.2-1.2-0.4-1.8c-0.3-1-1.2-1.5-2.2-1.8c-0.5-0.2-1-0.3-1.4-0.5
	c-0.1-0.1-0.2-0.3-0.2-0.4c0-0.2,0.1-0.5,0.1-0.7c0.1-0.6,0.1-0.6,0.7-0.6c0.1,0,0.1,0,0.2,0c0.5-0.1,0.9-0.4,0.9-0.9
	c0-0.1,0.1-0.3,0.1-0.4c0.1-0.4,0.2-0.7,0.3-1.1c0.1-0.2,0-0.5,0.4-0.7c0.2-0.1,0.2-0.3,0.1-0.5c-0.1-0.2-0.2-0.4-0.3-0.6
	c-0.1-0.3-0.2-0.6-0.1-0.9c0.2-0.4,0.2-0.8,0.1-1.3c-0.2-0.4,0-1-0.4-1.3c-0.2-0.3-0.5-0.6-0.7-0.8c0.2-0.5,0.1-0.9-0.4-1
	c-0.7-0.2-1.5-0.4-2.2-0.4c-1.3-0.1-2.5,0.2-3.4,1.2c-1,1.1-1.4,2.3-1.1,3.7c0.2,1.1,0.6,2.2,1.3,3c0.4,0.4,0.4,0.9,0.3,1.4
	c0,0.2,0,0.3-0.1,0.5c-0.2,0.3-0.4,0.6-0.7,0.8c-0.2,0.1-0.4,0.2-0.6,0.4c-0.1,0.1-0.2,0.1-0.3,0.2c-0.4,0.2-0.9,0.4-1.3,0.7
	c-0.6,0.5-1.2,1-1.8,1.5c-0.6,0.6-0.9,1.4-1,2.2c-0.1,0.7-0.2,1.3-0.2,2c-0.1,0.9-0.2,1.8-0.2,2.7c0,1.1,0,2.2-0.2,3.2
	c-0.1,0.7-0.2,1.4-0.3,2.2c-0.1,0.5-0.2,0.9-0.2,1.4c0,0.6,0,1.1,0.1,1.7c0,0.5,0,1,0.1,1.5c0.1,1.1,0.3,2.1,0.4,3.2
	c0.1,1.3,0.1,2.6,0,4c-0.1,0.8,0,1.7-0.1,2.5c-0.1,0.8,0.4,1.3,1,1.7c0.3,0.2,0.5,0.5,0.8,0.7c0.1,0.1,0.2,0.1,0.4,0.2
	c0.2,0.1,0.4,0.2,0.6,0.3c0.1,0,0.2,0.1,0.3,0.1c0.1,0,0.1-0.2,0.2-0.3c0-0.1,0-0.2,0-0.3c-0.1-0.5-0.2-1-0.2-1.6c0-0.1,0-0.3,0-0.4
	c0.1,0.1,0.1,0.2,0.1,0.3c0.1,0.3,0.1,0.6,0.4,0.7c0.1,0.1,0.3,0,0.4,0.1c0-0.1,0-0.3,0-0.4c0-0.1-0.1-0.2-0.1-0.3
	c0-0.5-0.1-1-0.1-1.5c0-0.8-0.3-1.4-0.7-2.1c-0.5-0.8-0.7-1.6-0.7-2.5c0-2.1,0.1-4.3,0.2-6.4c0-0.9,0.1-1.7,0.2-2.6
	c0-0.4,0.2-0.7,0.3-1.1c0.3,0.6,0.5,1.1,0.7,1.6c0.3,0.4,0.3,0.9,0.2,1.4c-0.1,0.4,0,0.9,0.1,1.3c0.3,0.9,0.3,1.7-0.1,2.5
	c-0.1,0.2-0.1,0.4,0,0.6c0.2,0.4,0.1,0.7,0,1c0,0.4-0.3,0.8-0.1,1.3c0,0,0,0.1,0,0.1c-0.2,1.9,0.2,3.8,0.9,5.6
	c0.4,1.1,0.9,2.1,1.8,3c0.1,0.1,0.1,0.2,0,0.4c0,0.5-0.1,1.1-0.1,1.6c0,0.2,0,0.4-0.2,0.5c-0.3,0.4-0.7,0.7-0.8,1.3
	c-0.1,0.7-0.2,1.3-0.2,2c0,0.5-0.1,1-0.4,1.4c-0.2,0.3-0.3,0.7-0.1,1c0.1,0.3,0,0.4-0.2,0.5c-0.3,0.1-0.4,0.3-0.4,0.5
	c0,0.3-0.2,0.5-0.3,0.8c-0.1,0.1-0.2,0.3-0.3,0.4c-0.3,0.7-0.6,1.4-1,2c-0.5,0.9-1.1,1.9-1.6,2.8c-0.3,0.6-0.6,1.2-0.9,1.8
	c-0.2,0.5-0.4,1-0.7,1.5c-0.2,0.4-0.4,0.7-0.3,1.2c0,0.2,0,0.3,0,0.5c-0.1,0.2-0.2,0.5-0.2,0.7c-0.1,0.8-0.2,1.6-0.3,2.4
	c0,0.1,0,0.3,0,0.4c0,0.4-0.1,0.8-0.1,1.1c0,0.2-0.1,0.5-0.2,0.7c0,0.2,0.1,0.4,0.3,0.5c0.5,0.1,0.9,0.3,1.4,0.4
	c1.5,0.2,3,0.3,4.5,0.5c0.5,0.1,1,0.1,1.6,0.1c0.9,0,1.9-0.1,2.8-0.1c0.1,0,0.4-0.1,0.4-0.2c0.2-0.5,0-1.1-0.5-1.3
	c-0.3-0.1-0.5-0.1-0.8-0.1c-0.2,0-0.5-0.1-0.7-0.2c-0.4-0.2-0.8-0.4-1.3-0.6c-0.8-0.3-1.6-0.8-2.1-1.6c-0.1-0.1-0.1-0.3-0.1-0.3
	c0.1-0.2,0.1-0.5,0-0.7c0-0.1,0-0.3,0.1-0.4c0.3-0.2,0.4-0.4,0.5-0.8c0-0.2,0.2-0.4,0.4-0.4c0.1,0,0.3-0.1,0.4-0.1
	c0.3,0,0.4-0.2,0.5-0.4c0.4-0.9,0.7-1.9,1.1-2.8c0.5-1.2,1-2.4,1.1-3.7c0-0.5,0.4-1,0.9-1.1c0.6-0.2,1-0.7,1.3-1.3
	c0.3-0.4,0.5-0.9,0.8-1.4c0.2,0.4,0.3,0.8,0.5,1.1c0,0,0,0,0,0.1c-0.1,0.3,0,0.5,0.2,0.8c0.1,0.1,0.1,0.2,0.1,0.3
	c0.1,1,0.5,1.8,0.8,2.7c0.2,0.7,0.5,1.4,0.6,2.1c0.3,1.2,0.7,2.3,1.3,3.3c0.3,0.4,0.4,0.9,0.3,1.4c-0.1,0.4,0,0.7,0.3,1
	c0.5,0.3,0.6,0.9,0.6,1.4c0,0.7,0.3,1.3,0.8,1.8c0.1,0.1,0.2,0.2,0.2,0.4c0.1,0.3,0.1,0.6,0.2,0.9c0,0.2,0.1,0.3,0.2,0.5
	c0,0.1,0.1,0.2,0.1,0.3c0.1,0.4,0.2,0.8,0.3,1.1c0,0.2,0.2,0.3,0.4,0.2c0.2-0.1,0.5-0.1,0.7-0.2c0.8-0.3,1.6-0.6,2.3-0.9
	c1.4-0.6,2.8-1.2,4.2-2C399.9,909.5,400,909.3,399.7,908.6z"/>
<g>
	<g>
		<path style="fill:#404040;" d="M145.7,858.1c-0.3-0.5-0.6-1.1-0.8-1.6c-0.3-0.6-0.1-1.3-0.2-1.9c-0.2-1.4,0-2.8,0.2-4.1
			c0.2-1.3,0.5-2.6,0.3-3.9c-0.1-0.5-0.1-1-0.3-1.5c-0.1-0.4-0.4-0.8-0.6-1.2c-0.1-0.2-0.3-0.4-0.4-0.7c-0.3-0.6-0.7-1.1-1.3-1.5
			c-0.1-0.1-0.2-0.2-0.3-0.3c-0.6-1.4-1.6-2.2-3-2.3c-1.4-0.2-2.7-0.2-4.1,0c-0.3,0-0.7-0.1-1-0.2c-0.1,0-0.2-0.2-0.2-0.3
			c0.1-0.6,0.2-1.2,0.5-1.7c0.2-0.4,0.4-0.7,0.4-1.1c0-0.1,0-0.3,0.1-0.4c0,0,0.1,0.1,0.1,0.1c0.1-0.1,0.3-0.1,0.4-0.2
			c0.1-0.2,0.2-0.4,0.3-0.6c0.1-0.4,0.2-0.8,0.4-1.2c0.1-0.2,0.2-0.4,0.2-0.6c-0.1-0.5,0.1-0.8,0.3-1.2c0.5-1.4,0.7-2.8-0.1-4.1
			c-0.4-0.6-0.8-1.2-1.5-1.4c-0.8-0.2-1.6-0.4-2.4-0.5c-0.6-0.1-1.3-0.1-1.8,0.4c-0.1,0.1-0.2,0.1-0.4,0.1c-0.6-0.1-0.9,0.2-1.2,0.6
			c-0.2,0.3-0.3,0.5-0.5,0.8c-0.2,0.2-0.4,0.4-0.5,0.5c-0.1,0.1-0.2,0.2-0.2,0.3c0,0.4,0,0.7,0,1.1c0.3,1.1,0.1,2.2-0.1,3.4
			c-1.2-0.2-2.2,0.2-3.1,1c-0.5,0.5-1.1,0.7-1.8,0.5c-0.4-0.1-0.6,0.2-0.9,0.5c0.5-0.5,1.2-0.2,1.8-0.1c-0.4,0.2-0.7,0.5-1.1,0.7
			c0.9-0.3,1.7-1.1,2.8-1.1c-0.2,0.5-0.5,0.7-0.9,0.7c-0.1,0-0.3,0-0.4,0.1c-0.2,0-0.4,0.1-0.3,0.3c-0.3,0.2-0.6,0.4-0.9,0.7
			c-0.3,0.2-0.5,0.5-0.9,0.4c0.4,0.2,0.7,0,1-0.2c0.4-0.5,1-0.5,1.6-0.6c0.4,0,0.9-0.1,1.3-0.3c0.3-0.1,0.6-0.3,0.9-0.5
			c0,0,0.1,0.1,0.1,0.1c-0.3,0.3-0.6,0.6-0.9,0.8c-0.2-0.1-0.5,0.2-0.6,0.2c0,0,0,0-0.1,0c0,0,0,0,0,0c-0.4,0.1-0.7,0.1-1,0.2
			c-0.2,0.1-0.5,0.1-0.6,0.2c-0.2,0.3-0.5,0.4-0.8,0.4c0,0,0,0-0.1,0.1c0.1,0,0.2,0,0.3,0.1c-0.4,0.2-0.9,0.4-1.3,0.6
			c0.1,0,0.2,0,0.3,0c0.4-0.1,0.8-0.2,1.2-0.3c0.3-0.1,0.6,0.1,0.8-0.2c0,0,0.1,0,0.1,0c-0.2,0.4-0.4,0.7-0.7,1
			c0.3-0.2,0.6-0.3,0.9-0.4c0-0.1,0-0.2,0-0.2c0.1,0,0.2,0,0.3,0c0.2,0.2,0.4,0.5,0.6,0.8c-0.4,0.3-0.8,0.5-1.2,0.7
			c-0.4,0.2-0.8,0.5-1.4,0.3c0.3,0.2,0.6,0.2,0.9,0.1c0.5-0.2,1.1-0.5,1.6-0.8c0.1-0.1,0.4-0.2,0.5-0.1c0.5,0.2,1,0.2,1.5,0.2
			c0.4,0,0.9-0.1,1.4-0.2c-0.1,0.1-0.2,0.3-0.3,0.3c-0.4,0.2-0.9,0.3-1.3,0.5c-0.4,0.2-0.7,0.3-1.1,0.3c-1,0-1.9,0.1-2.9,0.2
			c-0.2,0-0.3,0.1-0.5,0.2c-0.2,0.2-0.4,0.4-0.6,0.5c0,0-0.1,0-0.1-0.1c0,0.1,0,0.2,0.1,0.3c-0.4-0.1-0.5,0-0.4,0.4
			c-0.1,0.1-0.3,0.1-0.3,0.2c-0.1,0.2-0.3,0.4-0.4,0.7c-0.4,1-0.8,2-1.2,3.1c-0.2,0.6-0.3,1.4-0.6,2c-1.4,2-2.3,4.3-3.1,6.6
			c-0.4,1.1-0.1,2,0.9,2.7c0.2,0.1,0.4,0.1,0.6,0.1c1.6-0.5,3.1-1.3,4.2-2.7c0.5-0.6,1.2-1,1.9-1.6c0,0.2,0.1,0.4,0.1,0.5
			c0.1,0.6,0.2,1.2,0.3,1.9c0.2,0.7,0.4,1.3,0.6,2c0.1,0.5,0.2,1,0.3,1.6c0.1,0.6,0.1,1.2,0,1.8c-0.3,1-0.5,2.1-0.9,3.2
			c-0.2,0.8-0.6,1.5-0.5,2.3c0.1,1.2-0.1,2.4-0.3,3.6c-0.1,0.8-0.2,1.5,0.1,2.3c0.1,0.3,0.2,0.8,0.2,1.1c0,1,0,2,0.1,3
			c0.2,2.9,0.7,5.7,1.5,8.6c0.2,0.6,0.1,1.2-0.1,1.8c-0.2,0.6-0.2,1.3,0,1.9c0.7,1.6,1.3,3.2,2.1,4.8c0.2,0.5,0.3,1,0.2,1.5
			c0,0.1-0.2,0.2-0.3,0.3c-0.5,0-0.7,0.3-0.4,0.7c0.3,0.5,0.2,1,0.2,1.5c0,1.3,0,2.6,0.5,3.9c0.4,0.8,0.9,1.4,1.9,1.4
			c0.3,0,0.6-0.1,0.9-0.1c0,0.1-0.1,0.2-0.1,0.4c-0.1,0.8-0.2,1.6-0.3,2.3c0,0.2,0.1,0.4,0.2,0.6c0.4,0.4,0.3,0.8,0.1,1.2
			c-0.2,0.5-0.3,1.1-0.4,1.6c-0.1,0.7,0.1,0.9,0.8,1c0.6,0.1,1.2,0.3,1.8,0.3c0.7,0,1.4,0,2-0.1c0.4,0,0.6-0.3,0.5-0.7
			c-0.1-0.5-0.1-1-0.3-1.4c-0.3-0.7-0.6-1.4-0.7-2.2c-0.1-1-0.2-1.9,0.2-2.9c0-0.1,0.1-0.3,0-0.4c-0.2-0.8-0.3-1.5-0.1-2.3
			c0.2-0.9,0.5-1.8,0.7-2.7c0.5-2,0.9-4,1.4-6.1c0.4-1.7,0.6-3.4,0-5.1c-0.5-1.5-0.5-3.1-0.2-4.6c0.1-0.3,0.2-0.6,0.3-0.9
			c1.1-1.8,1.9-3.8,2.4-5.8c0.1-0.4,0.1-0.9,0.4-1.2c0.8-1,1-2.1,1.1-3.3c0.3-2.3-0.4-4.5-1.6-6.4c-0.1-0.2-0.2-0.4-0.2-0.6
			c0-0.7,0-1.3,0-2c-0.1-1.6-0.2-3.3-0.1-4.9c0.2-3,0.2-6,0.7-9c0-0.1,0.1-0.3,0.2-0.4c0.4-0.4,0.8-0.7,1.2-1.1
			c0.2-0.2,0.5-0.2,0.8,0c0.2,0.2,0.4,0.4,0.7,0.6c0.3,0.2,0.3,0.4,0.3,0.6c0,0.7-0.1,1.4,0,2.1c0.2,1.3,0.5,2.5,0.8,3.7
			c0.4,1.4,0.2,2.7-0.1,4.1c0,0.1-0.1,0.2-0.1,0.3c-0.1,0.2-0.2,0.4-0.2,0.7c-0.1,0.7,0.1,1.3,0.3,1.9c0.1,0.4,0,0.7,0.1,1.1
			c-0.2-0.1-0.4-0.1-0.5-0.1c0,0.2-0.1,0.3-0.1,0.5c0,0.2,0.1,0.3,0.1,0.5c-0.1,0.3,0.1,0.4,0.3,0.6c0.7,0.6,1.5,0.3,2.3,0.2
			c0.1,0,0.3-0.3,0.4-0.4c0.3-0.5,0.6-1.1,1-1.6C146,858.9,145.9,858.6,145.7,858.1z M125,833.8c0.4-0.2,0.9-0.4,1.3-0.7
			c0,0,0,0.1,0,0.1C126,833.7,125.6,833.9,125,833.8z M127.1,835.2c-0.2,0.5-0.5,0.8-0.9,0.8c0,0,0,0,0-0.1
			C126.5,835.8,126.7,835.5,127.1,835.2z M126.3,837.9c0.4-0.4,0.8-0.6,1.3-0.7C127.3,837.8,126.8,838.1,126.3,837.9z M130.7,880.4
			c-0.2,1.1-0.1,2.2,0.1,3.3c0.2,0.8-0.2,1.4-0.4,2.1c-0.2-0.5-0.3-0.9-0.4-1.3c0-0.1-0.1-0.3,0-0.4c0.3-0.9,0.3-1.9,0.4-2.8
			c0.1-1.1,0.2-2.2,0.3-3.3c0.1,0,0.1,0,0.2,0C130.8,878.9,130.8,879.6,130.7,880.4z"/>
		<path style="fill:#404040;" d="M123.5,838.1c-0.1,0.1-0.2,0.1-0.2,0.2C123.3,838.2,123.4,838.2,123.5,838.1z"/>
	</g>
</g>
<path style="fill:#404040;" d="M117.9,749.4c0.7,0,1.4,0,1.9,0c0.3,0,0.5,0,0.8,0.1c0.4,0.1,0.7,0.3,1,0.5c0.1-0.2,0.3-0.3,0.6-0.3
	c0.4-0.1,0.8-0.1,1.1-0.3c0.1-0.1,0.2-0.3,0.3-0.5c0.4-0.9,0.8-1.7,1.3-2.5c0.6-0.9,1.2-1.7,2.2-2.1c-0.5,1.3-0.7,2.7-0.8,4.1
	c0,0.3,0,0.5,0,0.8c0.1,0.3,0.2,0.5,0.3,0.8c0.4,1,0,2.1-0.4,3.1c-0.2,0.5,0.1,1.2,0,1.7c-0.1,0.3-0.2,0.6-0.2,0.8
	c0,0.3,0,0.5,0,0.8c0.3,2,1.7,3.6,2.3,5.6c0.6,2,0.4,4.1,0.4,6.2c0,0.2,0,0.4,0.1,0.5c0.1,0.1,0.1,0.3,0.2,0.4c0.1,0.3,0,0.6,0,0.9
	c-0.1,0.6-0.3,1.3-0.4,1.9c-0.1,0.5-0.2,1-0.3,1.4c-0.1,0.5-0.2,0.9-0.2,1.4c-0.2,1.7-0.5,3.4-0.7,5c-0.3,1.9-0.1,3.8,0.2,5.7
	c0.3,1.4,0.8,2.9,0.5,4.3c-0.1,0.4-0.2,0.9-0.2,1.3c0.1,0.9,1,1.4,1.8,1.6c0.8,0.2,1.7,0.1,2.6,0.2c1.6,0.2,3,0.9,4.5,0.6
	c0.7-0.1,1.4-0.4,2.1-0.8c0.4-0.2,0.7-0.5,1-0.9c0.2-0.4,0.3-0.9,0-1.3c-0.4-0.5-1.1-0.6-1.7-0.6c-1.6-0.1-3.2-0.6-4-2
	c-0.3-0.6-0.4-1.2-0.5-1.8c-0.1-0.5-0.2-1.1-0.3-1.6c1.5,0.4,3.2,0.2,4.6-0.6c0.4-0.2,0.7-0.5,0.8-0.9c0-0.6-0.7-1-1.3-1.1
	c-1.2-0.2-2.6-0.1-3.3-1.1c-0.2-0.3-0.3-0.6-0.4-0.9c-0.3-0.9-0.4-1.9-0.3-2.8c0-0.5,0.1-1.1,0.5-1.4c0.2-0.2,0.4-0.3,0.6-0.4
	c0.9-0.6,0.9-1.9,1-3c0.1-1.4,0.4-2.7,0.7-4c0.5-2.3,1-4.6,1.4-6.9c0.4-2,1.2-3.9,1.4-5.9c0.1-0.8,0.1-1.7,0.7-2.2
	c1.5-1.3,1.2-3.8,1.3-5.8c0-1,0.1-2,0-3c-0.1-1.3-0.4-2.6-0.2-3.9c0.3-1.4-0.7-3-1.3-4.3c-0.3-0.7-0.7-1.4-0.9-2.2
	c-0.2-0.8-0.2-1.6,0.3-2.3c0.7-1,2.1-1.3,2.8-2.2c0.4-0.5,0.5-1.2,0.7-1.8c0-0.1,0.1-0.3,0.1-0.4c0.2-0.7,0.3-1.5,0.8-2.1
	c0.8-1,0.5-2.8-0.2-3.9c-0.2-0.3-0.5-0.6-0.8-0.9c-1.3-1-3-1.4-4.6-1c-0.4,0.1-0.8,0.2-1.1,0.5c-1,0.7-1.5,1.9-1.8,3.1
	c-0.2,1-0.4,2-0.4,3c0,0.6,0,1.2-0.3,1.7c-0.1,0.2-0.2,0.4-0.3,0.6c-0.4-0.1-0.7,0.2-1,0.4c-1.7,1.3-3.2,2.9-4.3,4.8
	c-0.4,0.7-0.8,1.6-0.6,2.4c-1.1,1-2.2,2.2-3.2,3.3c-0.6,0.6-1.2,1.2-1.6,1.9c-0.3,0.4-0.5,0.9-0.9,1.2c-0.2,0.2-0.5,0.3-0.7,0.5
	c-0.3,0.3-0.4,0.8-0.5,1.2c-0.1,0.7-0.3,1.4-0.5,2.1c-0.1,0.4-0.2,0.8-0.5,1.1c-0.2,0.2-0.5,0.3-0.8,0.4
	C118.3,747.7,117.9,748.5,117.9,749.4z"/>
<path style="fill:#404040;" d="M120.2,746.5c0,0-0.4,0.4,0.3-0.5c0.7-0.8,0.3-2.3,0.3-2.3c0-0.4-0.5-0.7-0.9-0.8
	c-0.5-0.1-1-0.1-1.3-0.5c0.3,0,0.6-0.1,0.8-0.3c-0.9-0.7-1.9-1.5-2.8-2.3c-0.2-0.1-0.3-0.3-0.4-0.5c-0.1-0.2-0.2-0.4-0.3-0.6
	c-0.2-0.3-0.4-0.5-0.7-0.6c-0.6-0.4-1.4-0.7-1.9-0.3c-0.3,0.3-0.6,0.8-1,0.7c-0.1,0-0.3-0.1-0.4-0.3c-0.4-0.5-0.6-1.2-0.4-1.8
	c0.3-1.4-0.9-2.7-1.4-4.1c-0.7-2-1.1-4.1-2.1-6c0.6,0.2,1.2,0,1.6-0.4c0.2-0.2,0.3-0.3,0.5-0.5c0.1-0.1,0.3-0.1,0.4-0.2
	c0.1-0.1,0.2-0.3,0.1-0.4c0.2,0.2,0.5,0,0.6-0.2s0.3-0.4,0.5-0.5c0.2-0.1,0.6,0.1,0.7-0.1c0.1-0.1,0.1-0.2,0.1-0.3
	c0-0.5,0-1.1,0-1.6c0.5,0.3,1.1,0.4,1.7,0.4c0.4,0,0.9-0.2,1-0.6c0-0.2-0.1-0.5-0.2-0.7c-0.5-0.8-0.7-1.7-0.8-2.6
	c-0.1-1.5,2.2-2,3-3.3c-1.3-0.7-2.7-1.3-4.1-1.8c-2.7-0.9-5.5-1-8.3-1.2c-0.2,0-0.5,0-0.7,0.1c-0.3,0.2-0.4,0.5-0.3,0.8
	c0.1,0.3,0.3,0.6,0.6,0.7c0.4,0.2,1.1,0.3,1.2,0.8c0.1,0.3-0.1,0.6-0.3,0.8c-0.6,0.9-1,2-1.2,3.1c-0.1,0.9-0.1,1.9-0.7,2.6
	c-0.1,0.1-0.2,0.2-0.3,0.3c-0.4,0.4-0.7,1-1,1.5c-0.3,0.5-0.7,0.9-1.2,1.2c-0.7,0.5-1.3,1-1.9,1.5c-0.6,0.5-1.1,1-1.5,1.6
	c-0.2,0.4-0.4,0.8-0.6,1.2c-1.4,3.5-1.7,7.4-0.9,11c0.1,0.6,0.7,1.2,0.7,1.8c0,0.4,0,0.8-0.1,1.2c-0.1,0.8-0.3,1.5-0.4,2.3
	c0-0.2,0-0.5-0.2-0.7c-0.1-0.2-0.4-0.3-0.6-0.1c-0.1,0.1-0.1,0.2-0.1,0.3c-0.3,1-0.5,1.9-0.5,2.9c0,0.3,0,0.6-0.2,0.8
	c-0.1,0.1-0.2,0.2-0.3,0.2c-0.5,0.3-0.8,0.9-0.8,1.5c0,0.2,0,0.5,0.2,0.6c0.1,0.1,0.3,0.2,0.5,0.2c0.6,0.2,1.4,0.5,1.4,1.2
	c0,0.3-0.1,0.6-0.1,0.9c0,0.3,0.3,0.7,0.6,0.7c0.1,1.5,0.3,3.1,0.9,4.5c0.2,0.6,0.5,1.3,0.8,1.9c0.5,1.7,0.3,3.6,0.6,5.4
	c0.3,2,1.3,3.8,2.3,5.5c-0.9,5.8,0.2,11.9,1.3,17.7c0.1,0.4,0.2,0.8,0.5,0.9c-0.3,0.4,0,1,0.4,1.1c0.1,0,0.2,0,0.3,0.1
	c0.2,0.1,0.2,0.3,0.2,0.5c0.2,1.4,1.4,2.6,2.8,3c1.4,0.4,2.9,0.2,4.2-0.3c-0.5-1.3-1.2-2.6-2.1-3.8c-0.1-0.2-0.3-0.4-0.2-0.6
	c0-0.1,0.1-0.2,0.1-0.3c0.2-0.6-0.4-1.3-0.2-2c0.5,0,1.1-0.3,1-0.7c0.6-0.3,1.3,0.2,1.9,0.5c1.4,0.6,3,0.3,4.5,0
	c0.6-0.1,1.2-0.2,1.8-0.5c0.2-0.1,0.5-0.3,0.5-0.6c0-0.2-0.1-0.3-0.2-0.5c-0.5-0.6-1.4-0.8-2.3-0.9c-0.8-0.1-1.7-0.1-2.4-0.5
	c-0.5-0.3-0.8-0.8-1.2-1.2c0-0.1-0.1-0.1-0.1-0.2c0-0.2,0.3-0.3,0.5-0.4c0.2-0.2,0.3-0.5,0.3-0.8c-0.1-2.8-0.1-5.7-0.2-8.5
	c0-1.4,0.2-2.9,0.1-4.3c-0.1-0.9-0.2-1.8-0.3-2.8c-0.1-1.7,0.1-3.3,0.1-5c0-1.9-0.1-3.9-0.5-5.8c-0.2-1.2-0.1-2.3-0.7-3.3
	c-0.3-0.5-0.8-1.1-0.6-1.7c0.1-0.2,0.2-0.4,0.4-0.5c0.5-0.5,1.2-0.7,1.9-0.5c0.7,0.1,1.3,0.6,2,0.6c0.5,0,1-0.2,1.4,0.1
	c0.2,0.2,0.4,0.4,0.6,0.6c0.5,0.5,1.3,0.8,1.4,1.5c0,0.1,0,0.2,0,0.2c0.1,0.1,0.2,0.1,0.3,0.2c0.7,0.2,1.4-0.1,2-0.3
	c0.3-0.1,0.6-0.2,1-0.3c0.2-0.1,0.5-0.2,0.5-0.5c0.3,0,0.6,0,0.7-0.2c0.2-0.2,0-0.6-0.2-0.6C123.2,748.2,120.2,746.5,120.2,746.5z
	 M115.5,739.4c-0.3,0-0.6-0.1-0.9-0.2c-0.3-0.1-0.6-0.2-0.9-0.1c-0.2,0.1-0.4,0.4-0.5,0c0-0.2,0.1-0.5,0.3-0.6
	c0.1-0.1,0.2-0.1,0.3-0.1c0.5-0.2,1-0.1,1.3,0.3c0.1,0.1,0.2,0.2,0.3,0.4C115.5,739.1,115.6,739.3,115.5,739.4z M118.5,745.7
	c-0.3-0.3-0.5-0.8-0.4-1.2c0-0.2,0.1-0.4,0.2-0.6c0.1-0.2,0.2-0.3,0.4-0.4c0.3-0.2,0.7-0.2,1-0.1c0.3,0.2,0.6,0.5,0.7,0.8
	c0,0.1,0.1,0.2,0.1,0.3c0,0.2-0.2,0.4-0.3,0.5c-0.2,0.2-0.3,0.4-0.4,0.6c-0.1,0.1-0.1,0.4-0.2,0.5
	C119.4,746.2,118.7,745.9,118.5,745.7z M112.4,742.3C112.5,742.3,112.5,742.2,112.4,742.3c0.3-0.2,0.5-0.2,0.7-0.2
	c0.1,0,0.1,0,0.2,0.1c0,0,0.1,0.1,0.1,0.1c0.1,0.2,0.2,0.4,0.4,0.7c0.1,0.1,0.1,0.2,0.2,0.3c0.1,0.1,0.3,0.1,0.5,0.2
	c0.2,0.1,0.3,0.2,0.5,0.3c0.2,0,0.3,0,0.5-0.1c0.3,0,0.5,0,0.8,0.1c0.1,0,0.1,0,0.2,0.1c0.1,0.1,0.1,0.2,0.2,0.4
	c0.1,0.1,0.2,0.1,0.3,0.1c0.1,0,0.2-0.1,0.3-0.2c0.1-0.1,0.1-0.1,0.2-0.1c0.1,0,0.1,0.1,0.1,0.2c0,0,0.1,0.1,0.1,0.1
	c0.1,0.1,0.1,0.3,0.1,0.5c0,0.3,0.1,0.6,0.3,0.9c0.2,0.3,0.4,0.4,0.6,0.7c0.1,0.2,0,0.2-0.2,0.2c-0.2,0.1-0.4,0.1-0.5,0.1
	c-0.4,0.1-0.7,0.2-1.1,0.2c-0.2,0-0.5,0.1-0.7,0c-0.2-0.1-0.4-0.2-0.6-0.3c-0.8-0.5-1.7-0.9-2.5-1.3c-0.1,0-0.2-0.1-0.2-0.2
	c-0.1-0.1-0.1-0.2-0.1-0.3c-0.1-0.8-0.1-1.6-0.2-2.4C112.4,742.4,112.4,742.3,112.4,742.3z"/>
<path style="fill:#404040;" d="M391.9,759c0.3,0.4,0.5,0.9,0.7,1.4c0.1,0.3,0.3,0.5,0.6,0.6c0.4,0.1,0.8,0.2,1.3,0.3
	c0.4,0,0.4,0,0.4-0.4c0.2-0.1,0.5,0.1,0.5-0.3c0-0.3-0.2-0.4-0.5-0.4c0.1,0,0.1,0,0.2-0.1c0.1-0.1,0.2-0.1,0.3-0.2
	c-0.1-0.1-0.2-0.3-0.4-0.4c-0.2-0.1-0.4,0-0.6,0c0.1-0.2,0.6,0,0.5-0.3c0-0.2-0.3-0.3-0.5-0.5c0.1-0.4,0.1-0.8,0.2-1.3
	c0.1-0.7,0.1-1.3-0.2-1.9c-0.3-0.8-0.2-1.7-0.2-2.5c0-0.1,0.2-0.2,0.3-0.2c0.5,0,0.5,0,0.5-0.5c0,0,0,0,0,0c0.2-1.8,0.5-3.6,0.9-5.4
	c0.5-2,0.9-4,1.3-6.1c0.2-1.1,0.1-2.3,0.2-3.4c0-0.5,0.1-1,0.2-1.5c0-0.1,0-0.1,0.1-0.2c0.2,1.6,0.5,3.3,0.1,4.9
	c-0.4,1.6-0.8,3.3-1.1,4.9c-0.2,0.8-0.3,1.5-0.4,2.3c0,0,0,0.1,0,0.1c0.2,0.8-0.1,1.7-0.2,2.5c-0.2,1.6-0.3,3.2,0.2,4.8
	c0.5,1.8,1,3.6,1.6,5.4c0.3,0.9,0.3,1.8,0.4,2.7c0.1,0.5,0.1,1.1,0.1,1.7c0,0.4,0.1,0.5,0.6,0.5c0.1,0,0.2,0,0.3-0.1
	c0.6-0.2,0.6-0.2,0.8,0.4c0.4,1.1,0.8,2.1,1.1,3.2c0.4,1.5,0.3,3,0.3,4.6c0,1.5-0.5,2.9-0.6,4.4c0,0.4-0.1,0.8-0.1,1.2
	c0.2,1.4-0.1,2.8-0.1,4.2c0,0.7,0,1.3-0.1,2c-0.1,0.8,0,1.6-0.3,2.3c-0.3,0.9-0.4,1.9-0.6,2.9c-0.1,0.3,0,0.7,0.1,1.1
	c0.2,0.6,0.4,1.1,0.6,1.6c0.2,0.7,0.4,1.4,0.5,2c0.2,0.8,0.3,0.9,1.1,0.9c0.6,0,1.3,0.1,1.9,0c0.3,0,0.7-0.1,0.8-0.3
	c0.2-0.4,0.2-0.8,0.1-1.2c-0.1-0.4-0.4-0.7-0.5-1.1c-0.3-0.7-0.7-1.4-1-2.1c-0.1-0.2-0.1-0.4-0.1-0.5c0-0.1,0-0.3-0.1-0.4
	c-0.4-0.5-0.3-1-0.2-1.6c0.1-0.7,0.2-1.5,0.4-2.2c0.1-0.3,0.2-0.6,0.3-1c0.1,0.1,0.1,0.2,0.1,0.3c0.2,0.9,0.5,1.7,0.7,2.6
	c0.1,0.4,0.1,0.8,0,1.2c-0.1,0.6,0,1.1,0.3,1.6c0,0.3,0.1,0.6,0.2,0.9c-0.1,0-0.1,0.2-0.1,0.3c0,0.2,0,0.4,0,0.6
	c0,0.5,0.1,0.9,0.3,1.4c0.2,0.3,0.3,0.7,0.4,1.1c0,0.1,0.1,0.2,0.1,0.4c0,0,0.1,0,0.1,0c0.2-0.1,1.2,0.2,1.7,0.3c0,0,0,0,0,0
	c0.6-0.1,1.3-0.1,1.9-0.3c0.6-0.1,0.8-0.3,0.8-0.9c0-0.7-0.1-1.4-0.9-1.7c-0.1-0.1-0.2-0.2-0.2-0.4c-0.2-0.7-0.5-1.5-0.7-2.2
	c-0.2-0.7-0.4-1.3-0.6-2c-0.1-0.2-0.1-0.4-0.2-0.6c-0.3-0.7-0.4-1.5-0.3-2.3c0-2,0.1-3.9,0-5.9c0-1.3-0.3-2.6-0.4-3.8
	c-0.1-0.9-0.3-1.7-0.2-2.6c0-1.1,0.2-2.2,0.4-3.4c0.2-1.5,0.7-2.9,1.2-4.3c0.8-2.3,1.6-4.5,2.4-6.8c0.8-2.3,1.3-4.6,1.1-7
	c-0.1-1.2-0.3-2.3-0.5-3.5c0.1,0,0.2,0,0.3,0c0.3,0,0.4-0.1,0.4-0.4c-0.4-2.2-0.5-4.4-1-6.6c-0.1-0.4-0.2-0.7-0.3-1.1
	c0-0.5-0.1-1,0-1.5c0.1-1.1,0.2-2.2,0.4-3.4c0.1,0.1,0.1,0.1,0.1,0.1c0,1,0.4,1.9,0.7,2.9c0.4,1.5,0.8,3.1,1.3,4.6
	c0.3,1,0.9,1.9,1.3,2.8c0.3,0.7,0.6,1.4,0.9,2c0.3,0.7,0.7,1.4,1.1,2.1c0.1,0.2,0.3,0.2,0.5,0.3c0.1,0.1,0.2,0.2,0.2,0.3
	c0.1,1,0.4,1.8,0.9,2.6c0.1,0.1,0.1,0.3,0.2,0.4c0.1,0.2,0.1,0.4-0.2,0.6c-0.2,0.2-0.3,0.5-0.7,0.5c-0.1,0-0.2,0.3-0.2,0.5
	c0,0,0.2,0.1,0.4,0.1c0.7,0,1.4-0.2,2-0.6c0.1-0.1,0.2-0.2,0.3-0.4c0.2-0.5,0.4-1.1,0.5-1.6c0.1-0.4,0.2-0.9-0.2-1.4
	c-0.4-0.4-0.7-0.8-0.9-1.2c-0.2-0.3-0.4-0.8-0.4-1.1c0-1.3-0.3-2.5-0.6-3.7c-0.6-2-1.1-4-1.7-6.1c-0.3-1.2-0.7-2.4-1-3.6
	c-0.6-2.3-1.3-4.5-1.6-6.8c-0.1-0.7-0.1-1.4-0.5-1.9c-0.4-0.5-0.9-1-1.5-1.4c-0.4-0.3-1-0.3-1.4-0.4c-0.3-0.1-0.6-0.1-0.9-0.2
	c0.1-0.3,0.2-0.5,0.3-0.8c0.1-0.5,0.3-1,0.4-1.5c0.1-0.6-0.1-0.9-0.7-1c-0.3,0-0.7,0-1,0c0.1,0.2,0.1,0.4,0.1,0.5c0,0,0,0.1-0.1,0.1
	c-0.1-0.1-0.3-0.1-0.4-0.3c-0.1-0.1,0-0.3,0.1-0.4c0.2-0.3,0.5-0.5,0.7-0.9c0.1-0.2,0.2-0.5,0.2-0.8c0-0.9-0.1-1.8-0.2-2.6
	c-0.1-0.8-0.2-1.6-0.4-2.5c-0.1-0.6-0.4-1-0.8-1.4c-0.3-0.4-0.7-0.7-1-1c-1.2-1.2-2.7-1.4-4.3-1.1c-0.3,0.1-0.5,0.2-0.8,0.3
	c-0.1,0-0.2,0.1-0.2,0.1c-0.1,0.3-0.2,0.5-0.5,0.4c0,0-0.1,0.2-0.2,0.2c-0.2,0.2-0.4,0.3-0.5,0.5c-0.8,1.6-1.8,3.1-2,4.9
	c-0.2,1.6-0.3,3.2,0.1,4.7c0.1,0.6-0.1,0.9-0.7,0.8c-0.8-0.1-1.2,0.2-1.5,0.9c-0.1,0.2-0.2,0.3-0.4,0.4c-0.5,0.2-0.7,0.4-0.5,1
	c0.1,0.3,0,0.5-0.2,0.7c-0.4,0.5-0.5,1.1-0.6,1.6c-0.3,2-0.6,4-0.5,6c0,1.5-0.1,3-0.4,4.5c-0.3,1.9-0.5,3.9-0.8,5.8
	c-0.2,1.8-0.5,3.5-0.8,5.3c0,0.3,0,0.5,0,0.8c0,0.5,0,1-0.1,1.5c0,0.2,0,0.4,0.3,0.4c0.2,0,0.2,0.1,0.2,0.3
	c-0.1,0.9-0.1,1.7-0.2,2.6c-0.1,0.8-0.3,1.6-0.5,2.4C391.5,758.3,391.6,758.6,391.9,759z"/>
<g>
	<g>
		<path style="fill:#404040;" d="M368,761.7c-0.2,2.6-0.5,5.2-0.7,7.8c-0.1,0.9-0.2,1.8-0.3,2.7c-0.1,1.1-0.4,2.3-0.3,3.4
			c0.4,3.9,0.9,7.8,1.3,11.7c0.1,0.9,0.1,1.7-1.2,1.7c0.2,0.4,0.4,0.7,0.5,1c0,0.4,0,1.1-0.3,1.3c-0.9,0.7-0.6,1.4-0.1,1.9
			c1.5,1.2,0.8,2.5,0.4,3.7c-0.4,1-1.5,0.6-2.3,0.7c-0.5,0.1-1,0.1-1.5,0c-1.1,0-1.7-0.8-1.1-1.6c1.5-2,0.2-4.5,1.4-6.6
			c-1.5-0.2-1.5-1.1-1.6-2.2c-0.2-1.7-0.7-3.5-0.8-5.2c-0.4-3.9-0.7-7.9-1-11.8c-0.3-3.3-0.6-6.5-0.9-9.8c-0.1-1.7-0.3-3.4-0.3-5.1
			c0-0.7,0.3-1.5,0.4-2.2c0.1-0.9,0.2-1.9-0.9-2.5c-0.6-0.3-1.2-1-1.4-1.7c-0.3-1.3-0.9-2.3-1.7-3.2c-1.8-2.3-2.7-4.7-1.8-7.7
			c0.8-2.5,1.1-5.1,1.9-7.6c0.8-2.6,2-4.8,4.8-5.8c1.3-0.4,2.5-1.1,3.7-1.6c0.6-0.3,1-0.6,0.9-1.3c-0.1-0.5,0-1.1-0.1-1.6
			c0-0.3-0.3-0.6-0.5-0.8c-0.7-0.5-1.2-2.1-0.9-3c0.2-0.4,0.3-0.9,0.3-1.3c0-1.7,0.7-2.9,2.2-3.6c1.7-0.8,3.1-0.5,4.5,0.6
			c1.5,1.3,1.4,3.1,1.6,4.7c0.1,0.9,0.2,1.8-0.7,2.8c-0.6,0.7-0.5,2-0.6,3c0,0.3,0.4,0.7,0.7,0.8c1.9,0.9,3.8,1.7,5.7,2.5
			c0.3,0.1,0.7,0.4,0.9,0.7c1,2.4,1.9,4.8,2.2,7.4c0.3,3.2,0.7,6.4,1,9.6c0.2,1.6,0.6,3.2-0.1,4.5c0.1,0.7,0.3,1.3,0.3,1.9
			c0.1,0.7,0.2,1.5,0.1,2.2c-0.1,2.5,0.8,4.9-0.2,7.4c-0.5,1.4-1.5,1.8-2.6,2.4c0-0.6,0.2-1.2,0-1.5c-1.2-1.4-1.1-3.2-0.5-4.5
			c0.9-2.2,0.8-4.2,0.3-6.4c-0.6-2.5-1.2-5-1.8-7.5c-0.3-1.7-0.5-3.4-0.8-5.1c-0.1,0-0.2,0-0.4,0c0.2,2.1-0.8,4.2-0.2,6.4
			c0.3,1.2,0.4,2.5,0.6,3.7c0.2,1.2,0.3,2.3,0.5,3.5c0.1,0.4,0.3,0.7,0.3,1.1c0,2,0.1,4,0,6c-0.2,2.8-0.6,5.6-0.9,8.4
			c-0.3,2.5-1.2,5-0.9,7.6c0.1,1.1,0.3,2.2,0.3,3.3c-0.2,3.3-0.6,6.6-1,9.9c0,0.4-0.3,0.9-0.7,1.1c-0.8,0.4-0.5,0.8-0.2,1.3
			c0.6,0.9-0.2,4.4-1.1,5c0,0-0.1,0-0.1,0.1c-0.9,0.3-2.1,0.7-2.7-0.2c-0.4-0.7-0.5-1.9-0.2-2.7c0.3-0.8,0.3-1.3,0.1-2
			c-0.3-1.1-0.7-2.3-0.7-3.4c0-3,0.3-6.1,0.2-9.1c-0.1-4.3-0.4-8.6-0.6-12.9c0-0.8-0.2-1.7-0.3-2.5
			C368.3,761.7,368.2,761.7,368,761.7z M358.1,743.5c0.3,0.9,1,1.6,1.7,2.3c0.6-2.9-0.2-5.7-0.3-8.8
			C357.5,739.2,357.3,741.3,358.1,743.5z"/>
	</g>
</g>
<rect x="234.5" y="986.5" style="fill:#EA341C;" width="49.6" height="41.7"/>
<g>
	<text transform="matrix(1 0 0 1 242.8063 1016.9277)" style="fill:#FFFFFF; font-family:'FuturaLT-Bold'; font-size:24.7px;">28</text>
</g>
<text transform="matrix(1 0 0 1 292.7931 1014.8926)" style="fill:#262626; font-family:'FuturaLT-Bold'; font-size:19.5px;">Victims</text>
<path style="fill:#404040;" d="M419.9,1104.9c0.4,0,0.5-0.3,0.5-0.7c-0.1-1-0.2-2-0.4-3c-0.3-1.8-0.6-3.7-0.9-5.5
	c-0.2-1.1-0.9-1.8-2-2.2c-1.3-0.4-2.7-0.8-4-1.2c-0.1,0-0.3-0.1-0.4-0.2c-0.5-0.4-0.9-0.8-1.4-1.1c-0.5-0.3-0.9-1.1-0.6-1.6
	c0.4-0.7,0.6-1.5,1-2.1c0.7-1,0.8-2.2,1-3.3c0.1-0.7,0-1.5,0-2.3c0-0.4-0.1-0.7-0.5-1c-0.2-0.1-0.3-0.4-0.3-0.6
	c-0.1-1.1-0.4-1.5-1.4-1.8c-0.6-0.2-1.2-0.4-1.8-0.6c-0.2,0-0.4,0.1-0.5,0.1c-0.2,0.1-0.5,0.3-0.6,0.2c-0.4-0.2-0.7,0-1,0.2
	c-0.5,0.4-1,0.8-1.5,1.3c-0.3,0.2-0.5,0.3-0.6-0.1c-0.1,0.2-0.3,0.2-0.3,0.4c-0.3,0.5-0.6,1.1-0.7,1.6c-0.1,0.3-0.1,0.7,0,1.1
	c0.1,0.8,0.2,1.6,0.4,2.3c0,0.1,0,0.2,0,0.2c0,0.3-0.1,0.7,0,0.9c0.3,0.5,0.7,1,0.9,1.5c0.5,0.9,0.9,1.9,0.7,3
	c0,0.2-0.2,0.5-0.3,0.6c-0.4,0.4-0.8,0.8-1.2,1.1c-0.1,0.1-0.2,0.1-0.2,0.2c-0.4,0.1-0.8,0.2-1.1,0.3c-0.9,0.3-1.7,0.5-2.6,0.8
	c-1.2,0.5-2.1,1.3-2.5,2.5c-0.4,1.2-0.6,2.5-0.8,3.7c-0.3,1.8-0.5,3.6-0.7,5.4c0,0.3,0,0.4,0.3,0.5c0.5,0,0.5,0.3,0.5,0.7
	c0,0.4,0,0.9,0,1.3c-0.1,0.1-0.1,0.2-0.1,0.2c-0.1,1.6-0.1,3.2-0.2,4.8c0,0.6-0.2,1.3,0,1.9c0,0,0,0,0,0c0,0.5,0,1,0,1.5
	c0.3,4.3,0.7,8.6,1,12.8c0.1,1.2,0.6,2.2,1.6,2.9c0.5,0.3,0.5,0.7,0.6,1.1c0.1,1,0.2,2.1,0.3,3.1c0.1,0.7,0.2,1.3,0,2
	c-0.1,0.5-0.2,1.1-0.2,1.6c-0.1,1.9-0.2,3.8-0.2,5.7c0,0.8,0,1.7,0,2.5c0,0.7-0.1,1.4,0.2,2c0,0.1,0,0.2,0,0.3
	c0,0.3-0.1,0.5-0.1,0.8c0,2.4,0.1,4.9,0.2,7.3c0,0.3-0.1,0.7,0.3,1c0,0,0,0.2,0,0.3c-0.1,0.5-0.3,1-0.4,1.5
	c-0.3,0.9-0.7,1.7-1.1,2.6c-0.5,1.3-0.3,2.2,1.1,2.6c0.8,0.3,1.6,0.2,2.4-0.1c0.6-0.2,1.2-0.5,1.4-1.2c0.2-0.6,0.4-1.2,0.5-1.9
	c0.2-1.6,0.2-3.1,0.4-4.7c0.2-1.5,0.2-2.9,0.2-4.4c-0.1-1.9,0.1-3.9,0.2-5.8c0.1-1,0.2-2,0.3-3c0-0.4,0.1-1.1-0.4-1.2
	c0-0.4,0-0.7,0-1c0.1-1,0.3-1.9,0.5-2.8c0.2-0.8,0.3-1.6,0.5-2.4c0.3-1.1,0.7-2.3,1-3.4c0.3-1.1,0.7-2.3,1.1-3.4
	c0.1-0.2,0.3-0.4,0.5-0.6c0.2,0.2,0.4,0.4,0.6,0.5c0.1,0.1,0.1,0.2,0.1,0.2c0.5,1.6,1,3.2,1.5,4.8c0.3,1,0.4,2.1,0.5,3.1
	c0.1,1.7,0.1,3.3,0.2,5c0,0.7,0.1,1.4,0.2,2.2c0.1,1.2,0.4,2.4,0.4,3.6c0.2,3.1,0.2,6.3,0.3,9.4c0,0.2,0.1,0.4,0.2,0.6
	c0.1,0.2,0.1,0.3,0.1,0.5c0,1.4-0.1,2.8,0,4.1c0,0.7,0.4,1.1,1,1.5c0.6,0.4,1.3,0.4,1.9,0.3c1.3-0.1,2.2-1.4,1.8-2.6
	c-0.3-1-0.6-2-0.9-3.1c-0.1-0.4-0.2-0.8-0.2-1.2c0-0.3,0.2-0.7,0.2-1c0-2.4-0.1-4.8,0.4-7.2c0.4-2.2,0.4-4.5,0.2-6.8
	c-0.1-1.3-0.2-2.5-0.2-3.8c0.1-3,0.2-6,0.3-9c0-0.3,0.1-0.4,0.4-0.5c0.4-0.2,0.9-0.4,1.2-0.6c0.9-0.7,1.2-1.7,1.3-2.8
	c0.2-3.2,0.2-6.5,0.4-9.7c0.2-2.6,0.2-5.2,0-7.9c-0.1-1.7-0.2-3.4-0.3-5.1C419.5,1105.2,419.5,1105,419.9,1104.9z M416.9,1124
	c-0.2,0.3-0.4,0.6-0.7,1c-0.1-0.4-0.2-0.7-0.2-0.9c-0.1-0.3-0.1-0.5,0.3-0.6c0.1,0,0.2-0.3,0.2-0.5c0-1.1,0-2.3,0-3.4
	c0-0.2,0-0.4,0-0.6c0,0,0.1,0,0.1,0c0.2,1,0.3,1.9,0.5,2.9C417.4,1122.6,417.3,1123.3,416.9,1124z"/>
<rect x="258.5" y="656" style="fill:#FFFFFF;" width="65" height="31"/>
<g>
	<text transform="matrix(1 0 0 1 248.7641 676.4932)" style="fill:#262626; font-family:'FuturaLT'; font-size:19.5px;">[of which] </text>
</g>
</svg>
