<?xml version="1.0" encoding="utf-8"?>
<!-- Generator: Adobe Illustrator 22.0.0, SVG Export Plug-In . SVG Version: 6.00 Build 0)  -->
<svg version="1.1" id="Layer_1" xmlns="http://www.w3.org/2000/svg" xmlns:xlink="http://www.w3.org/1999/xlink" x="0px" y="0px"
	 width="600px" height="700px" viewBox="0 0 600 700" style="enable-background:new 0 0 600 700;" xml:space="preserve">
<g>
	<text transform="matrix(1 0 0 1 441.9487 404.9434)"><tspan x="0" y="0" style="fill:#262626; font-family:'FuturaLT'; font-size:18.2px;">Economic</tspan><tspan x="0" y="21.8" style="fill:#262626; font-family:'FuturaLT'; font-size:18.2px;">exploitation </tspan><tspan x="0" y="43.7" style="fill:#262626; font-family:'FuturaLT'; font-size:18.2px;">and begging</tspan></text>
</g>
<g>
	<text transform="matrix(1 0 0 1 124.0981 430.043)"><tspan x="0" y="0" style="fill:#262626; font-family:'FuturaLT'; font-size:18.2px;">Between 9 </tspan><tspan x="0" y="21.8" style="fill:#262626; font-family:'FuturaLT'; font-size:18.2px;">and 17 years old</tspan></text>
</g>
<g>
	<text transform="matrix(1 0 0 1 124.0981 216.9434)" style="fill:#262626; font-family:'FuturaLT'; font-size:18.2px;">Girls</text>
</g>
<g>
	<text transform="matrix(1 0 0 1 456.2485 200.9434)"><tspan x="0" y="0" style="fill:#262626; font-family:'FuturaLT'; font-size:18.2px;">School </tspan><tspan x="0" y="21.8" style="fill:#262626; font-family:'FuturaLT'; font-size:18.2px;">drop-outs</tspan></text>
</g>
<g>
	<text transform="matrix(1 0 0 1 22.2217 649.1934)"><tspan x="0" y="0" style="fill:#262626; font-family:'FuturaLT'; font-size:16.25px;">Source : Office of the General Delegate </tspan><tspan x="0" y="19.5" style="fill:#262626; font-family:'FuturaLT'; font-size:16.25px;">for Child Protection</tspan></text>
</g>
<line style="fill:none;stroke:#262626;stroke-width:0.65;stroke-miterlimit:10;" x1="457.4" y1="72.4" x2="150.6" y2="72.4"/>
<line style="fill:none;stroke:#262626;stroke-width:5.2;stroke-miterlimit:10;" x1="347.8" y1="72.3" x2="260.1" y2="72.3"/>
<path style="fill:#404040;" d="M392.8,422c0.2-0.6,0.7-0.8,1.2-1c0,0,0-0.1-0.1-0.1c-0.3,0.1-0.6,0.2-1,0.4c0.4-0.5,0.9-0.7,1.5-0.6
	c0.5,0,1.1,0.2,1.6,0.3c0,0,0,0,0.1-0.1c-0.3-0.2-0.5-0.5-0.8-0.7c0.5,0,0.8,0.4,1,0.7c0.1-0.1,0.2-0.1,0.3-0.2
	c-0.2-0.3-0.4-0.6-0.5-0.9c0.7,0.4,0.7,0.4,1.3,0.1c0.1,0,0.2-0.1,0.2-0.1c0.7-0.2,1.1,0.1,1.3,0.7c0.1,0.4,0.5,0.5,0.8,0.2
	c0.1-0.1,0.1-0.1,0.2-0.2c0,0,0.1,0,0.1,0.1c-0.1,0.3-0.3,0.6-0.4,0.8c0,0,0,0,0.1,0.1c0.2-0.2,0.5-0.4,0.8-0.6
	c0,0.2-0.1,0.3-0.1,0.6c0.4,0,0.8,0,1.1-0.3c0.2-0.3,0.4-0.6,0.5-0.9c0.2,0.4,0,0.8-0.1,1.3c0.2,0,0.3,0,0.4,0
	c0.7-0.1,1.3,0,1.9,0.3c0.7,0.4,1.4,0.7,2.1,1c1,0.4,1.4,1.3,1.8,2.3c0.2,0.4,0.4,0.8,0.7,1.1c0.4,0.3,0.7,0.5,1.3,0.3
	c-0.1,0.5-0.5,0.5-0.8,0.7c0.2,0.6,0.2,1.2-0.1,1.9c-0.1-0.3-0.1-0.5-0.1-0.7c0,0-0.1,0-0.1,0c-0.1,0.9-0.2,1.9-0.3,2.9
	c-0.4,0.2-0.5,0.5-0.3,1c0.1,0.3,0.3,0.6,0.5,0.9c0.2,0.5,0.1,0.8-0.3,1.1c-0.1,0.1-0.2,0.3-0.3,0.4c0,0.1,0,0.3,0,0.4
	c0,0.4-0.1,0.5-0.5,0.6c-0.6,0.1-0.8,0.5-0.5,1c0.1,0.2,0.1,0.5-0.1,0.7c-0.2,0.2-0.3,0.4-0.3,0.7c-0.2,0.8-0.8,1.2-1.6,0.9
	c-0.1,0-0.1-0.1-0.2-0.1c-0.3,0-0.4,0.1-0.5,0.4c-0.1,0.2,0.1,0.3,0.3,0.3c0.2,0,0.3,0.1,0.5,0.2c2.1,1,3.4,2.6,3.9,4.8
	c0.3,1.1,0.9,1.9,1.8,2.6c0.6,0.4,1,0.9,1.3,1.5c0.2,0.4,0.4,0.8,0.6,1.2c0.3-0.4,0.7-0.2,1.1-0.2c0.5,0,1-0.1,1.5-0.2
	c0.4-0.7,1.1-0.8,1.7-1.1c1-0.5,2-1.1,3-1.7c0.2-0.1,0.6-0.4,0.8-0.3c0.4,0.1,0.6,0,0.9-0.2c0.5-0.3,1-0.5,1.4-0.8
	c0.7-0.5,1.4-0.7,2.2-0.6c0.3,0,0.5,0.2,0.8,0.4c0.3,0.2,0.7,0.4,1.1,0.4c0.6,0,1.3,0,2,0c0.1-0.2,0.1-0.4,0.2-0.5
	c0.1-0.2,0.2-0.4,0.3-0.6c0.2-0.3,0.9-0.3,1.1,0c0,0.1,0.1,0.1,0,0.2c0,0.5-0.1,0.9-0.1,1.4c-0.1,0.8-0.2,1.5-1,1.9
	c-0.6,0.3-1.3,0.5-2,0.7c-0.8,0.2-1.6,0.1-2.4-0.2c-0.9-0.3-1.8,0.2-2,1.1c-0.1,0.4-0.1,0.7-0.2,1.1c-0.3,0.9-0.8,1.6-1.7,2
	c-1.2,0.5-2.4,1-3.6,1.5c-0.8,0.3-1.5,0.7-2.3,1c-0.7,0.2-1.4,0.4-2.1,0.5c-0.4,0.1-0.9,0.2-1.3,0.3c0,0.1,0,0.2,0,0.3
	c0.1,2,0.2,4,0.3,6c0,0.9-0.1,1.8-0.6,2.7c-0.2,0.4-0.2,1-0.2,1.4c0,0.6,0,0.7-0.5,0.9c-0.5,0.2-1.1,0.3-1.6,0.3
	c-0.3,0-0.5,0.1-0.5,0.4c-0.2,0.9-0.4,1.8-0.5,2.7c-0.1,2.4-0.8,4.5-1.7,6.7c-0.3,0.8-0.6,1.7-0.7,2.6c-0.1,0.7,0,1.4-0.2,2.1
	c-0.2,1.2-0.7,2.2-1.3,3.2c-0.1,0.1-0.1,0.3-0.1,0.4c0,1.3,0,2.7,0,4c0,0.4,0,0.7,0,1c0.5,0,0.9,0,1.4,0.1c0.9,0.1,1.1,0.4,1.3,1.3
	c0,0.1,0,0.2,0,0.3c0,1.1-0.1,2.3-0.2,3.4c0,0.1,0,0.3,0,0.4c0,0.3,0.1,0.7,0.1,1c0,0.6,0.2,1.1,0.5,1.5c0.6,0.9,1.6,1.1,2.6,1.2
	c0.7,0.1,1.4,0.1,2,0.3c0.7,0.2,1.2,0.6,1.2,1.4c0,0.1,0,0.2,0.1,0.2c0.3,0.8,0.2,1.2-0.5,1.7c-0.5,0.3-1,0.5-1.6,0.8
	c-0.3,0.1-0.4,0.2-0.3,0.5c0.1,0.3,0,0.6-0.1,0.9c-0.4,1.1-1.3,1.7-2.3,2.1c-1.4,0.6-2.8,0.6-4.3,0.4c-0.7-0.1-1.4-0.1-2-0.4
	c-1-0.5-1.9-0.6-3-0.4c-1.1,0.3-2.3,0-3.4-0.6c-0.4-0.2-0.8-0.6-0.7-1.1c0-0.8,0.1-1.6,0.3-2.3c0.1-0.7,0.5-1.3,0.4-2.1
	c-0.1-0.6,0-1.2,0-1.8c0-1.3,0.2-2.6-0.1-3.9c-0.1-0.4-0.1-0.9,0.3-1.1c0.4-0.2,0.3-0.4,0.2-0.8c-0.4-1.9-0.3-3.8,0-5.7
	c0.1-1.1,0.4-2.1,0.5-3.2c0.1-1.8,0.6-3.6,0.9-5.4c0.3-1.4,0.5-2.8,0.7-4.2c0-0.3,0-0.6,0.1-0.9c0-0.2,0-0.3,0-0.5
	c0-0.1-0.1-0.3-0.1-0.5c0-0.2,0-0.4-0.1-0.7c0-0.9-0.5-1.7-0.8-2.5c-0.9-2.5-0.9-4.9,0.5-7.2c0.1-0.2,0.1-0.3,0-0.4
	c-0.2-0.2-0.2-0.4,0.1-0.6c0.4-0.4,0.7-1,0.9-1.5c-0.4-0.3-0.8-0.5-1.1-0.8c-1.4-1.4-1.6-3.1-1.3-4.9c0.3-1.7,0.4-3.3-0.1-5
	c-0.4-1.6-0.8-3.2-0.8-4.8c0.1-1.2,0.2-2.5,0.3-3.7c0.1-0.6,0.2-1.2,0.6-1.7c0.3-0.4,0.4-0.9,0-1.4c-0.6-0.9-0.3-1.6,0.6-2
	c0.5-0.2,0.6-0.4,0.5-0.9c0-0.2-0.1-0.5-0.2-0.7c-0.3,0.4-0.6,0.8-0.8,1.1c0,0-0.1,0-0.1-0.1c0.2-0.4,0.4-0.9,0.1-1.3
	c-0.2,0.3-0.3,0.5-0.5,0.8c0-0.2,0-0.2,0-0.2c0.3-0.7,0.1-1.4-0.3-2c-1.5-2.4-1.7-4.8-0.5-7.4c0.2-0.4,0.4-0.7,0.5-1.1
	c-0.4-0.1-0.5-0.4-0.5-0.8c0-0.1,0-0.2-0.1-0.2c-0.5-0.4-0.6-0.9-0.4-1.5c-0.8-0.1-1.5,0-2,0.6c0-0.1,0.1-0.3,0.2-0.3
	c0.4-0.2,0.7-0.4,1.1-0.6C394.1,421.1,393.4,421.3,392.8,422z"/>
<path style="fill:#404040;" d="M352.1,428.8c-1.3-0.1-2.7-0.3-4-0.3c-1.8-0.1-3.5-0.3-5.3,0.1c-0.1,0-0.2,0-0.2,0
	c-0.5-0.3-1.1-0.2-1.6,0c-1.5,0.5-3,1-4.5,1.5c-0.1,0-0.2,0.1-0.3,0.1c-0.7-0.2-1.2,0.2-1.7,0.6c-0.2,0.2-0.5,0.3-0.7,0.1
	c-0.8-0.5-1.7-0.4-2.5,0.2c-0.1,0-0.2,0.1-0.2,0.1c-0.4-0.2-0.7-0.5-1.1-0.8c-0.3-0.2-0.4-0.5-0.7-0.7c-0.3-0.2-0.5-0.4-0.6-0.8
	c-0.1-0.3-0.3-0.7-0.5-0.8c-0.4-0.2-0.5-0.5-0.5-0.8c0-0.5-0.2-0.8-0.6-1.1c-0.3-0.2-0.5-0.4-0.6-0.9c0-0.3-0.2-0.6-0.4-0.9
	c-0.2-0.3-0.2-0.5-0.2-0.8c0.1-0.3,0.1-0.6,0-0.9c-0.2-0.9-0.5-1.8-0.8-2.6c-0.1-0.2-0.2-0.3-0.4-0.4c-1.7-1.1-3.5-2.2-5.2-3.3
	c-0.5-0.3-0.9-0.7-1.4-1.1c1.4,0,1.4,0,1.5-1.5c0-0.1,0-0.3,0.1-0.4c0.3-0.2,0.3-0.5,0.2-0.8c-0.2-1,0.4-2.4,1.3-2.8
	c0.4-0.2,0.7-0.8,0.7-1.3c-0.1-0.7-0.1-0.7,0.5-0.9c0.8-0.2,0.8-0.5,0.4-1.2c-0.3-0.4-0.6-0.8-0.9-1.2c-0.1-0.1-0.1-0.4-0.1-0.5
	c0.3-0.4,0.3-0.7,0.1-1.1c-0.2-0.4-0.4-0.9-0.6-1.3c-0.4-0.8-0.7-1.6-1.3-2.3c-0.8-0.8-1.7-1.1-2.8-1.4c-1.4-0.3-2.8-0.4-4.2,0.2
	c-1,0.4-1.8,1-2.3,2.1c-0.7,1.5-0.6,3.1-0.5,4.7c0.1,1,0.2,2,0.3,3c0,0.4,0,0.7-0.2,1c-0.1,0.1-0.3,0.3-0.4,0.5
	c-0.1,0-0.1,0.1-0.2,0.1c-0.4,0.1-0.8,0.2-1.2,0.4c0,0.1-0.1,0.2-0.1,0.3c-0.3,0.5-0.9,0.5-1.4,0.6c-1.1,0.1-2.2,0.1-3.3,0.1
	c-0.7,0-1.4,0-2.1,0.1c-0.7,0.1-2,0.5-3,0.4c-0.2,0.2-0.5,0.3-0.8,0.3c-0.3,0-0.6,0.2-1,0.3c-0.3,0.1-0.6,0.2-0.8,0.2
	c-0.5,0-1.1-0.2-1.6,0.1c-0.1,0-0.2,0-0.3-0.1c-0.3-0.3-0.7-0.2-1-0.1c-0.3,0.1-0.7,0.1-1,0c-0.4-0.1-0.7-0.3-1.1-0.2
	c-0.1,0-0.2,0-0.3-0.1c-0.3-0.4-0.7-0.3-1.1-0.3c-0.8,0.1-1.7,0.3-2.4-0.3c-0.1-0.1-0.2-0.1-0.2-0.1c-0.6,0-1.1-0.3-1.6-0.5
	c-1.5-0.6-3-1.3-4.7-1.3c-0.7,0-1.3-0.2-2-0.4c-1-0.3-1.9-0.6-2.9-0.8c-0.4-0.1-0.8-0.1-1.2-0.3c-0.2-0.1-0.4,0-0.4,0.1
	c-0.1,0-0.2-0.1-0.3-0.1c-1.4-0.5-2.8-0.9-4-1.8c-0.6-0.4-1.3-0.8-2-0.8c-1.7-0.2-3.5-0.3-5.3-0.3c-0.2,0-0.4,0.2-0.5,0.3
	c0.1,0.2,0.3,0.4,0.4,0.5c0.5,0.2,1,0.3,1.4,0.4c0.5,0.1,1.1,0.3,1.6,0.5c0.4,0.1,0.3,0.4,0.1,0.6c-0.2,0.2-0.4,0.3-0.6,0.5
	c-0.1,0.2-0.2,0.5-0.2,0.7c0.2,0.4,0.6,0.7,0.6,1.3c0,0,0.1,0.1,0.1,0.1c0.1,0.2,0.3,0.5,0.4,0.7c0.1,0.1,0.2,0.3,0.3,0.3
	c0.4,0.3,0.8,0.1,1.2,0c0.2-0.1,0.5-0.1,0.8-0.1c0.5,0,1.1,0.2,1.6,0.2c0.7,0,1.4-0.2,2.1,0.2c0.5,0.2,0.9,0.5,1.4,0.8
	c0.1-0.5,0.2-1,0.3-1.5c0,0,0,0,0,0c0,0,0,0,0,0c-0.2,1.2-0.4,2.5-0.7,3.7c-0.1,0.4,0,0.6,0.3,0.6c0.8,0.2,1.5,0.4,2.3,0.5
	c1.3,0.3,2.5,0.5,3.7,0.9c1.4,0.5,2.8,1.2,4.3,1.3c0.3,0,0.6,0.1,0.7,0.3c0.6,0.9,1.5,0.9,2.3,1c0.5,0.1,1.1,0,1.6,0.1
	c1,0.2,1.9,0.6,2.9,0.9c1.4,0.4,2.8,0.7,4.2,0.7c0.1,0,0.1,0,0.2,0c0.1,0,0.2,0,0.2,0c0.2,0,0.4,0,0.6-0.1c0,0,0,0,0.1,0
	c0.6,0.2,0.6,0.2,0.7,0.9c0.1,0.5,0.2,1,0.4,1.5c0.1,1,0.3,2,0.4,3.1c0,0.2,0.1,0.4,0.1,0.6c0.1,0.6,0.2,1.3,0.2,1.9
	c0.1,0.8,0.3,1.5,0.2,2.3c-0.1,0.8-0.4,1.7-0.3,2.5c0.1,0.3,0.2,0.6,0.2,0.9c0.1,0.5-0.1,1-0.2,1.5c-0.8,3.3-0.2,6.9-1.4,10
	c-0.2,0.6-0.5,1.1-0.7,1.8c0,0.1-0.1,0.2-0.1,0.3c-0.3,0.7-0.6,1.5-0.8,2.3c-0.1,0.1-0.2,0.1-0.2,0.2c0,0,0.1,0.1,0.1,0.1
	c0,0,0,0,0.1,0c-0.3,1.1-0.5,2.2-0.4,3.3c0,0.3,0,0.5,0.1,0.7c-0.1,1-0.3,2.1-0.3,3.1c-0.3,3.9,0.3,8.3-1.8,11.5
	c-0.3,0.5-0.7,0.9-0.9,1.5c-0.2,0.5-0.4,1.1-0.5,1.7c-1.5,8.3-3,16.6-3.2,25c0,0.5,0,1,0.1,1.5c0.1,0.4,0.3,0.9,0.4,1.3
	c0.7,2.4-1.6,5-0.9,7.4c0.8,2.6,4.3,3.8,6.2,1.8c1-1.1,1.1-2.7,1-4.2c-0.1-1.5-0.3-3.1,0.3-4.4c0.4-0.9,1.1-1.7,1.2-2.7
	c0-0.5-0.1-0.9-0.1-1.4c0-0.5,0.3-1,0.6-1.5c0.6-1.1,0.8-2.4,1.1-3.6c0.7-3.4,1.3-6.7,2-10.1c0.1-0.7,0.3-1.4,0.6-2
	c0.2-0.3,0.4-0.6,0.5-0.9c0.4-0.8,0.6-1.7,0.8-2.6c0.9-4,2-7.9,3.5-11.6c0.2-0.6,0.5-1.3,0.7-2c0.2,3.1,1,6.1,0.8,9.1
	c-0.1,1.2-0.3,2.5-0.1,3.7c0.2,0.8,0.5,1.5,0.7,2.3c0.2,0.8,0.3,1.6,0.3,2.4c0.1,1.2,0.2,2.4,0.4,3.7c0.3,2.5,0.6,5.1,1.4,7.4
	c0.3,1.1,0.8,2.1,0.9,3.3c0.3,2.5-1,5.1-0.3,7.5c0.1,0.4,0.3,0.8,0.6,1c0.2,0.2,0.6,0.3,0.9,0.4c1.8,0.6,3.6,1.2,5.4,1.9
	c1.8,0.6,3.6,1.2,5.5,1.1c0.6,0,1.1-0.1,1.6-0.5c0.1-0.1,0.2-0.2,0.3-0.3c0.3-0.1,0.5-0.3,0.5-0.7c0-0.6,0-0.7-0.4-0.9
	c-0.2-0.2-0.4-0.4-0.6-0.6c-1.8-1.5-5.1-3.8-5.8-6.3c-0.7-2.3-0.4-5.6-0.3-8c0.2-4.8,0.4-9.5,0.6-14.3c0-1.2,0.1-2.3-0.1-3.4
	c-0.1-0.7-0.3-1.3-0.4-1.9c-0.2-1.1-0.1-2.2-0.1-3.3c0.2-3.2,0.6-6.3,1-9.5c0,0,0,0,0,0c0.4-0.2,0.5-0.5,0.3-0.9
	c-0.2-0.4-0.4-0.7-0.6-1.1c-0.4-0.7-1-1.3-1-2.2c0-0.6,0-1.3,0.1-1.9c0.1-1,0.1-2.1-0.3-3c-0.5-1.1-0.4-2.2-0.2-3.4
	c0.4-2.3,0.9-4.6,1.8-6.8c0.3-0.8,0.5-1.7,1.2-2.2c0.8-0.6,1.5-1.3,1.8-2.4c0.2,0.1,0.3,0.2,0.4,0.4c1.3,1.3,2.6,2.6,4,3.9
	c1.2,1.2,2.7,1.8,4.4,1.6c1.9-0.2,3.8-0.6,5.6-0.9c1.2-0.2,2.4-0.5,3.5-0.8c1.1-0.2,2.1-0.4,3.2-0.6c0.4-0.1,0.6-0.2,0.6-0.7
	c-0.1-0.9-0.1-1.7-0.1-2.6c0-0.2,0.1-0.4,0.2-0.5c0.3-0.1,0.7-0.1,1.1-0.2c0,0.4,0.2,0.5,0.5,0.6c0.8,0.3,1.5,0.2,2.3-0.1
	c0.7-0.3,1.1-0.7,0.7-1.6c-0.1-0.1-0.1-0.3-0.1-0.4c-0.2-0.3,0-0.4,0.3-0.4c0.5,0,1,0.1,1.5,0c0.7-0.1,1.5-0.3,2.2-0.5
	c0.1,0,0.2-0.3,0.3-0.5C352.4,429,352.3,428.9,352.1,428.8z"/>
<path style="fill:#404040;" d="M383,468.7c-0.2-0.3-0.5-0.7-0.7-1.1c-0.6-1.4-1.2-2.9-1.8-4.3c-0.3-0.6-0.7-1.2-0.9-1.9
	c-0.3-0.8-0.6-1.6-0.9-2.4c-1.1-3-2.4-5.9-4-8.7c-1.3-2.3-2.8-4.6-5-6.1c-0.4-0.2-0.4-0.5,0-0.8c0.3-0.2,0.6-0.4,0.9-0.6
	c1-0.6,2-1.2,2.8-2.1c0.8-0.8,1.4-1.7,1.5-2.9c0.3-2.1-0.3-4-1.4-5.6c-0.7-1-1.6-1.7-2.6-2.4c-1.3-1-2.7-1.7-4.3-1.9
	c-1.2-0.2-2.3-0.2-3.5,0.3c-0.6,0.2-0.9,0.7-0.9,1.4c0,0.1-0.1,0.3-0.1,0.4c-0.5,0.7-0.9,1.5-1.2,2.3c-0.2,0.6-0.5,1-1.1,1.1
	c-0.2,0.1-0.4,0.1-0.6,0.2c-0.6,0.3-1,0.8-0.4,1.5c0,0,0,0.1,0.1,0.1c-0.1,0.1-0.1,0.2-0.2,0.3c-0.4,0.8-0.4,0.9,0.2,1.6
	c0.3,0.4,0.3,0.5-0.1,0.8c-0.1,0.1-0.3,0.1-0.4,0.2c-0.1,0.1-0.3,0.3-0.3,0.4c-0.1,0.2,0,0.5,0,0.7c-0.4,0.5-0.6,1.1-0.2,1.5
	c-0.1,0.1,0,0.2,0.2,0.4c0.2,0.2,0.4,0.3,0.6,0.5c0.2,0.2,0.5,0.3,0.8,0.4c1.1,0.6,1.8,1.6,2,2.9c0.1,0.9,0.3,1.7,0.4,2.6
	c0,0.3,0.1,0.6,0.1,0.8c-0.1,1.5-0.2,2.9-0.3,4.4c-0.1,2.3,0,4.6,0.4,6.9c0.4,2.1,0.8,4.2,1.3,6.4c0,0.2,0,0.4-0.1,0.6
	c-0.5,0.7-0.9,1.3-1.3,2c-0.2,0.4-0.5,0.8-0.8,1.1c-0.2,0.2-0.5,0.4-0.7,0.7c-0.3,0.4-0.6,0.8-0.6,1.4c0,0.3-0.1,0.6-0.2,0.9
	c-0.1,0.3-0.2,0.6-0.2,0.9c-0.1,0.8,0.3,1.4,1.1,1.3c0.5,0,1.1-0.2,1.6-0.3c0,0,0.1,0,0.1-0.1c0.2-0.3,0.5-0.2,0.8-0.1
	c0.3,0.1,0.5-0.1,0.5-0.4c0-0.2-0.1-0.4-0.1-0.6c0-0.2,0-0.3,0.1-0.5c0.2-0.6,0.4-1.1,0.6-1.7c0.1-0.3,0.1-0.6,0.1-1
	c0.2,0.4,0.3,0.6,0.4,0.9c0.2,0.4,0.2,0.9,0.2,1.4c0,0.4,0,0.9,0.2,1.3c0.2,0.6,0.5,1.2,0.7,1.8c0.2,0.8,0.4,1.5,0.3,2.3
	c-0.1,0.6-0.3,1.1,0.1,1.7c0,0,0,0.1,0,0.1c-0.1,0.9-0.2,1.8-0.4,2.7c-0.3,1.1-0.3,2.2,0.1,3.3c0.3,0.8,0.4,1.6,0.2,2.4
	c-0.2,0.7-0.3,1.3-0.4,2c-0.3,1.8-0.6,3.6-0.9,5.4c-0.1,0.7-0.1,1.5-0.6,2.1c-0.2,0.3-0.2,0.6-0.4,0.9c0,0.1-0.1,0.1-0.1,0.2
	c-0.1-0.5-0.2-0.6-0.6-0.4c-0.3,0.1-0.5,0.2-0.7,0.4c-0.9,0.8-1.9,1.2-3.1,1.3c-0.8,0.1-1.5,0.3-2.2,0.5c-0.2,0.1-0.5,0.3-0.5,0.5
	c-0.2,1.1,0.2,2.2,1.4,2.5c1.3,0.3,2.6,0.3,3.9,0.1c0.9-0.1,1.8-0.2,2.6-0.2c0.7,0,1.4,0.2,2.2,0.3c-0.2,0.2-0.2,0.3-0.3,0.4
	c-0.3,0.4-0.6,0.7-0.8,1.1c-0.3,0.6-0.8,0.9-1.4,1.1c-0.3,0.1-0.7,0.3-1,0.4c-0.5,0.3-0.7,0.9-0.5,1.5c0.2,0.6,0.6,1.1,1.2,1.3
	c0.4,0.2,0.9,0.4,1.4,0.5c1.6,0.3,3.1,0.2,4.6-0.6c0.6-0.3,1.1-0.7,1.7-1.1c0.3-0.2,0.5-0.4,0.7-0.6c0.3-0.4,0.6-0.8,0.6-1.3
	c-0.1-0.6-0.1-1.2-0.4-1.8c-0.3-0.7-0.1-1.3,0.2-1.8c0.1-0.2,0.2-0.4,0-0.6c-0.1-0.2-0.1-0.4,0-0.6c0.4-0.7,0.8-1.3,1.1-2
	c0.6-1.3,1.3-2.5,1.9-3.9c0.5-1.2,0.6-2.6,0.7-3.9c0.1-1.1,0-2.3-0.3-3.4c-0.1-0.3-0.1-0.7-0.1-1c0.1-1.9,0.4-3.7,1-5.5
	c0.2-0.6,0.4-1.2,0.6-1.8c0.2-0.4,0.4-0.9,0.7-1.4c0.1,0,0.2,0,0.2,0.1c-0.1-0.1-0.1-0.2-0.2-0.2c0-0.1,0.1-0.2,0.1-0.2
	c0,0,0,0.1,0.1,0.1c0.1,0,0.1-0.1,0.2-0.1c0-0.1-0.1-0.2-0.1-0.3c0.1-0.1,0.1-0.2,0.2-0.3c0,0,0.1,0.1,0.1,0.1c0-0.1,0-0.1,0-0.2
	c0.2-0.2,0.3-0.4,0.5-0.6c0,0,0,0,0,0c0,0,0.1,0,0.1-0.1c0.1-0.2,0.2-0.4,0.3-0.6c0.6-1,1.1-2.1,1.3-3.3c0-0.3,0.2-0.5,0.4-0.7
	c0.6-0.8,1.3-1.5,1.9-2.2C383.3,469.6,383.3,469.1,383,468.7z M369.9,495.7c-0.3,1.3-0.6,2.6-0.9,3.9c-0.1,0.3-0.1,0.6-0.5,0.7
	c-0.1,0-0.1,0.2-0.2,0.4c0,0.1,0,0.3-0.1,0.4c0,0-0.1,0-0.1,0c0-0.1,0-0.2-0.1-0.2c-0.1-0.3-0.2-0.7-0.2-1c0-0.2,0-0.4,0.1-0.6
	c0.1-0.3,0.3-0.6,0-0.9c0,0,0-0.2,0-0.2c0.6-1.7,1.2-3.4,2.2-4.9c0,0,0,0,0.1-0.1c0,0,0.1,0,0.1,0
	C370.2,493.9,370.1,494.8,369.9,495.7z"/>
<rect x="410.4" y="102.9" style="fill:#EA341C;" width="109.7" height="41.7"/>
<g>
	<text transform="matrix(1 0 0 1 418.9419 133.2783)" style="fill:#FFFFFF; font-family:'FuturaLT-Bold'; font-size:24.7px;">13,250</text>
</g>
<g>
	<g>
		<polygon style="fill:#1F333E;" points="468.3,670.7 468.3,656.3 482.8,656.3 482.8,656.3 		"/>
		<polygon style="fill:#44606D;" points="468.3,641.8 468.3,656.3 475.6,649 		"/>
		<polygon style="fill:#547482;" points="475.6,649 482.8,656.3 482.8,641.8 		"/>
		<polygon style="fill:#90C2D9;" points="475.6,634.6 482.8,641.8 482.8,627.3 		"/>
		<polygon style="fill:#2A404A;" points="468.3,656.3 482.8,656.3 475.6,649 		"/>
		<polygon style="fill:#6A8FA1;" points="468.3,641.8 482.8,641.8 475.6,649 		"/>
		<polygon style="fill:#77A1B4;" points="468.3,641.8 482.8,641.8 475.6,634.6 		"/>
	</g>
	<g>
		<path style="fill:#1A171B;" d="M496.5,633.3v2.6h-2.1v-2.6H496.5z M496.5,638.8v17.4h-2.1v-17.4H496.5z"/>
		<path style="fill:#1A171B;" d="M501.1,656.3v-17.4h1.3l0.6,1.1c0.5-0.9,1.4-1.5,2.6-1.5c2.5,0,3.4,1.3,3.4,4v13.8h-2.1v-13.8
			c0-1.3-0.5-2.2-1.7-2.2c-1.3,0-1.8,0.8-1.8,2.2v13.7H501.1z"/>
		<path style="fill:#1A171B;" d="M515.7,646.4l3.4-7.6h2.3l-3.9,8.4l4.3,9h-2.3l-3.7-8.2v8.2h-2.1v-24.7h2.1V646.4z"/>
		<path style="fill:#1A171B;" d="M523.8,662v-1.9c0.3,0.1,0.9,0.2,1.4,0.2c1,0,1.7-0.6,2-2l0.4-2.1l-3.4-17.4h2.2l2.3,13.6l2.2-13.6
			h2.2l-3.8,19.6c-0.5,2.6-1.5,3.8-4,3.8C524.8,662.2,524.1,662.1,523.8,662z"/>
		<path style="fill:#1A171B;" d="M542.2,631.4v1.8c-0.3-0.2-0.8-0.2-1.3-0.2c-1.3,0-1.7,0.6-1.7,2.1v3.8h2.5v1.8h-2.5v15.6h-2.1
			v-15.6h-1.6v-1.8h1.6v-3.8c0-2.5,0.8-3.9,3.7-3.9C541.3,631.2,541.8,631.3,542.2,631.4z"/>
		<path style="fill:#1A171B;" d="M544.6,650.4c0-2.7,1.3-4.1,5.7-5.4v-2.5c0-1.3-0.5-2.2-1.7-2.2c-1.4,0-1.7,0.9-1.7,2.2v0.8h-2.1
			v-0.8c0-2.3,0.8-4,3.8-4c3,0,3.8,1.6,3.8,4v13.8h-1.2l-0.6-1c-0.5,0.9-1.2,1.4-2.5,1.4c-2.5,0-3.5-1.3-3.5-4V650.4z M550.3,646.6
			c-3,0.9-3.6,2-3.6,3.8v2.3c0,1.4,0.5,2.2,1.8,2.2c1.3,0,1.8-0.9,1.8-2.2V646.6z"/>
		<path style="fill:#1A171B;" d="M563.4,656.3l-0.6-1.1c-0.5,0.9-1.3,1.4-2.6,1.4c-2.5,0-3.4-1.3-3.4-4v-10.1c0-2.7,0.9-4,3.3-4
			c1,0,1.9,0.5,2.4,1.3v-8.2h2.1v24.7H563.4z M562.6,642.6c0-1.4-0.5-2.3-1.8-2.3c-1.3,0-1.7,0.9-1.7,2.2v10c0,1.4,0.5,2.2,1.7,2.2
			c1.3,0,1.8-0.9,1.8-2.2V642.6z"/>
		<path style="fill:#1A171B;" d="M569,650.4c0-2.7,1.3-4.1,5.7-5.4v-2.5c0-1.3-0.5-2.2-1.7-2.2c-1.4,0-1.7,0.9-1.7,2.2v0.8h-2.1
			v-0.8c0-2.3,0.8-4,3.8-4c3,0,3.8,1.6,3.8,4v13.8h-1.2l-0.6-1c-0.5,0.9-1.2,1.4-2.5,1.4c-2.5,0-3.5-1.3-3.5-4V650.4z M574.7,646.6
			c-3,0.9-3.6,2-3.6,3.8v2.3c0,1.4,0.5,2.2,1.8,2.2c1.3,0,1.8-0.9,1.8-2.2V646.6z"/>
	</g>
</g>
<text transform="matrix(1 0 0 1 179.0264 49.4429)" style="fill:#262626; font-family:'FuturaLT-Bold'; font-size:22.75px;">Reports filed in 2017</text>
<text transform="matrix(1 0 0 1 79.8413 131.9932)" style="fill:#262626; font-family:'FuturaLT-Bold'; font-size:22.75px;">Number of cases received</text>
<g>
	<g>
		<path style="fill:#DFDFDF;" d="M179.4,291.1l3.9,55.1c-30.4,2.1-56.8-20.8-59-51.3c-2.1-30.4,20.8-56.8,51.3-59
			c1.3-0.1,2.5-0.1,3.9-0.1V291.1z"/>
	</g>
	<g>
		<g>
			<path style="fill:#EA341C;" d="M179.4,291.1v-55.2c30.5,0,55.2,24.7,55.2,55.2c0,29.2-22.3,53.1-51.4,55.1L179.4,291.1z"/>
		</g>
	</g>
	<circle style="fill:#FFFFFF;" cx="178.9" cy="290.9" r="45.2"/>
	<g>
		<text transform="matrix(1 0 0 1 149.9707 296.6875)" style="fill:#404040; font-family:'FuturaLT-Bold'; font-size:18.2px;">48.9%</text>
	</g>
</g>
<g>
	<g>
		<path style="fill:#DFDFDF;" d="M504.1,291.1l33.2-44.1c24.4,18.4,29.2,53,10.9,77.4s-53,29.2-77.4,10.9
			c-24.4-18.4-29.2-53-10.9-77.4c10.8-14.3,26.2-22,44.1-22V291.1z"/>
	</g>
	<g>
		<g>
			<path style="fill:#EA341C;" d="M504.1,291.1v-55.2c12.6,0,23.2,3.6,33.2,11.1L504.1,291.1z"/>
		</g>
	</g>
	<circle style="fill:#FFFFFF;" cx="504" cy="290.9" r="45.2"/>
	<g>
		<text transform="matrix(1 0 0 1 473.1226 296.6875)" style="fill:#404040; font-family:'FuturaLT-Bold'; font-size:18.2px;">10.3%</text>
	</g>
</g>
<g>
	<g>
		<path style="fill:#DFDFDF;" d="M179.5,527.4l-18,52.2c-28.8-9.9-44.2-41.4-34.3-70.2c7.7-22.5,28.4-37.3,52.2-37.3V527.4z"/>
	</g>
	<g>
		<g>
			<path style="fill:#EA341C;" d="M179.5,527.4v-55.2c30.5,0,55.2,24.7,55.2,55.2c0,30.5-24.7,55.2-55.2,55.2c-6.7,0-11.6-0.8-18-3
				L179.5,527.4z"/>
		</g>
	</g>
	<circle style="fill:#FFFFFF;" cx="179.4" cy="527.2" r="45.2"/>
	<g>
		<text transform="matrix(1 0 0 1 148.1431 532.9873)" style="fill:#404040; font-family:'FuturaLT-Bold'; font-size:18.2px;">55.5%</text>
	</g>
</g>
<g>
	<g>
		<path style="fill:#DFDFDF;" d="M497,528.7l5.8-54.9c30.3,3.2,52.4,30.4,49.2,60.7c-3.2,30.3-30.4,52.4-60.7,49.2
			c-30.3-3.2-52.4-30.4-49.2-60.7c3-28.2,26.6-49.5,54.9-49.5V528.7z"/>
	</g>
	<g>
		<g>
			<path style="fill:#EA341C;" d="M497,528.7v-55.2c2.2,0,3.6,0.1,5.8,0.3L497,528.7z"/>
		</g>
	</g>
	<circle style="fill:#FFFFFF;" cx="497.7" cy="528.5" r="45.2"/>
	<g>
		<text transform="matrix(1 0 0 1 473.6909 534.2871)" style="fill:#404040; font-family:'FuturaLT-Bold'; font-size:18.2px;">1.8%</text>
	</g>
</g>
<path style="fill:#404040;" d="M77.7,223.8c0.2,1.1,0.5,2.3,0.4,3.4c-0.2,3.2-0.6,6.5-1,9.7c-0.2,1.5-0.6,3-0.8,4.5
	c-0.3,1.8-0.6,3.6-1,5.3c-0.4,1.3,0.1,2.4,0.4,3.6c0.3,1.2,0.1,2.3-0.2,3.4c-0.4,1.3-1,2.6-1.5,3.9c-0.2,0.5-0.5,0.9-0.8,1.3
	c-0.1,0.1-0.2,0.3-0.3,0.5c0.5,0.1,1,0.2,1.4,0.3c0.4,0.1,0.7-0.1,0.7-0.4c0.1-0.5,0.4-0.4,0.7-0.4c0.8,0.2,1.6,0.5,2.4,0.7
	c0.4,0.1,0.8,0.1,1.1,0c0.9-0.1,2.1,0.6,2.2,1.5c0.3,1.5,0.5,3,0.4,4.6c-0.1,1.5,0.2,3.1,0.3,4.7c0.1,0.7,0.2,1.4,0.3,2.2
	c0.1,0.8-0.3,1.3-1,1.8c-0.2,0.1-0.3,0.4-0.3,0.6c0,0.7-0.5,1.2-0.9,1.7c-0.4,0.4-0.8,0.7-1.2,1c-0.3,0.2-0.5,0.5-0.5,1
	c0.1,0.4-0.1,0.8-0.1,1.1c0,0.3,0.2,0.6,0.4,0.8c0.8,0.6,1.8,0.6,2.8,0.7c0.8,0,1.6-0.1,2.5-0.2c0.5,0,0.7-0.4,0.8-0.8
	c0.1-0.4,0.1-0.7,0.3-1.1c0.2-0.3,0.4-0.6,0.7-0.8c1-0.5,1.2-0.7,1.2-1.8c0-0.7-0.1-1.5,0.1-2.2c0.3-1-0.1-1.8-0.2-2.7
	c-0.2-1.1-0.2-2.1-0.2-3.2c0-2.1,0.1-4.3,0.1-6.4c0-0.5,0.1-1,0.2-1.4c0.1-0.6,1-1.5,1.4-1.5c0.1,0,0.4,0.1,0.4,0.2
	c0.2,0.5,0.5,1,0.5,1.6c0.1,0.9,0,1.7,0,2.6c0,0.8,0.2,1.6,0.1,2.4c0,1.2-0.1,2.4-0.2,3.6c-0.1,1.1-0.3,2.3-0.2,3.3
	c0.1,1-0.2,2,0.5,2.9c0.1,0.1,0.1,0.4,0.1,0.6c0,0.5,0.1,1,0.6,1.3c0.7,0.4,0.6,1.2,0.8,1.8c0.1,0.8,0.7,1.1,1.4,1.2
	c1.1,0.1,2.3,0.1,3.4,0c0.5,0,1.1-0.3,1.5-0.6c0.6-0.4,0.3-2.6-0.2-3c-0.9-0.7-1.9-1.5-1.9-2.8c0-0.1-0.1-0.3-0.2-0.4
	c-1-0.7-1.3-1.7-1.3-2.8c0-1.2,0.2-2.4,0.3-3.6c0.2-1.6,0.5-3.1,0.7-4.7c0.1-1,0.4-1.3,1.4-1.3c0.3,0,0.5,0,0.8,0
	c0.4,0,0.7,0,0.8-0.6c0-0.2,0.4-0.5,0.6-0.5c0.5-0.1,1-0.1,1.5-0.3c0.6-0.2,1.3-0.1,1.9-0.2c0.3-0.1,0.5-0.2,0.5-0.6
	c-0.1-0.9-0.2-1.8-0.4-2.6c-0.1-0.5-0.1-1-0.2-1.5c-0.2-0.5-0.4-1-0.6-1.6c-0.2-0.6-0.6-1.2-0.7-1.8c-0.2-1.3-0.4-2.5-0.5-3.8
	c-0.1-3.3-0.2-6.7-0.3-10c-0.1-1.5-0.3-2.9-0.4-4.4c0-0.4-0.1-0.9-0.1-1.4c0.1,0,0.1,0,0.2-0.1c0.1,0.1,0.3,0.2,0.3,0.2
	c0.1,0.6,0.3,1.1,0.2,1.7c-0.1,1.1,0,2.2,0.3,3.2c0.1,0.4,0,0.9,0,1.4c0,0.2-0.1,0.4-0.1,0.6c0.1,0.4,0.1,0.8,0.5,0.9
	c0.5,0.1,0.7-0.2,0.7-0.7c0-0.1,0-0.2,0.1-0.3c0.3,0.4,0.1,1.2-0.3,1.5c-0.3,0.2-0.6,0.4-0.5,0.9c0,0.1-0.1,0.2-0.2,0.3
	c-0.1,0.3-0.2,0.6-0.3,1c0.7-0.1,1-0.1,1,0.5c0,0.3,0.3,0.4,0.6,0.2c0.9-0.7,1.6-1.7,1.7-2.8c0.2-1.2,0.1-2.5,0.1-3.7
	c0-0.2,0-0.4-0.1-0.6c-0.5-0.9-0.5-1.8-0.5-2.8c0-2,0.1-4,0-5.9c0-0.5-0.2-1-0.4-1.4c-0.2-0.4,0-0.8,0.1-1.1c0.2-0.5,0.2-1,0.2-1.6
	c0-0.1-0.2-0.3-0.4-0.4c-0.1-0.1-0.3-0.2-0.5-0.3c0.6-0.6,0.6-1.1,0.4-1.8c-0.3-0.8-0.4-1.7-0.6-2.6c-0.7-2.8-0.7-5.7-0.8-8.6
	c0-1.6-0.3-3.2-1.1-4.6c-0.5-0.9-1.2-1.7-2.3-2.1c-0.3-0.1-0.5-0.5-0.7-0.7c-0.4-0.6-0.9-1.3-1.3-1.9c-0.1-0.2-0.2-0.5-0.4-0.7
	c0.1,0,0.1-0.1,0.2-0.1c0.6,0.7,1.2,1.4,1.8,2.1c0.1,0,0.2-0.1,0.2-0.1c-1.1-1.4-2.4-2.7-2.2-4.8c0.2,0.1,0.3,0.2,0.4,0.2
	c0-0.1,0.1-0.1,0.1-0.2c-0.5-2.1,0.1-4.3-0.2-6.4c-0.3-2.1-0.6-4.3-1.4-6.3c-0.6-1.4-1.6-2.4-3-3.1c-0.4-0.2-0.9-0.4-1.3-0.6
	c-1-0.4-2-0.5-3-0.3c-1.3,0.3-2.6,0.4-3.7,1.4c-0.5,0.5-1,1.1-1.4,1.7c-1.1,1.8-1.3,3.8-1.7,5.8c-0.5,2.8-0.4,5.6-0.2,8.3
	c0,0.8-0.1,1.4-0.5,2.1c-0.2,0.3-0.3,0.6-0.4,0.8c-0.2,0.5-0.5,0.8-1.1,1c-0.7,0.2-1.3,0.6-1.7,1.2c-0.4,0.6-1,0.9-1.4,1.5
	c-0.6,0.9-1,1.8-1.5,2.8c-0.5,0.9-1.1,1.9-1.5,2.8c-0.6,1.2-1.2,2.3-1.6,3.6c-0.4,1.2-0.1,2.3,0.5,3.4c1.2,2.2,3.2,3.8,5.1,5.4
	c0.5,0.4,0.9,0.8,1.4,1.2C77.6,223.7,77.7,223.7,77.7,223.8z M75.6,215.1c-0.1-0.2-0.1-0.6,0.1-0.8c0.3-0.5,0.6-1.1,1-1.5
	c0.5-0.7,0.9-1.4,1.7-1.9c0.2,1.4,0.4,2.8,0.6,4.1c0,0.2-0.1,0.4-0.1,0.7c0,0.5-0.1,0.9,0,1.4c0.1,0.7,0.3,1.4,0.5,2.2
	c0,0.2-0.1,0.3-0.1,0.5c-0.2-0.1-0.4-0.1-0.5-0.2C77.3,218.2,76.4,216.7,75.6,215.1z"/>
<path style="fill:#404040;" d="M67.2,464.8c-0.1-1.6-0.2-3.2-0.5-4.8c-0.3-1.8-0.6-3.7-0.9-5.5c-0.2-1.2-0.4-2.3-0.6-3.5
	c-0.2-1.6-0.2-3.1-0.4-4.7c-0.1-1.4-0.7-2.6-1.9-3.4c-0.8-0.5-1.6-1-2.4-1.4c-0.7-0.4-1.4-0.6-2.1-0.9c-1-0.4-1.6-2-1-2.9
	c0.1,0.2,0.3,0.3,0.4,0.4c0.2-0.4,0.4-0.7,0.5-1c0.2-0.4,0.4-0.8,0.5-1.2c0.1-0.5,0.1-1,0.6-1.3c0.1,0,0.1-0.1,0.1-0.2
	c0.2-0.7,0.4-1.3,0.5-2c0.1-0.7,0-1.4,0-2.2c0.2,0.1,0.4,0.1,0.7,0.2c-0.3-1.3-0.5-2.4-0.8-3.6c0.1,0,0.2,0,0.3,0.1
	c-0.9-2.6-2.5-3.9-5.3-3.7c0-0.1,0-0.1,0-0.2c0.5-0.1,0.9-0.2,1.4-0.3c-0.2-0.2-0.5-0.3-0.7-0.3c-0.9-0.2-1.7,0.2-2.6,0.5
	c-0.3,0.1-0.6,0.4-0.8,0.3c-0.5-0.1-0.7,0.2-1,0.4c-0.2,0.3-0.5,0.6-0.7,0.9c0-0.3-0.1-0.5-0.1-0.8c-0.1,0.1-0.1,0.2-0.2,0.2
	c-0.2,0.8-0.6,1.6-1.2,2.3c-0.4,0.5-0.4,1.1-0.3,1.7c0.1,0,0.2,0,0.3-0.1c-0.3,1.1-0.5,2.2-0.3,3.3c0,0.1,0,0.2,0,0.3
	c0,0.3,0,0.6,0,1c0.1,0.5,0.2,1,0.3,1.6c0.1,0.6,0.3,0.8,1,0.9c0.2,0,0.4,0.2,0.4,0.4c0.3,0.7,0.3,1.4,0,2.1
	c-0.1,0.2-0.1,0.4-0.1,0.6c0.2-0.1,0.4-0.1,0.5-0.2c0.2,0.6-0.1,1.3-0.7,1.5c-1.4,0.6-2.8,1.1-4.2,1.7c-0.7,0.3-1.3,0.6-1.8,1.1
	c-0.9,0.7-1.2,1.8-1.5,2.9c-0.3,1-0.5,2.1-0.7,3.2c-0.3,1.4-0.5,2.9-0.7,4.3c0,0,0,0.1,0,0.1c-0.4,1-1.2,4.8-0.2,6.2
	c-0.1,0.4-0.1,0.8,0.1,1.3c0.4,1.7,1.1,3.4,1.9,4.9c0.9,1.7,1.6,3.3,1.8,5.2c0.1,0.9,0.3,1.7,0.9,2.3c0.8,0.8,0.9,1.7,0.8,2.8
	c-0.1,0.8,0,1.7,0.2,2.6c0.3,1.4,0.6,2.8,0.9,4.1c0.1,0.6,0.2,1.1-0.1,1.7c-0.3,0.6-0.4,1.3-0.2,2c0.4,1.1,0.8,2.1,1.2,3.1
	c0.2,0.5,0.5,1,0.7,1.5c0.6,1.6,0.9,3.3,1.1,4.9c0.2,1.5,0.3,2.9-0.3,4.4c-0.4,0.9-0.8,1.8-1.3,2.7c-0.3,0.5-0.7,0.9-0.9,1.5
	c-0.5,1.6,0.8,3.4,2.5,3.4c1,0,2.3-0.8,2.7-1.8c0.3-0.7,0.6-1.3,1.3-1.7c1.1-0.5,1.5-1.5,1.2-2.7c-0.1-0.8-0.2-1.5-0.2-2.3
	c0-0.5,0-1,0.1-1.4c0.2-1,0.4-2,0.6-3c0.2-1.1,0.1-2.1-0.5-3c-0.5-0.8-0.6-1.5-0.4-2.5c0.1-0.5,0.1-1.1,0.1-1.6
	c0-0.5-0.1-0.9-0.2-1.4c0-0.6,0-1.1,0-1.7c0-0.1,0-0.2,0.1-0.3c0.2,0.2,0.2,0.3,0.2,0.5c0.1,0.6,0.2,1.2,0.3,1.8
	c0.1,0.4,0.2,0.7,0.1,1.1c-0.2,1.2,0,2.3,0.4,3.4c0.3,1,0.8,1.9,0.8,3c0,1.2-0.1,2.4-0.2,3.5c0,0.4-0.1,0.9,0,1.3
	c0.3,1.1,0.4,2.2,0.4,3.4c0,1.1,0.3,2.1,1,3c0.4,0.5,0.7,1.1,0.9,1.6c0.3,0.6,0.5,1.3,0.9,1.9c0.5,0.8,1.4,1.5,2.5,0.9
	c0.2-0.1,0.5-0.2,0.7-0.4c0.6-0.6,1.2-1.3,0.8-2.3c-0.3-0.6-0.6-1.3-0.9-1.9c-0.4-0.7-0.7-1.4-0.7-2.1c0-1,0.1-1.9,0.2-2.9
	c0.1-1.1,0.4-2.2,0.1-3.3c-0.1-0.4,0.1-0.9,0.1-1.4c0-0.4,0.1-0.7,0.1-1.1c0-1.1-0.1-2.1-0.1-3.2c0-1-0.2-1.9-0.7-2.8
	c-0.3-0.5-0.4-1.1-0.3-1.7c0.3-1.1,0.2-2.3,0.1-3.4c0-0.1,0-0.3,0-0.3c0.1-0.6,0-1.3-0.1-1.9c0.1-0.2,0.1-0.5,0.1-0.7
	c0.1-0.8,0-1.5,0.1-2.3c0-0.2,0.1-0.4,0.2-0.5c0.2,0.2,0.4,0.4,0.5,0.4c0.2-0.1,0.4-0.3,0.5-0.5c0.3-0.4,0.5-0.9,0.7-1.3
	c0.2-0.3,0.4-0.6,0.5-0.9c0.5-1.3,0.9-2.6,1.5-3.9C66.9,469,67.3,467,67.2,464.8z M46.2,458.5c0,0-0.1,0-0.1,0
	c0-0.1-0.1-0.3-0.1-0.4c-0.2-0.9-0.4-1.7-0.6-2.6c0-0.1-0.1-0.3-0.1-0.4c0.2-0.5,0.4-0.9,0.2-1.5c0-0.1,0.1-0.2,0.2-0.2
	c0.1,0,0.2,0.1,0.3,0.2c0.3,0.5,0.4,1.1,0.1,1.7c-0.2,0.3-0.1,0.6,0,1c0.2,0.6,0.2,1.2,0.3,1.8C46.4,458.2,46.3,458.3,46.2,458.5z
	 M61.7,456.1c0.1,0.9,0.2,1.7,0.3,2.6c0,0.1-0.1,0.3-0.1,0.4c-0.1-0.1-0.2-0.2-0.3-0.2c-0.1-0.2-0.2-0.4-0.3-0.6
	c-0.2-0.3-0.2-0.6,0-0.9c0.4-0.6,0.1-1.1-0.2-1.7c-0.1-0.2-0.2-0.3-0.3-0.5C61.3,455.3,61.7,455.7,61.7,456.1z M62.2,475.6
	c-0.1,0-0.2-0.1-0.2-0.1c0.1-0.2,0.1-0.4,0.2-0.6c0.1,0,0.2,0.1,0.3,0.1C62.3,475.2,62.2,475.4,62.2,475.6z M62.5,470.3
	c0-0.5,0.1-0.8,0.1-1.2c0.1-0.8,0.2-1.5,0.2-2.3c0-0.3-0.2-0.6-0.3-0.9c-0.2-0.4-0.1-0.8,0.4-1.1C63.6,466.5,63.5,469.6,62.5,470.3z
	"/>
<path style="fill:#404040;" d="M107.7,439.6c-0.2-0.1-0.2-0.4-0.2-0.7c-0.1-0.7-0.2-1.3-0.2-2c-0.1-1.9-0.4-3.9-0.6-5.8
	c0-0.1,0-0.2,0-0.4c0.1-0.7,0.1-1.4,0-2c0,0,0,0,0.1-0.1c-0.3-0.7-0.5-1.3-0.8-2c0.2-0.3,0.5-0.6,0.4-0.9c-0.2-1.4-0.4-2.8-0.9-4.1
	c-0.6-1.7-2.1-2.4-3.6-3.1c-1.6-0.7-2.2-1.8-2.1-3.5c0.1-2,0.1-3.9,0-5.9c-0.1-1.4-0.3-2.8-0.9-4.1c-1-2.6-3.5-2.7-5.8-3
	c-1-0.1-1.9,0.3-2.5,1c-1.5,1.6-2.6,3.6-3.2,5.7c-0.8,2.6,0.3,5.4,0.4,8.1c0,1.5-1,2.9-1.6,4.4c-0.3,0.8-0.4,1.7-0.4,2.5
	c0,1.3,0.1,2.5,0.2,3.8c0.1,1.9,0.2,3.8,0.5,5.7c0.2,1.1,0.2,2.1-0.3,3c-0.3,0.6-0.2,1,0.2,1.5c0.7,0.9,0.6,1.1-0.2,1.8
	c-0.2,0.2-0.4,0.7-0.3,0.9c0.3,0.7,0,1.1-0.5,1.6c-0.3,0.3-0.2,1.1-0.3,1.7c0,0-0.1,0.1-0.1,0.1c-0.5,0.3-0.4,0.7,0,1
	c0.5,0.3,0.5,0.7,0.3,1.1c-0.2,0.4-0.3,0.8-0.4,1.3c-0.8,3.1-0.5,6.3-0.1,9.5c0.5,3.7,1.8,7.3,2.9,10.8c0.6,1.9,1,3.9,1.5,5.8
	c0.2,0.8,0.4,1.6,0.8,2.2c0.5,0.7,0.5,1.2,0.1,1.8c-0.4,0.5-0.5,1.1-0.1,1.6c0.8,1,0.7,2.1,0.7,3.2c0,0.5,0,1,0,1.5
	c-0.2,1.9-0.5,4.1-0.2,6.1c-0.1,0.2-0.1,0.6,0,0.8c0.7,1.3,0.4,2.8,0.5,4.2c0.1,1-0.2,1.9-1,2.5c-1.1,0.9-2.2,1.6-3.4,2.4
	c-0.7,0.4-1.3,0.8-1.2,1.7c0.1,0.8,0.8,1.1,1.4,1.3c1.7,0.4,3.4,0.3,4.9-0.6c1.2-0.7,2.4-1,3.7-1.1c1.6-0.1,2.1-0.7,2-2.3
	c-0.1-1-0.4-2-0.5-3c0-0.3,0-0.9,0.2-1c0.9-0.6,0.5-1.3,0.2-1.9c-0.7-1.3-0.6-1.5,0.7-2.3c0.6,0.5,0.5,1.2,0.6,1.9
	c0,0.8,0,1.6,0.3,2.3c0.3,0.7,0.5,1.3-0.2,1.8c0.2,0.3,0.4,0.5,0.6,0.7c0.6,0.5,0.7,1.2,0.7,1.9c-0.1,2.5,0.1,5-2.1,6.8
	c-0.1,0.1-0.2,0.3-0.2,0.5c-0.8,2.3-0.5,2.9,1.9,3.3c0.4,0.1,0.9,0.1,1.3,0.1c0.9,0,1.8-0.3,2.2-1.1c0.8-1.4,1.6-2.8,2.1-4.3
	c0.3-1-0.1-2.3-0.1-3.4c0-0.9,0.1-2,0.5-2.8c0.6-1,0.6-1.9,0.4-3c-0.1-0.3-0.2-0.5-0.1-0.8c0.2-0.8,0-1.3-1.1-1.3
	c0.6-1.2,0.4-2.2-0.3-3.3c-0.3-0.5-0.3-1.2-0.4-1.9c-0.1-0.4,0-0.7-0.1-1.1c-0.6-2.4-0.4-5-2.1-7c0-1.1-0.1-2.2-0.9-3.1
	c-0.4-0.5-0.2-1.4-0.2-2.1c0-2.1,0-4.3,0.2-6.4c0.3-2.8,0.7-5.5,1.1-8.3c0.3-1.6,0.1-3.3,0.6-4.9c1.2-4.3,3.1-8.5,3.8-13
	c0.1-0.6,0.3-1,0.9-1.3C108,440.5,108.3,440.1,107.7,439.6z M97.5,488c-0.6-0.8-1-1.6-0.8-2.6c0.1,0,0.2-0.1,0.2-0.1
	c0.3,0.9,0.6,1.7,1,2.6C97.7,487.9,97.6,487.9,97.5,488z M101.8,446.1c-0.1-0.2-0.3-0.4-0.3-0.6c-0.1-1.1-0.3-2.3-0.2-3.3
	c0.1-0.8-0.1-1.4-0.5-2c-0.4-0.5-0.6-1-0.2-1.7c0.1-0.2-0.1-0.7-0.3-0.8c-1.1-1-1-1.4,0.2-2.3c0.5-0.4,0.8-1.2,1.2-1.7
	c0.4,0.7,0.5,4.2,0,4.9c0.5,0.8,0.6,1.8,0.8,2.7C103,443,101.6,444.4,101.8,446.1z"/>
<path style="fill:#404040;" d="M435.3,238.6c-0.2-2-0.7-4-0.8-6c-0.2-2.8-0.4-5.5-1.5-8.1c-0.6-1.5-0.9-3.2-1.4-4.7
	c-0.5-1.6-1.2-3.1-1.9-4.6c-0.3-0.6-0.1-1,0.2-1.4c0.6-0.8,0.6-1.4,0-2.2c-0.6-0.8-1.3-1.5-1.8-2.3c-0.3-0.5-0.4-1.1-0.6-1.7
	c-0.2-0.8-0.3-1.6-0.5-2.4c-0.1-0.3-0.5-0.5-0.8-0.6c-0.8-0.1-1.6,0-2.3,0c-0.9,0.1-1.8,0.4-2.2-0.8c0,0-0.1-0.1-0.1-0.1
	c-0.7-0.5-0.5-2.2,0.3-2.7c0.4-0.3,0.8-0.9,0.9-1.4c0.1-0.4-0.1-0.9-0.1-1.4c0.2-3.2-0.2-6.3-2.8-8.6c-0.6-0.6-1.2-1.3-1.8-1.9
	c-0.1-0.1-0.3-0.2-0.5-0.3c-0.7-0.2-1.4-0.3-2-0.5c-4.2-1.6-8.1-0.3-10.5,3.5c-0.5,0.7-1.1,1.1-2,1c-1.7-0.2-3.5-0.3-5.3-0.3
	c-0.9,0-1.1,0.4-0.9,1.2c0.5,2.7,2,4,4.8,4.3c0.6,0.1,1.2,0,1.3,0.9c0,0.6,0.6,1.1,0.1,1.8c-0.5,0.9-0.9,1.8-1.3,2.7
	c-0.1,0.2-0.2,0.7-0.1,0.8c1,0.5,1,1.3,0.9,2.2c0,0.4,0.4,0.8,0.1,1.2c0,0,0.1,0.2,0.2,0.3c0.2,0.4,0.4,0.7,0.4,1.1
	c0.3,1.9,0.8,2.3,2.7,2c0.7-0.1,1.4-0.2,2.2-0.2c0,0.1,0.1,0.2,0.1,0.2c-0.5,0.2-1,0.4-1.5,0.7c-0.5,0.2-1.1,0.4-1.5,0.8
	c-1.2,1-2.3,2.3-4,2.5c-0.2,0-0.4,0.2-0.6,0.3c-0.5,0.2-1,0.6-1.6,0.7c-1.5,0.3-3,0.5-4.5,0.9c-2.1,0.4-4.2,0.9-6.2,1.4
	c-1.2,0.3-2.3,0.5-3.4-0.2c-0.8-0.5-1.7-0.3-2.4,0.4c-0.3,0.3-0.6,0.6-1,0.8c-1.8,0.9-3.7,1.8-5.5,2.7c-1.4,0.7-1.7,1.4-1.4,2.9
	c0,0.1,0,0.2,0,0.4c-1.2,0.2-2.3,0.4-3.5,0.7c-0.5,0.1-0.8,0.1-1.1-0.3c-0.6-0.7-1.5-1-2.4-0.9c-0.8,0.1-1.7,0.2-2.5,0.3
	c-0.9,0.1-1.7,0.3-2.6-0.2c-0.4-0.2-1.1-0.2-1.6-0.2c-2.2,0.3-4,1.5-5.8,2.7c-4.8,3.2-8.6,7.2-10.5,12.8c-0.1,0.2-0.3,0.4-0.5,0.5
	c-0.8,0.5-1.9,0.7-2.4,1.4c-0.7,1.1-2.1,2.1-1.3,3.8c0.1,0.2,0,0.4,0,0.6c-0.5,2.6-1,5.2-1.5,7.8c-0.3,1.4-0.7,2.8-0.1,4.2
	c0.3,0.7,0.8,1.3,0.4,2.2c-0.1,0.1,0,0.4,0.1,0.5c0.6,1,1,2.2,1.8,2.9c2.4,2.2,4.8,4.4,8,5.5c0.5,0.2,1,0.6,1.5,0.7
	c2.3,0.6,4.5,0.4,6.8-0.1c3.4-0.8,6-2.8,8.1-5.8c1.5,0.2,3.3,0.5,5,0.8c0.2,0,0.4,0.3,0.6,0.4c1.4,0.9,2.9,1.8,4.4,2.6
	c1,0.5,1.3,0.3,1.7-0.7c-1-0.6-2.1-1.2-3.1-1.8c0-0.1,0.1-0.2,0.1-0.3c1.2-0.2,2.4-0.4,3.7-0.5c0.6-0.1,1.2-0.1,1.6,0.5
	c0.1,0.2,0.6,0.3,0.9,0.3c2.2,0.1,4.3,0.3,6.5,0.1c1.8-0.1,1.9,0.2,2-1.8c0.1-1.9-0.2-3.7-0.2-5.6c0-0.1,0-0.1,0-0.2
	c-0.2-1.7-0.3-3.3,0.9-4.7c0.5-0.6,0.6-1.2-0.1-1.7c2.2-3.1,4.3-6.1,6.4-9.2c0.2,0.3,0.3,0.5,0.4,0.8c1.7,3.6,3.3,7.2,5.1,10.7
	c1.7,3.4,3.9,6.5,6.7,9.1c5.1,4.9,12.4,4.6,17,1.2c0.2-0.1,0.3-0.3,0.5-0.3c1.6-0.2,2.5-1.2,3.1-2.5c1.1-2.3,2.5-4.3,4.3-6.1
	c0.8-0.9,1.4-1.9,1.6-3.1c0.4-2.8,0.8-5.6,1.1-8.4C435.5,241.4,435.4,240,435.3,238.6z M372.8,228.9c0.2,0.2,0.4,0.4,0.5,0.6
	c0.2,0.6-0.2,0.8-1,0.8C372.5,229.8,372.6,229.3,372.8,228.9z M379.4,246c-0.2,0.5-0.4,0.7-0.9,0.7c-0.7,0-1.4,0.1-2.1,0.3
	c-0.3,0.1-0.5,0.5-0.7,0.8c-0.3,0.1-0.7,0.2-1,0.3c0.2,0.4,0.5,0.9,0.7,1.3c0.2,0.8-0.2,1.4-1,1.7c-0.1,0-0.2,0.2-0.2,0.3
	c-0.1,0.7-0.6,0.7-1.1,0.6c-0.6-0.2-0.9,0-0.8,0.6c0.1,0.5,0,0.9-0.6,0.9c-1.1,0-1.7,0.9-2.6,1.3c-0.5,0.2-0.9,0.5-1.4,0.9
	c0.3-1.3,0.5-2.5,0.7-3.7c1.1-5.6,2.4-11.1,2.8-16.8c0.1-1.5,0.7-2.3,2-2.9c1-0.5,1.9-1.1,2.8-1.7c0.4-0.3,0.8-0.7,1.1-1.1
	c0.4-0.5,0.8-1.1,1.2-1.7c0.4-0.6,0.9-1.1,1.7-0.9c0.2,0,0.5-0.1,0.6,0c0.7,0.4,1.3,0.9,2,1.1c0.8,0.1,1.6-0.1,2.6-0.3
	c-0.4,1-0.8,1.9-1.1,2.8c-0.3,1-0.6,2.1-1,3.1c-0.1,0.2-0.1,0.4-0.2,0.6c-0.7,2.3-1.4,4.5-2.1,6.8
	C380.4,242.9,379.9,244.4,379.4,246z M412.7,235.5c-1-1.9-1.9-3.6-2.9-5.4c0.1-0.1,0.2-0.1,0.2-0.1c2.3-0.5,1.9-0.7,2.7,1.4
	C413.4,233,413.4,233,412.7,235.5z"/>
</svg>
