<?xml version="1.0" encoding="utf-8"?>
<!-- Generator: Adobe Illustrator 22.0.0, SVG Export Plug-In . SVG Version: 6.00 Build 0)  -->
<svg version="1.1" id="Calque_1" xmlns="http://www.w3.org/2000/svg" xmlns:xlink="http://www.w3.org/1999/xlink" x="0px" y="0px"
	 width="1920px" height="550px" viewBox="0 0 1920 550" style="enable-background:new 0 0 1920 550;" xml:space="preserve">
<g>
	<polygon style="fill:#F24141;" points="1083.1,196.2 1077.9,196.2 1087.9,179.3 1077.9,162.4 1083.1,162.4 1093.1,179.4 	"/>
	<polygon style="fill:#F24141;" points="1069.9,196.2 1064.6,196.2 1074.6,179.3 1064.6,162.4 1069.9,162.4 1079.9,179.4 	"/>
	<polygon style="fill:#F24141;" points="1096.4,196.2 1091.2,196.2 1101.2,179.3 1091.2,162.4 1096.4,162.4 1106.4,179.4 	"/>
	<polygon style="fill:#F24141;" points="1109.7,196.2 1104.4,196.2 1114.4,179.3 1104.4,162.4 1109.7,162.4 1119.7,179.4 	"/>
	<polygon style="fill:#F24141;" points="1122.9,196.2 1117.7,196.2 1127.7,179.3 1117.7,162.4 1122.9,162.4 1132.9,179.4 	"/>
	<polygon style="fill:#F24141;" points="1136.2,195.7 1130.9,195.7 1140.9,178.8 1130.9,162 1136.2,162 1146.2,179 	"/>
	<polygon style="fill:#F24141;" points="1149.4,196.6 1144.2,196.6 1154.2,179.7 1144.2,162.8 1149.4,162.8 1159.4,179.8 	"/>
	<polygon style="fill:#F24141;" points="1162.7,196.6 1157.5,196.6 1167.5,179.7 1157.5,162.8 1162.7,162.8 1172.7,179.8 	"/>
	<polygon style="fill:#F24141;" points="1176,196.6 1170.7,196.6 1180.7,179.7 1170.7,162.8 1176,162.8 1186,179.8 	"/>
	<polygon style="fill:#F24141;" points="1189.2,196.6 1184,196.6 1194,179.7 1184,162.8 1189.2,162.8 1199.2,179.8 	"/>
	<polygon style="fill:#F24141;" points="1202.5,196.1 1197.2,196.1 1207.2,179.2 1197.2,162.4 1202.5,162.4 1212.5,179.4 	"/>
</g>
<g>
	<polygon style="fill:#F24141;" points="1485.8,196.2 1480.5,196.2 1490.5,179.3 1480.5,162.4 1485.8,162.4 1495.8,179.4 	"/>
	<polygon style="fill:#F24141;" points="1472.5,196.2 1467.3,196.2 1477.3,179.3 1467.3,162.4 1472.5,162.4 1482.5,179.4 	"/>
	<polygon style="fill:#F24141;" points="1499,196.2 1493.8,196.2 1503.8,179.3 1493.8,162.4 1499,162.4 1509,179.4 	"/>
	<polygon style="fill:#F24141;" points="1512.3,196.2 1507,196.2 1517,179.3 1507,162.4 1512.3,162.4 1522.3,179.4 	"/>
	<polygon style="fill:#F24141;" points="1525.5,196.2 1520.3,196.2 1530.3,179.3 1520.3,162.4 1525.5,162.4 1535.5,179.4 	"/>
	<polygon style="fill:#F24141;" points="1538.8,195.7 1533.6,195.7 1543.6,178.8 1533.6,162 1538.8,162 1548.8,179 	"/>
	<polygon style="fill:#F24141;" points="1552.1,196.6 1546.8,196.6 1556.8,179.7 1546.8,162.8 1552.1,162.8 1562.1,179.8 	"/>
	<polygon style="fill:#F24141;" points="1565.3,196.6 1560.1,196.6 1570.1,179.7 1560.1,162.8 1565.3,162.8 1575.3,179.8 	"/>
	<polygon style="fill:#F24141;" points="1578.6,196.6 1573.3,196.6 1583.3,179.7 1573.3,162.8 1578.6,162.8 1588.6,179.8 	"/>
	<polygon style="fill:#F24141;" points="1591.9,196.6 1586.6,196.6 1596.6,179.7 1586.6,162.8 1591.9,162.8 1601.9,179.8 	"/>
	<polygon style="fill:#F24141;" points="1605.1,196.1 1599.9,196.1 1609.9,179.2 1599.9,162.4 1605.1,162.4 1615.1,179.4 	"/>
</g>
<g>
	<polygon style="fill:#F24141;" points="689,195.8 683.8,195.8 693.8,179 683.8,162.1 689,162.1 699,179.1 	"/>
	<polygon style="fill:#F24141;" points="675.6,195.8 670.4,195.8 680.4,179 670.4,162.1 675.6,162.1 685.6,179.1 	"/>
	<polygon style="fill:#F24141;" points="702.4,195.8 697.2,195.8 707.2,179 697.2,162.1 702.4,162.1 712.4,179.1 	"/>
	<polygon style="fill:#F24141;" points="715.8,195.8 710.6,195.8 720.6,179 710.6,162.1 715.8,162.1 725.8,179.1 	"/>
	<polygon style="fill:#F24141;" points="729.2,195.8 724,195.8 734,179 724,162.1 729.2,162.1 739.2,179.1 	"/>
	<polygon style="fill:#F24141;" points="742.6,195.4 737.4,195.4 747.4,178.5 737.4,161.6 742.6,161.6 752.6,178.6 	"/>
	<polygon style="fill:#F24141;" points="756.1,196.3 750.8,196.3 760.8,179.4 750.8,162.5 756.1,162.5 766.1,179.5 	"/>
	<polygon style="fill:#F24141;" points="769.5,196.3 764.2,196.3 774.2,179.4 764.2,162.5 769.5,162.5 779.5,179.5 	"/>
	<polygon style="fill:#F24141;" points="782.9,196.3 777.6,196.3 787.6,179.4 777.6,162.5 782.9,162.5 792.9,179.5 	"/>
	<polygon style="fill:#F24141;" points="796.3,196.3 791,196.3 801,179.4 791,162.5 796.3,162.5 806.3,179.5 	"/>
	<polygon style="fill:#F24141;" points="809.7,195.8 804.4,195.8 814.4,178.9 804.4,162 809.7,162 819.7,179 	"/>
	<polygon style="fill:#F24141;" points="823.1,196.9 817.8,196.9 827.8,180.1 817.8,163.2 823.1,163.2 833.1,180.2 	"/>
</g>
<g>
	<polygon style="fill:#F24141;" points="334.2,195.8 329,195.8 339,179 329,162.1 334.2,162.1 344.2,179.1 	"/>
	<polygon style="fill:#F24141;" points="320.8,195.8 315.6,195.8 325.6,179 315.6,162.1 320.8,162.1 330.8,179.1 	"/>
	<polygon style="fill:#F24141;" points="347.6,195.8 342.4,195.8 352.4,179 342.4,162.1 347.6,162.1 357.6,179.1 	"/>
	<polygon style="fill:#F24141;" points="361,195.8 355.8,195.8 365.8,179 355.8,162.1 361,162.1 371,179.1 	"/>
	<polygon style="fill:#F24141;" points="374.4,195.8 369.2,195.8 379.2,179 369.2,162.1 374.4,162.1 384.4,179.1 	"/>
	<polygon style="fill:#F24141;" points="387.8,195.4 382.6,195.4 392.6,178.5 382.6,161.6 387.8,161.6 397.8,178.6 	"/>
	<polygon style="fill:#F24141;" points="401.3,196.3 396,196.3 406,179.4 396,162.5 401.3,162.5 411.3,179.5 	"/>
	<polygon style="fill:#F24141;" points="414.7,196.3 409.4,196.3 419.4,179.4 409.4,162.5 414.7,162.5 424.7,179.5 	"/>
	<polygon style="fill:#F24141;" points="428.1,196.3 422.8,196.3 432.8,179.4 422.8,162.5 428.1,162.5 438.1,179.5 	"/>
	<polygon style="fill:#F24141;" points="441.5,196.3 436.2,196.3 446.2,179.4 436.2,162.5 441.5,162.5 451.5,179.5 	"/>
	<polygon style="fill:#F24141;" points="454.9,195.8 449.6,195.8 459.6,178.9 449.6,162 454.9,162 464.9,179 	"/>
	<polygon style="fill:#F24141;" points="468.3,196.9 463,196.9 473,180.1 463,163.2 468.3,163.2 478.3,180.2 	"/>
</g>
<g>
	<path style="fill:#BFBFBF;" d="M225.3,289.2c-37.4,0-74.8-0.1-112.1,0.1c-4.9,0-6.4-1.4-6.2-6.2c0.6-12.8,0.6-25.7,1.1-38.5
		c0.3-7.7,3.3-13.8,10.8-17c10-4.3,20-8.6,30.1-12.8c9-3.7,18.4-6.6,27.2-10.9c6.1-2.9,12-6.9,11.1-15.4c-0.1-1.1,0.1-2.4,0.6-3.4
		c5.8-10.1,4.9-18-3.1-26.5c-0.7-0.7-1.6-1.6-1.6-2.5c-0.3-8.5-8.2-12.5-11.1-19.3c-1.9-4.6-2.6-9.9-2.6-14.9
		c0-8.5,0.3-17.1,1.9-25.3c2.1-10.3,5.1-20.5,8.9-30.2c1.7-4.3,6.1-7.9,10-10.8c2.3-1.7,6.1-1.8,9.3-2.1c7.6-0.8,15.3-0.9,22.8-2
		c12.2-1.7,23-0.2,33.4,7.3c6.1,4.5,12.3,8.5,15.9,15.2c1.6,3,2.2,6.6,2.7,9.9c1.7,11.3,3.5,22.6,4.5,33.9c0.5,5.3,0,11.1-1.6,16.1
		c-2.8,8.6-6.7,16.8-10.4,25.1c-1.1,2.3-3.1,4.2-4.8,6.3c-4.5,5.4-4.7,12-0.6,17.7c1,1.4,2,3.4,1.9,5c-0.8,11.4,7.9,14.5,15.7,17.7
		c14.5,6,29.5,11,43.9,17.3c7,3.1,15.2,5.9,17.6,14.8c1,3.6,1.8,7.4,2,11.2c0.6,11.5,0.6,23,1.2,34.5c0.2,4.4-1.2,5.7-5.6,5.7
		C300.4,289.1,262.8,289.2,225.3,289.2z"/>
	<g>
		
			<text transform="matrix(1 0 0 1 34.885 341.9977)" style="fill:#FF3334; font-family:'Raleway-Black'; font-size:29px; letter-spacing:2;">AHMED BOUCHAMAOUI</text>
	</g>
	<rect x="61.5" y="363.8" style="fill:none;" width="327.5" height="196.2"/>
	<text transform="matrix(1 0 0 1 103.6114 380.6117)"><tspan x="0" y="0" style="fill:#808080; font-family:'Raleway-Medium'; font-size:23px;">HEIR OF THE AL MAJD </tspan><tspan x="-23.6" y="27.6" style="fill:#808080; font-family:'Raleway-Medium'; font-size:23px;">GROUP, FOUNDED BY FEU </tspan><tspan x="-39.7" y="55.2" style="fill:#808080; font-family:'Raleway-Medium'; font-size:23px;">ABDELMEJID BOUCHAMAOUI </tspan><tspan x="60.6" y="82.8" style="fill:#F24141; font-family:'Raleway-Medium'; font-size:23px; letter-spacing:2;">(TUNISIA)</tspan></text>
</g>
<g>
	<g>
		<path style="fill:#BFBFBF;" d="M628.8,166.9c-3.2,15.4-8.8,29.5-23.2,38c-24.7,14.5-56.9,2.2-66.2-25.1c-1-2.8-1.4-5.9-2.6-8.6
			c-1.5-3.5-3.1-7.2-5.5-10.2c-6.6-8.2-8.6-17.8-9.1-27.9c-0.2-5,3.7-6.1,7.8-7.2c-0.7-2.1-1.3-3.9-1.9-5.7c-4.9-14,0-26.3,7.1-37.8
			c8.2-13.3,20-22.9,34.7-28.1c18.5-6.5,40.7-0.9,53.3,15c0.7,0.9,1.4,2.1,2.4,2.4c11.2,4,15.3,13.3,17.2,23.7
			c2.1,11.1-0.3,22.1-2.9,33.1c5.6,6,6,16.1,0.7,25.2c-1.5,2.6-2.4,5.5-4.2,7.9c-1.8,2.3-4.3,3.9-6.5,5.8
			C629.6,167.3,629.2,167.1,628.8,166.9z"/>
		<path style="fill:#BFBFBF;" d="M543.6,206.2c8,26,15.9,51.3,23.7,76.6c0.5,0,1.1,0,1.6,0c3.1-8.8,6.2-17.6,9-26.5
			c0.4-1.2-1.1-2.9-1.7-4.4c-2.3-6-4.7-11.9-6.9-17.9c-0.4-1,0-2.3,0.3-3.4c1.8-6.1,11.4-9.4,20.4-7.1c7.6,1.9,10.6,6.3,8.7,13.5
			c-1.2,4.4-2.7,9.1-5.3,12.8c-2.9,4.2-3.2,7.8-1.2,12.4c2.9,6.7,5,13.6,7.5,20.4c0.5,0,1,0.1,1.5,0.1c7.9-25.4,15.8-50.8,23.6-76
			c9.9,4.8,19.2,9.7,28.7,13.8c7,3,14.2,5.7,21.6,7.6c14.4,3.6,20.4,14.1,22.1,27.1c1.4,10.3,0.4,20.9,0.1,31.3
			c0,1.2-2.2,2.6-3.6,3.4c-0.9,0.5-2.3,0.1-3.5,0.1c-70.8,0-141.6,0-212.3,0c-7.5,0-8.1-0.4-7.8-8c0.4-10.4,0.4-21,2.1-31.3
			c1.9-11.1,8.3-19.3,20.2-22.3c17.2-4.4,33.1-12,48.4-20.9C541.6,207.3,542.3,206.9,543.6,206.2z"/>
	</g>
	<g>
		
			<text transform="matrix(1 0 0 1 459.6525 341.9976)" style="fill:#FF3334; font-family:'Raleway-Black'; font-size:29px; letter-spacing:2;">INTERMEDIARY</text>
	</g>
	<rect x="449.3" y="363.8" style="fill:none;" width="269.5" height="120.2"/>
	<text transform="matrix(1 0 0 1 450.1338 380.6117)"><tspan x="0" y="0" style="fill:#808080; font-family:'Raleway-Medium'; font-size:23px;">INDOSUEZ S.A. FIDUCIA</tspan><tspan x="258.1" y="0" style="fill:#808080; font-family:'Raleway-Medium'; font-size:23px;">-</tspan><tspan x="27" y="27.6" style="fill:#808080; font-family:'Raleway-Medium'; font-size:23px;">RY (SUBSIDIARY OF </tspan><tspan x="30.5" y="55.2" style="fill:#808080; font-family:'Raleway-Medium'; font-size:23px;">CRÉDIT AGRICOLE)  </tspan><tspan x="31.1" y="82.8" style="fill:#F24141; font-family:'Raleway-Medium'; font-size:23px; letter-spacing:2;">(SWITZERLAND) </tspan></text>
</g>
<g>
	<g>
		<g>
			<path style="fill:#BFBFBF;" d="M997.6,44.3c5.1,0,9.4,0.2,13.7-0.1c4.2-0.3,5.8,1.4,5.4,5.5c-0.2,2.3,0,4.6,0,7.6
				c5.3,0,10.1,0.1,14.9,0c3-0.1,4.4,1,4.2,4.1c-0.1,1,0,2,0,3c0,75.8,0,151.6,0,227.3c0,7,0,7.1-7.2,7.1c-56.8,0-113.5,0-170.3,0
				c-6.9,0-6.9,0-6.9-6.8c0-75.9,0-151.9,0-227.8c0-6.8,0-6.8,7-6.8c0.7,0,1.3,0,2,0c3.3-0.2,7.5,0.8,9.6-0.9
				c1.7-1.3,0.7-5.9,1.5-8.8c0.3-1.3,2.1-3,3.3-3.1c3.8-0.4,7.7-0.3,11.5-0.1c2.9,0.1,4.1-0.8,4.2-3.9c0.4-11.1,0.5-11.1,11.5-11.1
				c29.7,0,59.4,0.1,89.1-0.1c4.9,0,7.2,1.1,6.5,6.4C997.3,38.2,997.6,40.9,997.6,44.3z M964.3,239.8c-13.5,0-26.4-0.1-39.3,0.2
				c-0.9,0-2.4,2.5-2.4,3.8c-0.2,15,0,30-0.2,45c0,3.4,1.4,4.2,4.5,4.1c8.5-0.1,17,0,25.5,0c3.9,0,7.8,0,12,0
				C964.3,274.8,964.3,257.7,964.3,239.8z M1004.2,94.5c-0.5-0.5-1-1.1-1.5-1.6c-3.8,0.7-8.6,0.3-11.1,2.6c-1.6,1.5-1.1,7.8,0.7,9.9
				c1.5,1.8,8.3,2,9.4,0.5C1003.8,103,1003.5,98.3,1004.2,94.5z M931.3,157.6c-6.8,0-6.8,0-6.8,6.4c0,6.6,0,6.3,6.6,6.7
				c4.9,0.3,6.9-1.1,6.5-6.3C937.1,157.6,937.5,157.6,931.3,157.6z M965.5,93.4c0,2.8,0.2,4.8,0,6.7c-0.8,5.2,1.6,6.6,6.5,6.3
				c6.5-0.4,6.2-0.2,6.7-6.8c0.3-5.1-1.4-7-6.4-6.3C970.3,93.7,968.3,93.4,965.5,93.4z M937.5,98.7c1.4-5.1-2-5.4-6.5-5.3
				c-6.5,0.2-6.5,0.1-6.5,6.6c0,6.4,0.1,6.5,6.8,6.4C937.5,106.4,937.5,106.4,937.5,98.7z M896.9,94.3c-0.5-0.5-1-1-1.5-1.5
				c-3.8,0.8-8.5,0.5-11.2,2.7c-1.6,1.3-1.3,7.9,0.5,9.5c2.2,1.8,8.6,2.3,9.9,0.7C896.8,103,896.3,98.2,896.9,94.3z M869.2,92.9
				c-0.5,0.5-1,1.1-1.5,1.6c0.8,3.8,0.5,8.5,2.7,11.2c1.2,1.5,7.9,1.2,9.4-0.6c1.8-2.2,2.3-8.5,0.6-9.9
				C877.9,93.1,873,93.6,869.2,92.9z M896.2,164.4c0.9-4.6,0.2-7.4-5.5-7c-7.1,0.5-7.1,0.1-7.2,6.2c0,6.7,0.2,6.6,6.5,7
				C894.8,170.9,897.7,169.9,896.2,164.4z M1006.7,93.5c0,3.7-0.5,6.9,0.1,9.9c1.1,5.8,5.9,2.3,9,2.8c1,0.2,3-2,3.5-3.5
				c0.6-1.8,0.6-4.1,0-5.9c-0.4-1.3-2-3-3.3-3.2C1013.2,93.1,1010.2,93.5,1006.7,93.5z M868.4,164.8c-1,4.2,0.8,6.2,6.1,5.9
				c6.5-0.4,6.8-0.3,6.8-6.7c0-6.2-0.2-6.4-6.4-6.4C868.4,157.5,868.4,157.5,868.4,164.8z M867.6,120.3c0.5,0.6,1,1.1,1.5,1.7
				c3.9-0.7,8.5-0.3,11.3-2.4c1.5-1.1,1.3-7.6-0.5-9.4c-1.7-1.8-8.1-2.3-9.4-0.8C868.4,112,868.5,116.6,867.6,120.3z M895.3,122.1
				c0.6-0.5,1.1-1.1,1.7-1.6c-0.7-3.8-0.5-8.4-2.6-11.1c-1.3-1.6-7.6-1.2-9.5,0.6c-1.8,1.7-2.2,8.2-0.8,9.4
				C886.9,121.6,891.5,121.4,895.3,122.1z M930.7,121.3c4.5,0.9,7.3,0.2,6.9-5.5c-0.5-6.9-0.2-7.1-6.3-7.1c-6.4,0-6.6,0.4-6.9,6.5
				C924.1,120.1,925.4,122.6,930.7,121.3z M964.8,120.3c0.5,0.5,1,1,1.5,1.5c3.9-0.5,8.7,0.1,11.5-1.9c1.6-1.1,1.2-7.7-0.6-9.9
				c-1.5-1.8-8-2.2-9.4-0.7C965.6,111.9,965.7,116.5,964.8,120.3z M1004.4,122.2c-0.9-5.4-0.5-10-2.6-12.7c-1.2-1.6-7.9-1.3-9.4,0.4
				c-1.8,2.1-2.3,8.5-0.7,9.8C994.2,121.8,999,121.3,1004.4,122.2z M1005.8,122.2c5.4-0.9,10.1-0.4,12.9-2.5
				c1.5-1.1,1.4-7.9-0.4-9.4c-2.1-1.9-8.5-2.4-9.9-0.7C1006.3,112.1,1006.8,116.8,1005.8,122.2z M1006,202.6c0.5,0.5,1,1.1,1.5,1.6
				c3.9-0.7,8.7-0.2,11.3-2.4c1.6-1.4,1.2-7.7-0.7-9.9c-1.5-1.8-8.2-2.1-9.4-0.5C1006.5,194.1,1006.7,198.7,1006,202.6z
				 M868.4,239.7c0,3.7-0.5,6.9,0.1,9.9c1.1,5.7,5.9,2.3,9,2.8c1,0.2,3.1-2,3.5-3.5c0.6-2,0.4-4.3,0-6.4c-0.2-1.1-1.7-2.6-2.7-2.7
				C875.2,239.5,872.1,239.7,868.4,239.7z M896.4,239.7c-3.7,0-6.5-0.2-9.3,0.1c-1.2,0.1-2.9,1.1-3.3,2.1
				c-2.6,7.3,0.2,10.8,7.8,10.8c3.7,0,5.2-1.3,4.8-5C896.2,245.3,896.4,242.9,896.4,239.7z M1002.7,204.2c0.5-0.5,1-1.1,1.5-1.6
				c-0.7-3.9-0.3-8.5-2.4-11.3c-1.2-1.5-7.9-1.3-9.4,0.4c-1.8,2.1-2.4,8.4-0.7,9.8C994,203.9,998.8,203.5,1002.7,204.2z
				 M1003.6,239.9c-2.2-0.1-3.5-0.2-4.8-0.2c-8.1-0.1-8.6,0.5-8,8.7c0.2,2.8,1.2,4.3,4.2,4.2c1.8-0.1,3.7,0.3,5.4-0.2
				c1.2-0.4,2.9-1.7,3-2.8C1003.8,246.6,1003.6,243.5,1003.6,239.9z M1007.8,239c-0.5,0.5-1,1-1.6,1.5c0.5,3.9,0,8.7,2,11.4
				c1.2,1.6,7.7,1.2,9.9-0.6c1.8-1.5,2.2-8.1,0.7-9.4C1016.3,239.7,1011.6,239.8,1007.8,239z M964.7,204.5
				c5.7-0.9,10.5-0.4,13.1-2.6c1.6-1.3,1.3-8-0.6-9.9c-1.9-1.9-8.5-2.2-9.9-0.5C965.2,194,965.7,198.8,964.7,204.5z M937.5,197.5
				c0-6.8,0-6.8-6.4-6.8c-6.5,0-6.3,0.1-6.7,6.6c-0.3,5,1.2,6.7,6.3,6.4C937.4,203.3,937.5,203.6,937.5,197.5z M867.6,268.5
				c5.4-0.9,10-0.5,12.8-2.6c1.5-1.1,1.3-7.9-0.4-9.4c-2.1-1.9-8.5-2.3-9.8-0.8C868.1,258.4,868.5,263.1,867.6,268.5z M895.4,268.4
				c0.5-0.5,1.1-1.1,1.6-1.6c-0.8-3.8-0.6-8.5-2.8-11.1c-1.3-1.5-7.7-1.1-9.5,0.7c-1.8,1.8-2.2,8.3-0.6,9.5
				C886.9,267.9,891.6,267.6,895.4,268.4z M1002.6,268.4c0.5-0.5,1.1-1.1,1.6-1.6c-0.8-3.8-0.5-8.4-2.6-11.1
				c-1.2-1.5-7.6-1.1-9.4,0.6c-1.8,1.8-2.2,8.2-0.7,9.4C994.2,267.8,998.8,267.6,1002.6,268.4z M1005.9,268.5
				c5.4-0.9,10-0.5,12.9-2.5c1.5-1.1,1.4-7.9-0.4-9.5c-2.1-1.9-8.5-2.4-9.9-0.8C1006.3,258.3,1006.8,263.1,1005.9,268.5z
				 M895.5,204.2c0.5-0.5,1-1.1,1.5-1.6c-0.7-3.9-0.4-8.5-2.6-11.3c-1.2-1.6-7.9-1.3-9.5,0.5c-1.9,2.1-2.3,8.5-0.7,9.9
				C886.8,203.9,891.6,203.5,895.5,204.2z M867.8,202.7c0.5,0.5,1,1.1,1.5,1.6c3.8-0.7,8.5-0.5,11.2-2.6c1.6-1.3,1.3-7.9-0.5-9.4
				c-2.1-1.9-8.5-2.4-9.8-0.8C868.1,194.1,868.5,198.8,867.8,202.7z M971.3,157.6c-4-0.9-6.2,0.5-5.8,6c0.5,7,0.1,7,6.2,7
				c6.9,0,6.9,0,6.9-6.3C978.6,157.6,978.6,157.6,971.3,157.6z M997.7,157.6c-6.8,0-6.9,0.1-7,6.3c0,6.3,0.3,6.5,6.2,6.7
				c4.4,0.2,7.2-0.3,6.8-6C1003.2,157.6,1003.6,157.6,997.7,157.6z M1006.6,162.8c0,7.7,0,7.7,6.1,7.7c6.5,0,6.7-0.1,6.7-6.1
				c0-6.7-0.1-6.6-6.5-6.9C1008.5,157.3,1005.3,157.9,1006.6,162.8z M868.7,141.9c0,4.9,0,8.4,0,13c4.2-0.5,8.6,0.1,11.5-1.7
				c1.5-0.9,1.7-7.9,0.2-8.9C877.6,142.3,873.2,142.6,868.7,141.9z M962.3,163.7c1.6-5-0.8-6.1-5.8-6.3c-5.5-0.3-6.2,2-6.1,6.6
				c0,4.6,0.6,6.9,6.2,6.7C961.9,170.7,963.4,168.8,962.3,163.7z M922.2,93.8c-5,0-8.5,0-13.1,0c0.5,4.3,0.2,8.7,1.9,12
				c0.7,1.3,7.7,1.5,8.6,0.1C921.5,102.7,921.3,98.4,922.2,93.8z M950.1,93.8c0.6,4.4,0.2,8.8,2,12c0.8,1.4,8.2,1.3,9-0.1
				c1.8-3.2,1.3-7.6,1.8-11.9C958.2,93.8,954.7,93.8,950.1,93.8z M896.2,141.8c-4.6,0.9-9,0.8-12.1,2.7c-1.3,0.8-1.1,7.9,0.2,8.6
				c3.3,1.7,7.7,1.3,11.9,1.8C896.2,150.2,896.2,146.8,896.2,141.8z M921.9,203.3c-0.6-4.3-0.2-8.8-2-11.9c-0.8-1.4-8.1-1.3-8.9,0.1
				c-1.8,3.2-1.3,7.6-1.8,11.8C913.7,203.3,917.3,203.3,921.9,203.3z M868.7,219.4c4.5-0.8,8.9-0.6,11.8-2.4c1.4-0.9,1.3-7.8,0-8.6
				c-3.2-1.8-7.5-1.5-11.8-2.1C868.7,210.9,868.7,214.5,868.7,219.4z M896.1,206.1c-4.5,0.7-8.8,0.4-11.9,2.2
				c-1.4,0.8-1.4,7.8,0,8.6c3.2,1.8,7.5,1.6,11.9,2.3C896.1,214.5,896.1,210.9,896.1,206.1z M1006.9,219.3c4.5-0.7,8.8-0.4,11.8-2.3
				c1.4-0.9,1.4-7.8,0-8.6c-3.2-1.8-7.5-1.6-11.9-2.3C1006.9,210.8,1006.9,214.4,1006.9,219.3z M1003.3,206.1
				c-4.4,0.7-8.9,0.3-11.7,2.3c-1.5,1-1.3,8,0.2,8.9c2.9,1.8,7.3,1.3,11.5,1.8C1003.3,214.5,1003.3,210.9,1003.3,206.1z
				 M965.9,219.4c4.6-0.8,9-0.7,12.1-2.6c1.4-0.8,1.2-8-0.1-8.6c-3.3-1.7-7.7-1.4-12.1-1.9C965.9,210.8,965.9,214.4,965.9,219.4z
				 M930.8,206.9c-5-1.6-6.2,0.7-6.5,5.8c-0.2,5.6,2.2,6.1,6.7,6.2c4.6,0,6.7-0.7,6.7-6.1C937.6,207.3,935.9,205.7,930.8,206.9z
				 M931.4,154.3c5,1.6,6.1-0.8,6.3-5.8c0.3-5.5-2-6.2-6.6-6.1c-4.6,0-6.9,0.6-6.8,6.2C924.4,153.9,926.2,155.4,931.4,154.3z
				 M1003.1,155.2c0-5,0-8.7,0-13.3c-4.3,0.7-8.6,0.5-11.6,2.3c-1.4,0.9-1.4,7.7,0,8.6C994.5,154.7,998.8,154.5,1003.1,155.2z
				 M1006.9,155.1c4.3-0.7,8.7-0.5,11.9-2.3c1.3-0.8,1.3-7.8,0-8.6c-3.2-1.8-7.6-1.5-11.9-2.1
				C1006.9,146.8,1006.9,150.3,1006.9,155.1z M963,203.3c-0.7-4.3-0.4-8.7-2.2-12c-0.7-1.3-7.9-1.3-8.6,0c-1.8,3.3-1.5,7.6-2.1,11.9
				C954.8,203.3,958.3,203.3,963,203.3z M922.3,121.2c-1-4.6-0.9-8.9-2.9-11.9c-0.9-1.3-7.8-1-8.5,0.3c-1.6,3.3-1.3,7.6-1.7,11.6
				C913.8,121.2,917.2,121.2,922.3,121.2z M963.1,121.2c-0.7-4.3-0.5-8.6-2.4-11.7c-0.8-1.3-7.8-1.3-8.5,0
				c-1.8,3.2-1.5,7.5-2.1,11.7C954.8,121.2,958.3,121.2,963.1,121.2z M921.3,163.9c1.1-4.9-0.6-6.5-5.9-6.6
				c-5.6-0.1-6.1,2.1-6.1,6.7c0,4.6,0.7,6.8,6.2,6.7C920.8,170.7,922.3,168.8,921.3,163.9z M965.9,154.5c2.7,0,4.9-0.3,7,0.1
				c4.9,0.7,5.8-1.8,5.7-6c0-4.1-0.6-6.4-5.6-6.2c-7.6,0.4-7.6,0.1-7.4,7.6C965.6,151.3,965.8,152.6,965.9,154.5z M921.1,218.4
				c0-4,0-7.6,0-11.3c-4,0-7.6,0-11.3,0c0,4,0,7.5,0,11.3C913.7,218.4,917.1,218.4,921.1,218.4z M950.8,218.2c4.1,0,7.7,0,11.3,0
				c0-4,0-7.6,0-11.2c-4,0-7.5,0-11.3,0C950.8,210.8,950.8,214.3,950.8,218.2z M950.8,154.1c4.1,0,7.8,0,11.3,0c0-4,0-7.6,0-11.1
				c-4,0-7.5,0-11.3,0C950.8,146.7,950.8,150.2,950.8,154.1z M921.2,143c-4.1,0-7.8,0-11.3,0c0,4,0,7.6,0,11.1c4,0,7.5,0,11.3,0
				C921.2,150.3,921.2,146.9,921.2,143z M942.3,57.8c-4.7-0.4-8-1.6-9.4,3.5c-0.6,2.1-2.3,4-3.6,5.9c-1.5,2.2-3.1,4.3-4.6,6.4
				c0.2,0.1,0.4,0.2,0.6,0.3C930.7,68.8,936,63.7,942.3,57.8z M961.4,39.4c-0.3-0.3-0.6-0.7-0.9-1c-5.2,5.1-10.4,10.2-15.6,15.3
				c0.3,0.6,0.7,1.2,1,1.8c2.2-0.5,5.3-0.3,6.4-1.7C955.7,49.4,958.4,44.3,961.4,39.4z M929.1,40.9c4,4.1,8.4,8.6,13.6,13.8
				c-0.6-2.7-0.3-5.8-1.6-6.8C937.2,45.1,932.7,42.9,929.1,40.9z M945.2,58.5c-1.6,4.7-0.7,7.3,3.7,9.1c3.5,1.4,6.5,3.8,9.7,5.8
				c0.1-0.2,0.2-0.5,0.3-0.7C954.5,68.1,950.1,63.5,945.2,58.5z"/>
			<rect x="859.3" y="84.7" style="fill:#BFBFBF;" width="170.3" height="210.3"/>
		</g>
		<g>
			<g>
				<rect x="886.6" y="93.3" style="fill:#FFFFFF;" width="12.3" height="12.3"/>
				<rect x="870.6" y="93.3" style="fill:#FFFFFF;" width="12.3" height="12.3"/>
				<rect x="870.6" y="108.6" style="fill:#FFFFFF;" width="12.3" height="12.3"/>
				<rect x="886.6" y="108.6" style="fill:#FFFFFF;" width="12.3" height="12.3"/>
			</g>
			<g>
				<rect x="964.8" y="93.3" style="fill:#FFFFFF;" width="12.3" height="12.3"/>
				<rect x="948.8" y="93.3" style="fill:#FFFFFF;" width="12.3" height="12.3"/>
				<rect x="948.8" y="108.6" style="fill:#FFFFFF;" width="12.3" height="12.3"/>
				<rect x="964.8" y="108.6" style="fill:#FFFFFF;" width="12.3" height="12.3"/>
			</g>
			<g>
				<rect x="925.7" y="93.3" style="fill:#FFFFFF;" width="12.3" height="12.3"/>
				<rect x="909.7" y="93.3" style="fill:#FFFFFF;" width="12.3" height="12.3"/>
				<rect x="909.7" y="108.6" style="fill:#FFFFFF;" width="12.3" height="12.3"/>
				<rect x="925.7" y="108.6" style="fill:#FFFFFF;" width="12.3" height="12.3"/>
			</g>
			<g>
				<rect x="1003.9" y="93.3" style="fill:#FFFFFF;" width="12.3" height="12.3"/>
				<rect x="987.9" y="93.3" style="fill:#FFFFFF;" width="12.3" height="12.3"/>
				<rect x="987.9" y="108.6" style="fill:#FFFFFF;" width="12.3" height="12.3"/>
				<rect x="1003.9" y="108.6" style="fill:#FFFFFF;" width="12.3" height="12.3"/>
			</g>
		</g>
		<g>
			<g>
				<rect x="886.6" y="142.3" style="fill:#FFFFFF;" width="12.3" height="12.3"/>
				<rect x="870.6" y="142.3" style="fill:#FFFFFF;" width="12.3" height="12.3"/>
				<rect x="870.6" y="157.6" style="fill:#FFFFFF;" width="12.3" height="12.3"/>
				<rect x="886.6" y="157.6" style="fill:#FFFFFF;" width="12.3" height="12.3"/>
			</g>
			<g>
				<rect x="964.8" y="142.3" style="fill:#FFFFFF;" width="12.3" height="12.3"/>
				<rect x="948.8" y="142.3" style="fill:#FFFFFF;" width="12.3" height="12.3"/>
				<rect x="948.8" y="157.6" style="fill:#FFFFFF;" width="12.3" height="12.3"/>
				<rect x="964.8" y="157.6" style="fill:#FFFFFF;" width="12.3" height="12.3"/>
			</g>
			<g>
				<rect x="925.7" y="142.3" style="fill:#FFFFFF;" width="12.3" height="12.3"/>
				<rect x="909.7" y="142.3" style="fill:#FFFFFF;" width="12.3" height="12.3"/>
				<rect x="909.7" y="157.6" style="fill:#FFFFFF;" width="12.3" height="12.3"/>
				<rect x="925.7" y="157.6" style="fill:#FFFFFF;" width="12.3" height="12.3"/>
			</g>
			<g>
				<rect x="1003.9" y="142.3" style="fill:#FFFFFF;" width="12.3" height="12.3"/>
				<rect x="987.9" y="142.3" style="fill:#FFFFFF;" width="12.3" height="12.3"/>
				<rect x="987.9" y="157.6" style="fill:#FFFFFF;" width="12.3" height="12.3"/>
				<rect x="1003.9" y="157.6" style="fill:#FFFFFF;" width="12.3" height="12.3"/>
			</g>
		</g>
		<g>
			<rect x="886.6" y="238.3" style="fill:#FFFFFF;" width="12.3" height="12.3"/>
			<rect x="870.6" y="238.3" style="fill:#FFFFFF;" width="12.3" height="12.3"/>
			<rect x="870.6" y="253.6" style="fill:#FFFFFF;" width="12.3" height="12.3"/>
			<rect x="886.6" y="253.6" style="fill:#FFFFFF;" width="12.3" height="12.3"/>
		</g>
		<g>
			<g>
				<rect x="886.6" y="191.3" style="fill:#FFFFFF;" width="12.3" height="12.3"/>
				<rect x="870.6" y="191.3" style="fill:#FFFFFF;" width="12.3" height="12.3"/>
				<rect x="870.6" y="206.6" style="fill:#FFFFFF;" width="12.3" height="12.3"/>
				<rect x="886.6" y="206.6" style="fill:#FFFFFF;" width="12.3" height="12.3"/>
			</g>
			<g>
				<rect x="964.8" y="191.3" style="fill:#FFFFFF;" width="12.3" height="12.3"/>
				<rect x="948.8" y="191.3" style="fill:#FFFFFF;" width="12.3" height="12.3"/>
				<rect x="948.8" y="206.6" style="fill:#FFFFFF;" width="12.3" height="12.3"/>
				<rect x="964.8" y="206.6" style="fill:#FFFFFF;" width="12.3" height="12.3"/>
			</g>
			<g>
				<rect x="925.7" y="191.3" style="fill:#FFFFFF;" width="12.3" height="12.3"/>
				<rect x="909.7" y="191.3" style="fill:#FFFFFF;" width="12.3" height="12.3"/>
				<rect x="909.7" y="206.6" style="fill:#FFFFFF;" width="12.3" height="12.3"/>
				<rect x="925.7" y="206.6" style="fill:#FFFFFF;" width="12.3" height="12.3"/>
			</g>
			<g>
				<rect x="1003.9" y="191.3" style="fill:#FFFFFF;" width="12.3" height="12.3"/>
				<rect x="987.9" y="191.3" style="fill:#FFFFFF;" width="12.3" height="12.3"/>
				<rect x="987.9" y="206.6" style="fill:#FFFFFF;" width="12.3" height="12.3"/>
				<rect x="1003.9" y="206.6" style="fill:#FFFFFF;" width="12.3" height="12.3"/>
			</g>
		</g>
		<g>
			<rect x="1003.9" y="238.3" style="fill:#FFFFFF;" width="12.3" height="12.3"/>
			<rect x="987.9" y="238.3" style="fill:#FFFFFF;" width="12.3" height="12.3"/>
			<rect x="987.9" y="253.6" style="fill:#FFFFFF;" width="12.3" height="12.3"/>
			<rect x="1003.9" y="253.6" style="fill:#FFFFFF;" width="12.3" height="12.3"/>
		</g>
		<rect x="921.6" y="238" style="fill:#FFFFFF;" width="43.3" height="56"/>
	</g>
	<g>
		
			<text transform="matrix(1 0 0 1 781.7836 341.9985)" style="fill:#FF3334; font-family:'Raleway-Black'; font-size:29px; letter-spacing:2;">MOSSACK FONSECA</text>
	</g>
	<rect x="791.7" y="363.8" style="fill:none;" width="303.7" height="116.3"/>
	<text transform="matrix(1 0 0 1 858.0953 380.6117)"><tspan x="0" y="0" style="fill:#808080; font-family:'Raleway-Medium'; font-size:23px;">SPECIALIZES IN</tspan><tspan x="-38.3" y="27.6" style="fill:#808080; font-family:'Raleway-Medium'; font-size:23px;"> CREATING OFFSHORE </tspan><tspan x="18.2" y="55.2" style="fill:#808080; font-family:'Raleway-Medium'; font-size:23px;">COMPANIES</tspan><tspan x="21.4" y="82.8" style="fill:#F24141; font-family:'Raleway-Medium'; font-size:23px; letter-spacing:2;">(PANAMA)</tspan></text>
</g>
<g>
	<g>
		
			<text transform="matrix(1 0 0 1 1139.4618 341.998)" style="fill:#FF3334; font-family:'Raleway-Black'; font-size:29px; letter-spacing:2;">INERSA INVESTMENTS INC  </text>
	</g>
	<rect x="1170.9" y="363.8" style="fill:none;" width="391.5" height="164.2"/>
	<text transform="matrix(1 0 0 1 1175.943 380.6117)"><tspan x="0" y="0" style="fill:#808080; font-family:'Raleway-Medium'; font-size:23px;">BEARER SHARE. CRÉDIT AGRICOLE </tspan><tspan x="20.2" y="27.6" style="fill:#808080; font-family:'Raleway-Medium'; font-size:23px;">TRANSFERS MANAGEMENT TO </tspan><tspan x="-4.6" y="55.2" style="fill:#808080; font-family:'Raleway-Medium'; font-size:23px;">NEWGEST MANAGEMENT LTD. THE </tspan><tspan x="-3.5" y="82.8" style="fill:#808080; font-family:'Raleway-Medium'; font-size:23px;">SILENT PARTNER GETS A GENERAL </tspan><tspan x="63.5" y="110.4" style="fill:#808080; font-family:'Raleway-Medium'; font-size:23px;">POWER OF ATTORNEY. </tspan><tspan x="21.1" y="138" style="fill:#F24141; font-family:'Raleway-Medium'; font-size:23px; letter-spacing:2;">(BRITISH VIRGIN ISLANDS)</tspan></text>
	<g>
		<g>
			<path style="fill:#BFBFBF;" d="M1390.5,83.8h-101.3c-3.9,0-7-3.2-7-7V62.5c0-3.9,3.2-7,7-7h101.3c3.9,0,7,3.2,7,7v14.3
				C1397.5,80.7,1394.4,83.8,1390.5,83.8z"/>
			<rect x="1336.2" y="81.7" style="fill:#BFBFBF;" width="8.7" height="69"/>
			<rect x="1268.7" y="115.3" style="fill:#BFBFBF;" width="143.4" height="7.3"/>
			<rect x="1403.2" y="121.3" style="fill:#BFBFBF;" width="9" height="33.5"/>
			<rect x="1268.7" y="119" style="fill:#BFBFBF;" width="9" height="32.8"/>
			<ellipse style="fill:#BFBFBF;" cx="1273.3" cy="162.5" rx="20" ry="13.2"/>
			<ellipse style="fill:#BFBFBF;" cx="1340.6" cy="162.5" rx="20" ry="13.2"/>
			<ellipse style="fill:#BFBFBF;" cx="1407.9" cy="162.5" rx="20" ry="13.2"/>
		</g>
		<path style="fill:#BFBFBF;" d="M1406.7,294.2h-133.2c-6.1,0-11-4.9-11-11v-84.8c0-6.1,4.9-11,11-11h133.2c6.1,0,11,4.9,11,11v84.8
			C1417.7,289.3,1412.8,294.2,1406.7,294.2z"/>
		<rect x="1271.8" y="197.9" style="fill:none;stroke:#FFFFFF;stroke-width:3;stroke-miterlimit:10;" width="136" height="86"/>
		<rect x="1314.3" y="210.2" style="fill:#FFFFFF;" width="51" height="6"/>
		<rect x="1287.3" y="223.7" style="fill:#FFFFFF;" width="105" height="5.2"/>
		<rect x="1287.6" y="236.7" style="fill:#FFFFFF;" width="105" height="5"/>
		<rect x="1287.3" y="249.2" style="fill:#FFFFFF;" width="65" height="5"/>
		<rect x="1287.6" y="261.9" style="fill:#FFFFFF;" width="21.8" height="4.8"/>
		<circle style="fill:#FFFFFF;" cx="1383.7" cy="261.8" r="7"/>
		<path style="fill:#FFFFFF;stroke:#FFFFFF;stroke-miterlimit:10;" d="M1395.5,258.9l-1.9-0.4c-0.2-0.5-0.4-1-0.6-1.5l1.1-1.6
			c0.2-0.3,0.1-0.7-0.1-0.9l-3-3c-0.2-0.2-0.6-0.3-0.9-0.1l-1.6,1.1c-0.5-0.2-1-0.4-1.5-0.6l-0.4-1.9c-0.1-0.3-0.4-0.6-0.7-0.6h-4.2
			c-0.3,0-0.7,0.2-0.7,0.6l-0.4,1.9c-0.5,0.2-1,0.4-1.5,0.6l-1.6-1.1c-0.3-0.2-0.7-0.1-0.9,0.1l-3,3c-0.2,0.2-0.3,0.6-0.1,0.9
			l1.1,1.6c-0.2,0.5-0.4,1-0.6,1.5l-1.9,0.4c-0.3,0.1-0.6,0.4-0.6,0.7v4.2c0,0.4,0.2,0.7,0.6,0.7l1.9,0.4c0.2,0.5,0.4,1,0.6,1.5
			l-1.1,1.6c-0.2,0.3-0.1,0.7,0.1,0.9l3,3c0.2,0.2,0.6,0.3,0.9,0.1l1.6-1.1c0.5,0.2,1,0.4,1.5,0.6l0.4,1.9c0.1,0.3,0.4,0.6,0.7,0.6
			h4.2c0.4,0,0.7-0.2,0.7-0.6l0.4-1.9c0.5-0.2,1-0.4,1.5-0.6l1.6,1.1c0.3,0.2,0.7,0.1,0.9-0.1l3-3c0.2-0.2,0.3-0.6,0.1-0.9l-1.1-1.6
			c0.2-0.5,0.4-1,0.6-1.5l1.9-0.4c0.3-0.1,0.6-0.4,0.6-0.7v-4.2C1396.1,259.3,1395.9,259,1395.5,258.9z M1394.6,263.3l-1.8,0.4
			c-0.3,0.1-0.5,0.3-0.6,0.5c-0.2,0.7-0.5,1.4-0.8,2c-0.1,0.2-0.1,0.5,0,0.8l1,1.5l-2.1,2.1l-1.5-1c-0.2-0.1-0.5-0.2-0.8,0
			c-0.6,0.4-1.3,0.6-2,0.8c-0.3,0.1-0.5,0.3-0.5,0.6l-0.4,1.8h-3l-0.4-1.8c-0.1-0.3-0.3-0.5-0.5-0.6c-0.7-0.2-1.4-0.5-2-0.8
			c-0.2-0.1-0.5-0.1-0.8,0l-1.5,1l-2.1-2.1l1-1.5c0.1-0.2,0.2-0.5,0-0.8c-0.4-0.6-0.6-1.3-0.8-2c-0.1-0.3-0.3-0.5-0.6-0.5l-1.8-0.4
			v-3l1.8-0.4c0.3-0.1,0.5-0.3,0.6-0.5c0.2-0.7,0.5-1.4,0.8-2c0.1-0.2,0.1-0.5,0-0.8l-1-1.5l2.1-2.1l1.5,1c0.2,0.1,0.5,0.2,0.8,0
			c0.6-0.4,1.3-0.6,2-0.8c0.3-0.1,0.5-0.3,0.5-0.6l0.4-1.8h3l0.4,1.8c0.1,0.3,0.3,0.5,0.5,0.6c0.7,0.2,1.4,0.5,2,0.8
			c0.2,0.1,0.5,0.1,0.8,0l1.5-1l2.1,2.1l-1,1.5c-0.1,0.2-0.2,0.5,0,0.8c0.4,0.6,0.6,1.3,0.8,2c0.1,0.3,0.3,0.5,0.6,0.5l1.8,0.4
			V263.3z"/>
	</g>
</g>
<g>
	<g>
		
			<text transform="matrix(1 0 0 1 1619.6045 341.9985)" style="fill:#FF3334; font-family:'Raleway-Black'; font-size:29px; letter-spacing:2;">BANK ACCOUNT</text>
	</g>
	<rect x="1615.7" y="363.8" style="fill:none;" width="269.5" height="116.3"/>
	<text transform="matrix(1 0 0 1 1625.5601 380.6117)"><tspan x="0" y="0" style="fill:#808080; font-family:'Raleway-Medium'; font-size:23px;">POWER OF ATTORNEY </tspan><tspan x="29.3" y="27.6" style="fill:#808080; font-family:'Raleway-Medium'; font-size:23px;">TO OPEN A BANK  </tspan><tspan x="53.3" y="55.2" style="fill:#808080; font-family:'Raleway-Medium'; font-size:23px;">ACCOUNT</tspan><tspan x="166.6" y="55.2" style="font-family:'Raleway-Medium'; font-size:23px;"> </tspan><tspan x="172.4" y="55.2" style="fill:#F24141; font-family:'Raleway-Medium'; font-size:23px;">(?)</tspan><tspan x="196.5" y="55.2" style="font-family:'Raleway-Medium'; font-size:23px;">  </tspan></text>
	<g>
		<path style="fill:#BFBFBF;" d="M1749.9,120.8c38.2,0,76.5,0,114.7,0c7.8,0,8.4-0.5,7.4-8.2c-0.2-1.4-1.6-3.1-2.9-3.9
			c-3.1-1.8-6.6-3.1-9.9-4.7c-20.5-9.8-41-19.6-61.6-29.3c-13.8-6.5-27.8-12.8-41.4-19.6c-4.8-2.4-8.8-1.9-13,0.6
			c-1,0.6-1.9,1.3-3,1.8c-21.1,9.9-42.1,19.7-63.2,29.6c-14.9,7-29.7,14.2-44.7,20.9c-5.3,2.4-3.7,6.6-3.5,10.2
			c0.2,4.2,4,2.6,6.3,2.7C1673.5,120.9,1711.7,120.8,1749.9,120.8z"/>
		<path style="fill:#BFBFBF;" d="M1749.9,120.8c-38.2,0-76.5,0-114.7-0.1c-2.3,0-6.1,1.5-6.3-2.7c-0.2-3.6-1.8-7.8,3.5-10.2
			c15-6.7,29.8-13.9,44.7-20.9c21.1-9.9,42.1-19.7,63.2-29.6c1-0.5,2-1.2,3-1.8c4.2-2.5,8.2-3,13-0.6c13.6,6.9,27.6,13.1,41.4,19.6
			c20.5,9.7,41.1,19.5,61.6,29.3c3.3,1.6,6.7,2.9,9.9,4.7c1.3,0.8,2.7,2.5,2.9,3.9c1,7.7,0.4,8.2-7.4,8.2
			C1826.4,120.8,1788.2,120.8,1749.9,120.8z"/>
		<path style="fill:#BFBFBF;" d="M1750.2,272.1c-35.2,0-70.5,0-105.7,0c-6.9,0-7.9-1-6.7-7.9c0.2-1.2,1.8-2.3,3-3.1
			c0.7-0.5,2-0.1,3-0.1c71.1,0,142.2,0,213.4-0.1c4.9,0,6.3,1.5,6.2,6.3c-0.1,4.2-1.7,5-5.4,5C1822,272.1,1786.1,272.1,1750.2,272.1
			z"/>
		<path style="fill:#BFBFBF;" d="M1750.2,289.2c-38.6,0-77.1-0.1-115.7,0.1c-4.7,0-6.2-1.5-5.9-6c0.2-2.9,1.1-4.4,4.2-4.1
			c0.7,0.1,1.3,0,2,0c77.1,0,154.2,0,231.3,0c2.9,0,6-0.8,6.2,4.2c0.1,4.6-1.3,6-6,6C1827.6,289.1,1788.9,289.2,1750.2,289.2z"/>
		<path style="fill:#BFBFBF;" d="M1750.4,137.9c-35.6,0-71.1,0-106.7,0c-6,0-7-1.1-5.9-7.1c0.2-1.2,1.8-2.3,3-3c0.7-0.5,2-0.1,3-0.1
			c71.1,0,142.2,0,213.3,0c3.3,0,6.2-0.3,6.2,4.7c0,4.4-1.3,5.7-5.7,5.7C1821.9,137.9,1786.1,137.9,1750.4,137.9z"/>
		<path style="fill:#BFBFBF;" d="M1852.2,249.2c0,4.6-1.3,6.6-5.9,5.9c-0.3,0-0.7,0-1,0c-8.2,0-8.3,0-8.2-8c0.3-32.3,0.7-64.7,1-97
			c0-2.8-0.1-5.7,4-5.2c3.3,0.4,8.5-2.1,8.5,4.3c0.1,11.3,0,22.7,0,34C1851.1,183.2,1852,227.2,1852.2,249.2z"/>
		<path style="fill:#BFBFBF;" d="M1805.1,249.4c0,4.4-1.2,5.9-5.7,5.7c-10.8-0.3-9.5,0.9-9.4-9.3c0.3-32,0.7-64,0.9-96
			c0-4.5,1.9-5.3,5.7-5.2c3.7,0.1,6.8-0.2,6.7,5.3c-0.3,13.5-0.1,27-0.1,40.5C1803.8,190.5,1804.9,229.8,1805.1,249.4z"/>
		<path style="fill:#BFBFBF;" d="M1758,249.5c0.1,4.4-1.3,5.8-5.7,5.7c-10.9-0.3-9.4,0.9-9.5-9.3c0-1,0-2,0-3c0.3-31,0.8-62,0.9-93
			c0-4.5,1.9-5.4,5.7-5.1c3.3,0.2,6.7-0.7,6.6,4.8c-0.3,15.5-0.1,31-0.1,46.5C1756.6,196,1757.8,231.7,1758,249.5z"/>
		<path style="fill:#BFBFBF;" d="M1710.9,249.5c0.1,4.4-1.4,5.8-5.7,5.7c-11.1-0.3-9.5,0.8-9.5-9.7c0-10.8,0-21.7,0.1-32.5
			c0.3-21.2,0.8-42.3,0.9-63.5c0-5,2.9-4.6,6.2-4.7c3.4,0,6.1-0.2,6.1,4.8c-0.2,17.5-0.1,35-0.1,52.5
			C1709.5,202,1710.7,233.7,1710.9,249.5z"/>
		<path style="fill:#BFBFBF;" d="M1649.7,218.1c0-22.9,0.1-45.7-0.1-68.6c0-5,2.7-4.7,6.1-4.7c3.4,0,6.1-0.2,6.1,4.7
			c0.1,22.7,0.5,45.4,0.9,68.1c0.2,11,0.6,22,1,33c0.1,3.2-1,4.4-4.3,4.5c-11.3,0.4-11.2,0.5-11-10.5
			C1648.7,235.8,1649.3,218.1,1649.7,218.1z"/>
		<g>
			<rect x="1744.3" y="67.7" style="fill:#FFFFFF;" width="10.7" height="41.7"/>
			<rect x="1733.3" y="81.7" style="fill:#FFFFFF;" width="32" height="14"/>
		</g>
	</g>
</g>
</svg>
