<?xml version="1.0" encoding="utf-8"?>
<!-- Generator: Adobe Illustrator 22.0.0, SVG Export Plug-In . SVG Version: 6.00 Build 0)  -->
<svg version="1.1" id="Calque_1" xmlns="http://www.w3.org/2000/svg" xmlns:xlink="http://www.w3.org/1999/xlink" x="0px" y="0px"
	 width="600px" height="900px" viewBox="0 0 600 900" style="enable-background:new 0 0 600 900;" xml:space="preserve">
<g>
	<g>
		<polygon style="fill:#F24141;" points="285.7,682.3 282.3,682.3 288.8,671.3 282.3,660.3 285.7,660.3 292.2,671.4 		"/>
		<polygon style="fill:#F24141;" points="277.1,682.3 273.7,682.3 280.2,671.3 273.7,660.3 277.1,660.3 283.6,671.4 		"/>
		<polygon style="fill:#F24141;" points="294.3,682.3 290.9,682.3 297.4,671.3 290.9,660.3 294.3,660.3 300.8,671.4 		"/>
		<polygon style="fill:#F24141;" points="302.9,682.3 299.5,682.3 306,671.3 299.5,660.3 302.9,660.3 309.4,671.4 		"/>
		<polygon style="fill:#F24141;" points="311.6,682.3 308.1,682.3 314.6,671.3 308.1,660.3 311.6,660.3 318.1,671.4 		"/>
		<polygon style="fill:#F24141;" points="320.2,682 316.8,682 323.3,671 316.8,660 320.2,660 326.7,671.1 		"/>
		<polygon style="fill:#F24141;" points="328.8,682.5 325.4,682.5 331.9,671.6 325.4,660.6 328.8,660.6 335.3,671.6 		"/>
		<polygon style="fill:#F24141;" points="337.4,682.5 334,682.5 340.5,671.6 334,660.6 337.4,660.6 343.9,671.6 		"/>
		<polygon style="fill:#F24141;" points="346,682.5 342.6,682.5 349.1,671.6 342.6,660.6 346,660.6 352.5,671.6 		"/>
		<polygon style="fill:#F24141;" points="354.7,682.5 351.2,682.5 357.7,671.6 351.2,660.6 354.7,660.6 361.2,671.6 		"/>
		<polygon style="fill:#F24141;" points="363.3,682.2 359.9,682.2 366.4,671.3 359.9,660.3 363.3,660.3 369.8,671.3 		"/>
	</g>
	<g>
		<polygon style="fill:#F24141;" points="233.1,682.5 229.7,682.5 236.2,671.6 229.7,660.6 233.1,660.6 239.6,671.6 		"/>
		<polygon style="fill:#F24141;" points="241.7,682.5 238.3,682.5 244.8,671.6 238.3,660.6 241.7,660.6 248.2,671.6 		"/>
		<polygon style="fill:#F24141;" points="250.4,682.5 247,682.5 253.5,671.6 247,660.6 250.4,660.6 256.9,671.6 		"/>
		<polygon style="fill:#F24141;" points="259,682.5 255.6,682.5 262.1,671.6 255.6,660.6 259,660.6 265.5,671.6 		"/>
		<polygon style="fill:#F24141;" points="267.6,682.2 264.2,682.2 270.7,671.3 264.2,660.3 267.6,660.3 274.1,671.3 		"/>
	</g>
</g>
<g>
	<g>
		<polygon style="fill:#F24141;" points="296.7,114.7 293.3,114.7 299.8,103.7 293.3,92.8 296.7,92.8 303.2,103.8 		"/>
		<polygon style="fill:#F24141;" points="288.1,114.7 284.7,114.7 291.2,103.7 284.7,92.8 288.1,92.8 294.6,103.8 		"/>
		<polygon style="fill:#F24141;" points="305.3,114.7 301.9,114.7 308.4,103.7 301.9,92.8 305.3,92.8 311.8,103.8 		"/>
		<polygon style="fill:#F24141;" points="313.9,114.7 310.5,114.7 317,103.7 310.5,92.8 313.9,92.8 320.4,103.8 		"/>
		<polygon style="fill:#F24141;" points="322.6,114.7 319.1,114.7 325.6,103.7 319.1,92.8 322.6,92.8 329.1,103.8 		"/>
		<polygon style="fill:#F24141;" points="331.2,114.4 327.8,114.4 334.3,103.4 327.8,92.5 331.2,92.5 337.7,103.5 		"/>
		<polygon style="fill:#F24141;" points="339.8,115 336.4,115 342.9,104 336.4,93 339.8,93 346.3,104.1 		"/>
		<polygon style="fill:#F24141;" points="348.4,115 345,115 351.5,104 345,93 348.4,93 354.9,104.1 		"/>
		<polygon style="fill:#F24141;" points="357,115 353.6,115 360.1,104 353.6,93 357,93 363.5,104.1 		"/>
		<polygon style="fill:#F24141;" points="365.7,115 362.2,115 368.7,104 362.2,93 365.7,93 372.2,104.1 		"/>
		<polygon style="fill:#F24141;" points="374.3,114.7 370.9,114.7 377.4,103.7 370.9,92.7 374.3,92.7 380.8,103.8 		"/>
	</g>
	<g>
		<polygon style="fill:#F24141;" points="244.1,115 240.7,115 247.2,104 240.7,93 244.1,93 250.6,104.1 		"/>
		<polygon style="fill:#F24141;" points="252.7,115 249.3,115 255.8,104 249.3,93 252.7,93 259.2,104.1 		"/>
		<polygon style="fill:#F24141;" points="261.4,115 258,115 264.5,104 258,93 261.4,93 267.9,104.1 		"/>
		<polygon style="fill:#F24141;" points="270,115 266.6,115 273.1,104 266.6,93 270,93 276.5,104.1 		"/>
		<polygon style="fill:#F24141;" points="278.6,114.7 275.2,114.7 281.7,103.7 275.2,92.7 278.6,92.7 285.1,103.8 		"/>
	</g>
</g>
<g>
	<polygon style="fill:#F24141;" points="224.2,408.7 227.6,408.7 221.1,419.6 227.6,430.6 224.2,430.6 217.7,419.5 	"/>
	<polygon style="fill:#F24141;" points="215.4,409 218.9,409 212.4,419.9 218.9,430.9 215.4,430.9 208.9,419.9 	"/>
	<polygon style="fill:#F24141;" points="206.7,408.4 210.1,408.4 203.6,419.4 210.1,430.3 206.7,430.3 200.2,419.3 	"/>
	<polygon style="fill:#F24141;" points="198,408.4 201.4,408.4 194.9,419.4 201.4,430.3 198,430.3 191.5,419.3 	"/>
	<polygon style="fill:#F24141;" points="189.3,408.4 192.7,408.4 186.2,419.4 192.7,430.3 189.3,430.3 182.8,419.3 	"/>
	<polygon style="fill:#F24141;" points="180.6,408.4 184,408.4 177.5,419.4 184,430.3 180.6,430.3 174.1,419.3 	"/>
	<polygon style="fill:#F24141;" points="171.9,408.7 175.3,408.7 168.8,419.7 175.3,430.6 171.9,430.6 165.4,419.6 	"/>
	<polygon style="fill:#F24141;" points="163.2,407.9 166.6,407.9 160.1,418.9 166.6,429.9 163.2,429.9 156.7,418.8 	"/>
</g>
<g>
	<polygon style="fill:#F24141;" points="120.1,478.3 120.1,474.9 131.1,481.4 142,474.9 142,478.3 131,484.8 	"/>
	<polygon style="fill:#F24141;" points="120.1,469.6 120.1,466.2 131.1,472.7 142,466.2 142,469.6 131,476.1 	"/>
	<polygon style="fill:#F24141;" points="120.1,487 120.1,483.6 131.1,490.1 142,483.6 142,487 131,493.5 	"/>
	<polygon style="fill:#F24141;" points="120.1,495.7 120.1,492.3 131.1,498.8 142,492.3 142,495.7 131,502.2 	"/>
	<polygon style="fill:#F24141;" points="120.1,504.5 120.1,501 131.1,507.5 142,501 142,504.5 131,511 	"/>
	<polygon style="fill:#F24141;" points="120.4,513.2 120.4,509.8 131.4,516.3 142.4,509.8 142.4,513.2 131.3,519.7 	"/>
	<polygon style="fill:#F24141;" points="119.8,521.9 119.8,518.5 130.8,525 141.8,518.5 141.8,521.9 130.7,528.4 	"/>
	<polygon style="fill:#F24141;" points="119.8,530.6 119.8,527.2 130.8,533.7 141.8,527.2 141.8,530.6 130.7,537.1 	"/>
	<polygon style="fill:#F24141;" points="119.8,539.3 119.8,535.9 130.8,542.4 141.8,535.9 141.8,539.3 130.7,545.8 	"/>
	<polygon style="fill:#F24141;" points="119.8,548 119.8,544.6 130.8,551.1 141.8,544.6 141.8,548 130.7,554.5 	"/>
	<polygon style="fill:#F24141;" points="120.2,556.7 120.2,553.3 131.1,559.8 142.1,553.3 142.1,556.7 131,563.2 	"/>
	<polygon style="fill:#F24141;" points="119.4,565.5 119.4,562 130.4,568.5 141.3,562 141.3,565.5 130.3,572 	"/>
</g>
<g>
	<path style="fill:#BFBFBF;" d="M154.3,175.6c-24.3,0-48.6-0.1-72.9,0.1c-3.2,0-4.2-0.9-4-4.1c0.4-8.3,0.4-16.7,0.7-25
		c0.2-5,2.2-9,7-11.1c6.5-2.8,13-5.6,19.5-8.3c5.9-2.4,12-4.3,17.7-7.1c3.9-1.9,7.8-4.5,7.2-10c-0.1-0.7,0.1-1.6,0.4-2.2
		c3.7-6.6,3.2-11.7-2-17.2c-0.4-0.5-1-1-1.1-1.6c-0.2-5.5-5.3-8.1-7.2-12.5c-1.2-3-1.7-6.5-1.7-9.7c0-5.5,0.2-11.1,1.3-16.4
		c1.3-6.7,3.3-13.3,5.8-19.7c1.1-2.8,3.9-5.1,6.5-7c1.5-1.1,4-1.2,6-1.4c4.9-0.5,9.9-0.6,14.8-1.3c7.9-1.1,15-0.2,21.7,4.8
		c4,2.9,8,5.5,10.3,9.9c1,1.9,1.4,4.3,1.8,6.5c1.1,7.3,2.3,14.7,2.9,22.1c0.3,3.5,0,7.2-1.1,10.5c-1.8,5.6-4.3,10.9-6.8,16.3
		c-0.7,1.5-2,2.8-3.2,4.1c-2.9,3.5-3,7.8-0.4,11.5c0.7,0.9,1.3,2.2,1.2,3.3c-0.5,7.4,5.1,9.4,10.2,11.5c9.5,3.9,19.2,7.1,28.6,11.2
		c4.6,2,9.9,3.9,11.4,9.6c0.6,2.4,1.2,4.8,1.3,7.2c0.4,7.5,0.4,14.9,0.8,22.4c0.1,2.8-0.8,3.7-3.7,3.7
		C203.1,175.5,178.7,175.6,154.3,175.6z"/>
	
		<text transform="matrix(1 0 0 1 65.198 209.9052)" style="fill:#FF3334; font-family:'Raleway-Black'; font-size:18.85px; letter-spacing:1;">MZOUGHI MZABI</text>
	<rect x="66.7" y="224.1" style="fill:none;" width="175.2" height="89.6"/>
	<text transform="matrix(1 0 0 1 98.8371 235.0039)"><tspan x="0" y="0" style="fill:#808080; font-family:'Raleway-Medium'; font-size:14.95px;">BUSINESSMAN, </tspan><tspan x="-19" y="17.9" style="fill:#808080; font-family:'Raleway-Medium'; font-size:14.95px;">SHAREHOLDER, AND </tspan><tspan x="-10.1" y="35.9" style="fill:#808080; font-family:'Raleway-Medium'; font-size:14.95px;">MANAGER OF THE </tspan><tspan x="4.2" y="53.8" style="fill:#808080; font-family:'Raleway-Medium'; font-size:14.95px;">MZABI GROUP</tspan><tspan x="106.8" y="53.8" style="fill:#545454; font-family:'Raleway-Medium'; font-size:14.95px;"> </tspan><tspan x="22.2" y="71.8" style="fill:#F24141; font-family:'Raleway-Regular'; font-size:14.95px;">(TUNISIA)</tspan></text>
</g>
<g>
	<path style="fill:#BFBFBF;" d="M499.5,96.1c-2.1,10-5.7,19.2-15.1,24.7c-16,9.4-37,1.4-43-16.3c-0.6-1.8-0.9-3.8-1.7-5.6
		c-1-2.3-2-4.7-3.6-6.6c-4.3-5.4-5.6-11.6-5.9-18.1c-0.1-3.2,2.4-4,5.1-4.7c-0.5-1.4-0.8-2.5-1.2-3.7c-3.2-9.1,0-17.1,4.6-24.6
		c5.3-8.7,13-14.9,22.6-18.3c12-4.2,26.5-0.6,34.6,9.8c0.5,0.6,0.9,1.4,1.5,1.6c7.3,2.6,9.9,8.7,11.2,15.4
		c1.3,7.2-0.2,14.4-1.9,21.5c3.7,3.9,3.9,10.5,0.5,16.4c-1,1.7-1.6,3.6-2.7,5.1c-1.1,1.5-2.8,2.5-4.2,3.8
		C500,96.3,499.8,96.2,499.5,96.1z"/>
	<path style="fill:#BFBFBF;" d="M443.6,121.7c5.2,16.9,10.3,33.3,15.4,49.8c0.4,0,0.7,0,1.1,0c2-5.7,4-11.5,5.9-17.3
		c0.2-0.8-0.7-1.9-1.1-2.9c-1.5-3.9-3.1-7.7-4.5-11.6c-0.2-0.6,0-1.5,0.2-2.2c1.2-3.9,7.4-6.1,13.2-4.6c4.9,1.3,6.9,4.1,5.7,8.8
		c-0.8,2.9-1.8,5.9-3.4,8.3c-1.9,2.8-2.1,5.1-0.8,8.1c1.9,4.3,3.3,8.8,4.8,13.3c0.3,0,0.6,0,1,0.1c5.1-16.5,10.3-33,15.4-49.4
		c6.4,3.1,12.4,6.3,18.7,9c4.5,2,9.2,3.7,14,4.9c9.4,2.3,13.3,9.2,14.4,17.6c0.9,6.7,0.3,13.6,0.1,20.4c0,0.8-1.4,1.7-2.3,2.2
		c-0.6,0.3-1.5,0.1-2.2,0.1c-46,0-92,0-138,0c-4.9,0-5.3-0.2-5.1-5.2c0.3-6.8,0.2-13.7,1.4-20.3c1.3-7.2,5.4-12.6,13.1-14.5
		c11.2-2.8,21.5-7.8,31.5-13.6C442.3,122.4,442.8,122.1,443.6,121.7z"/>
	<g>
		
			<text transform="matrix(1 0 0 1 389.0619 209.9052)" style="fill:#FF3334; font-family:'Raleway-Black'; font-size:18.85px; letter-spacing:1;">INTERMEDIARY</text>
	</g>
	<rect x="382.4" y="224.1" style="fill:none;" width="175.2" height="75.6"/>
	<text transform="matrix(1 0 0 1 412.6625 235.0039)"><tspan x="0" y="0" style="fill:#808080; font-family:'Raleway-Medium'; font-size:14.95px;">FIDUCIARY AND </tspan><tspan x="3.6" y="17.9" style="fill:#808080; font-family:'Raleway-Medium'; font-size:14.95px;">MANAGEMENT </tspan><tspan x="5.2" y="35.9" style="fill:#808080; font-family:'Raleway-Medium'; font-size:14.95px;">COMPANY S.A.  </tspan><tspan x="-0.6" y="53.8" style="fill:#F24141; font-family:'Raleway-Medium'; font-size:14.95px;">(SWITZERLAND) </tspan></text>
</g>
<g>
	<g>
		<g>
			<path style="fill:#BFBFBF;" d="M341.3,333c3.3,0,6.1,0.1,8.9,0c2.7-0.2,3.7,0.9,3.5,3.6c-0.1,1.5,0,3,0,4.9c3.5,0,6.6,0.1,9.7,0
				c1.9,0,2.9,0.7,2.7,2.7c0,0.6,0,1.3,0,2c0,49.3,0,98.5,0,147.8c0,4.6,0,4.6-4.7,4.6c-36.9,0-73.8,0-110.7,0c-4.5,0-4.5,0-4.5-4.4
				c0-49.4,0-98.7,0-148.1c0-4.4,0-4.4,4.5-4.4c0.4,0,0.9,0,1.3,0c2.1-0.1,4.8,0.5,6.3-0.6c1.1-0.8,0.5-3.8,1-5.7
				c0.2-0.8,1.3-1.9,2.2-2c2.5-0.3,5-0.2,7.5-0.1c1.9,0.1,2.7-0.5,2.7-2.6c0.3-7.2,0.3-7.2,7.5-7.2c19.3,0,38.6,0.1,57.9-0.1
				c3.2,0,4.7,0.7,4.2,4.1C341.1,329,341.3,330.8,341.3,333z M319.7,460c-8.7,0-17.2,0-25.6,0.1c-0.6,0-1.5,1.6-1.5,2.5
				c-0.1,9.7,0,19.5-0.1,29.2c0,2.2,0.9,2.7,2.9,2.7c5.5-0.1,11,0,16.6,0c2.5,0,5.1,0,7.8,0C319.7,482.8,319.7,471.7,319.7,460z
				 M345.6,365.6c-0.3-0.3-0.7-0.7-1-1c-2.5,0.5-5.6,0.2-7.2,1.7c-1.1,1-0.7,5,0.5,6.4c1,1.1,5.4,1.3,6.1,0.3
				C345.4,371.1,345.1,368.1,345.6,365.6z M298.2,406.6c-4.4,0-4.4,0-4.4,4.1c0,4.3,0,4.1,4.3,4.4c3.2,0.2,4.5-0.7,4.2-4.1
				C302,406.6,302.2,406.6,298.2,406.6z M320.5,364.9c0,1.8,0.2,3.1,0,4.4c-0.5,3.4,1,4.3,4.2,4.1c4.2-0.2,4.1-0.1,4.3-4.4
				c0.2-3.3-0.9-4.6-4.2-4.1C323.6,365.1,322.3,364.9,320.5,364.9z M302.2,368.3c0.9-3.3-1.3-3.5-4.2-3.4c-4.3,0.2-4.3,0-4.2,4.3
				c0,4.2,0.1,4.2,4.4,4.2C302.2,373.3,302.2,373.3,302.2,368.3z M275.9,365.5c-0.3-0.3-0.7-0.7-1-1c-2.5,0.5-5.5,0.3-7.3,1.8
				c-1,0.8-0.8,5.2,0.4,6.2c1.4,1.2,5.6,1.5,6.4,0.5C275.8,371.2,275.4,368,275.9,365.5z M257.8,364.6c-0.3,0.4-0.6,0.7-0.9,1.1
				c0.5,2.5,0.3,5.5,1.7,7.3c0.8,1,5.2,0.8,6.1-0.4c1.2-1.4,1.5-5.5,0.4-6.5C263.5,364.7,260.3,365,257.8,364.6z M275.4,411.1
				c0.6-3,0.2-4.8-3.6-4.6c-4.6,0.3-4.6,0.1-4.7,4.1c0,4.3,0.1,4.3,4.2,4.5C274.5,415.3,276.3,414.6,275.4,411.1z M347.2,364.9
				c0,2.4-0.3,4.5,0.1,6.4c0.7,3.7,3.8,1.5,5.9,1.8c0.7,0.1,2-1.3,2.3-2.3c0.4-1.2,0.4-2.6,0-3.8c-0.3-0.9-1.3-1.9-2.1-2.1
				C351.4,364.7,349.5,364.9,347.2,364.9z M257.3,411.3c-0.6,2.7,0.5,4,3.9,3.8c4.2-0.3,4.4-0.2,4.4-4.3c0-4-0.1-4.2-4.1-4.2
				C257.3,406.6,257.3,406.6,257.3,411.3z M256.8,382.4c0.3,0.4,0.7,0.7,1,1.1c2.5-0.4,5.5-0.2,7.3-1.5c1-0.7,0.8-4.9-0.3-6.1
				c-1.1-1.2-5.2-1.5-6.1-0.5C257.3,377,257.4,380,256.8,382.4z M274.8,383.6c0.4-0.3,0.7-0.7,1.1-1c-0.5-2.5-0.3-5.5-1.7-7.2
				c-0.8-1-4.9-0.8-6.2,0.4c-1.2,1.1-1.5,5.3-0.5,6.1C269.3,383.2,272.3,383.1,274.8,383.6z M297.8,383c2.9,0.6,4.8,0.2,4.5-3.6
				c-0.3-4.5-0.1-4.6-4.1-4.6c-4.2,0-4.3,0.2-4.5,4.2C293.5,382.3,294.4,383.9,297.8,383z M320,382.4c0.3,0.3,0.7,0.7,1,1
				c2.6-0.3,5.6,0.1,7.5-1.2c1-0.7,0.8-5-0.4-6.4c-0.9-1.2-5.2-1.4-6.1-0.4C320.5,376.9,320.6,379.9,320,382.4z M345.7,383.6
				c-0.6-3.5-0.4-6.5-1.7-8.3c-0.8-1-5.1-0.9-6.1,0.3c-1.2,1.4-1.5,5.5-0.5,6.4C339.1,383.4,342.2,383.1,345.7,383.6z M346.7,383.6
				c3.5-0.6,6.5-0.3,8.4-1.6c1-0.7,0.9-5.1-0.2-6.1c-1.4-1.2-5.5-1.5-6.4-0.5C347,377,347.3,380.1,346.7,383.6z M346.8,435.9
				c0.3,0.3,0.6,0.7,1,1c2.5-0.4,5.6-0.1,7.3-1.6c1.1-0.9,0.8-5-0.4-6.4c-1-1.2-5.3-1.4-6.1-0.3
				C347.1,430.3,347.2,433.4,346.8,435.9z M257.3,460c0,2.4-0.3,4.5,0.1,6.4c0.7,3.7,3.8,1.5,5.8,1.8c0.7,0.1,2-1.3,2.3-2.3
				c0.4-1.3,0.3-2.8,0-4.1c-0.2-0.7-1.1-1.7-1.8-1.7C261.7,459.9,259.7,460,257.3,460z M275.5,460c-2.4,0-4.3-0.1-6.1,0.1
				c-0.8,0.1-1.9,0.7-2.1,1.4c-1.7,4.8,0.1,7,5.1,7c2.4,0,3.3-0.8,3.1-3.2C275.4,463.7,275.5,462.1,275.5,460z M344.6,436.9
				c0.3-0.3,0.7-0.7,1-1c-0.4-2.5-0.2-5.5-1.6-7.3c-0.8-1-5.1-0.9-6.1,0.3c-1.2,1.4-1.5,5.5-0.5,6.4
				C339,436.7,342.1,436.5,344.6,436.9z M345.2,460.2c-1.4-0.1-2.3-0.1-3.1-0.1c-5.3-0.1-5.6,0.4-5.2,5.7c0.1,1.8,0.8,2.8,2.7,2.7
				c1.2-0.1,2.4,0.2,3.5-0.1c0.8-0.2,1.9-1.1,2-1.8C345.4,464.5,345.2,462.5,345.2,460.2z M347.9,459.5c-0.3,0.3-0.7,0.6-1,1
				c0.4,2.5,0,5.7,1.3,7.4c0.8,1,5,0.8,6.5-0.4c1.2-1,1.4-5.3,0.4-6.1C353.4,460,350.4,460.1,347.9,459.5z M319.9,437.1
				c3.7-0.6,6.8-0.3,8.5-1.7c1.1-0.9,0.8-5.2-0.4-6.4c-1.2-1.2-5.5-1.4-6.4-0.3C320.2,430.3,320.5,433.4,319.9,437.1z M302.2,432.6
				c0-4.4,0-4.4-4.1-4.4c-4.2,0-4.1,0.1-4.4,4.3c-0.2,3.2,0.8,4.4,4.1,4.2C302.2,436.3,302.2,436.6,302.2,432.6z M256.8,478.7
				c3.5-0.6,6.5-0.3,8.3-1.7c1-0.7,0.9-5.1-0.3-6.1c-1.4-1.2-5.5-1.5-6.4-0.5C257.1,472.1,257.4,475.2,256.8,478.7z M274.9,478.6
				c0.4-0.4,0.7-0.7,1.1-1.1c-0.5-2.5-0.4-5.5-1.8-7.2c-0.8-1-5-0.7-6.2,0.4c-1.2,1.2-1.4,5.4-0.4,6.1
				C269.4,478.3,272.4,478.2,274.9,478.6z M344.5,478.7c0.4-0.3,0.7-0.7,1.1-1c-0.5-2.5-0.3-5.5-1.7-7.2c-0.8-1-4.9-0.7-6.1,0.4
				c-1.2,1.2-1.4,5.3-0.5,6.1C339.1,478.3,342.1,478.2,344.5,478.7z M346.7,478.7c3.5-0.6,6.5-0.3,8.4-1.6c1-0.7,0.9-5.1-0.3-6.1
				c-1.4-1.2-5.5-1.5-6.4-0.5C347,472.1,347.3,475.2,346.7,478.7z M274.9,436.9c0.3-0.3,0.7-0.7,1-1c-0.5-2.5-0.3-5.5-1.7-7.3
				c-0.8-1-5.1-0.8-6.1,0.3c-1.2,1.4-1.5,5.5-0.5,6.4C269.3,436.8,272.4,436.5,274.9,436.9z M256.9,435.9c0.3,0.3,0.7,0.7,1,1
				c2.5-0.5,5.5-0.3,7.3-1.7c1-0.8,0.8-5.1-0.3-6.1c-1.4-1.2-5.5-1.5-6.4-0.5C257.1,430.3,257.4,433.4,256.9,435.9z M324.2,406.6
				c-2.6-0.6-4,0.3-3.8,3.9c0.3,4.5,0.1,4.5,4,4.6c4.5,0,4.5,0,4.5-4.1C328.9,406.6,328.9,406.6,324.2,406.6z M341.4,406.6
				c-4.4,0-4.5,0.1-4.5,4.1c0,4.1,0.2,4.2,4,4.4c2.9,0.1,4.7-0.2,4.4-3.9C344.9,406.6,345.2,406.6,341.4,406.6z M347.2,410
				c0,5,0,5,4,5c4.2,0,4.4-0.1,4.4-4c0-4.4-0.1-4.3-4.2-4.5C348.4,406.4,346.3,406.8,347.2,410z M257.5,396.4c0,3.2,0,5.5,0,8.4
				c2.7-0.3,5.6,0.1,7.5-1.1c1-0.6,1.1-5.2,0.1-5.8C263.3,396.7,260.4,396.9,257.5,396.4z M318.4,410.6c1.1-3.3-0.5-4-3.7-4.1
				c-3.6-0.2-4,1.3-4,4.3c0,3,0.4,4.5,4,4.4C318.1,415.1,319.1,413.9,318.4,410.6z M292.3,365.1c-3.2,0-5.6,0-8.5,0
				c0.4,2.8,0.1,5.6,1.3,7.8c0.4,0.8,5,0.9,5.6,0.1C291.8,371,291.7,368.1,292.3,365.1z M310.4,365.1c0.4,2.8,0.1,5.7,1.3,7.8
				c0.5,0.9,5.3,0.9,5.8-0.1c1.2-2.1,0.8-5,1.1-7.7C315.7,365.1,313.4,365.1,310.4,365.1z M275.4,396.4c-3,0.6-5.8,0.5-7.8,1.8
				c-0.9,0.5-0.7,5.1,0.1,5.6c2.2,1.1,5,0.9,7.7,1.2C275.4,401.8,275.4,399.6,275.4,396.4z M292.1,436.3c-0.4-2.8-0.1-5.7-1.3-7.7
				c-0.5-0.9-5.3-0.9-5.8,0.1c-1.2,2.1-0.9,4.9-1.2,7.7C286.8,436.3,289.1,436.3,292.1,436.3z M257.5,446.8c3-0.5,5.8-0.4,7.7-1.6
				c0.9-0.6,0.9-5.1,0-5.6c-2.1-1.2-4.9-1-7.7-1.4C257.5,441.3,257.5,443.6,257.5,446.8z M275.3,438.1c-2.9,0.4-5.7,0.3-7.7,1.5
				c-0.9,0.6-0.9,5.1,0,5.6c2.1,1.2,4.9,1.1,7.7,1.5C275.3,443.6,275.3,441.3,275.3,438.1z M347.4,446.7c2.9-0.5,5.7-0.3,7.7-1.5
				c0.9-0.6,0.9-5.1,0-5.6c-2.1-1.2-4.9-1.1-7.7-1.5C347.4,441.2,347.4,443.5,347.4,446.7z M345,438.1c-2.9,0.4-5.8,0.2-7.6,1.5
				c-0.9,0.6-0.9,5.2,0.1,5.8c1.9,1.2,4.8,0.8,7.5,1.1C345,443.6,345,441.3,345,438.1z M320.7,446.8c3-0.5,5.9-0.4,7.9-1.7
				c0.9-0.5,0.8-5.2,0-5.6c-2.2-1.1-5-0.9-7.8-1.2C320.7,441.2,320.7,443.5,320.7,446.8z M297.9,438.7c-3.2-1-4.1,0.5-4.2,3.7
				c-0.2,3.6,1.4,4,4.4,4c3,0,4.4-0.4,4.3-4C302.3,439,301.2,437.9,297.9,438.7z M298.3,404.5c3.3,1.1,3.9-0.5,4.1-3.7
				c0.2-3.6-1.3-4-4.3-4c-3,0-4.5,0.4-4.4,4C293.7,404.2,294.9,405.2,298.3,404.5z M344.9,405.1c0-3.3,0-5.6,0-8.6
				c-2.8,0.5-5.6,0.3-7.5,1.5c-0.9,0.6-0.9,5,0,5.6C339.3,404.7,342.1,404.6,344.9,405.1z M347.4,405c2.8-0.4,5.6-0.3,7.7-1.5
				c0.9-0.5,0.8-5.1,0-5.6c-2.1-1.2-4.9-1-7.7-1.4C347.4,399.6,347.4,401.9,347.4,405z M318.8,436.3c-0.4-2.8-0.3-5.7-1.4-7.8
				c-0.5-0.9-5.1-0.9-5.6,0c-1.2,2.1-1,5-1.4,7.8C313.5,436.3,315.8,436.3,318.8,436.3z M292.3,383c-0.6-3-0.6-5.8-1.9-7.7
				c-0.6-0.9-5.1-0.7-5.5,0.2c-1.1,2.1-0.8,4.9-1.1,7.6C286.8,383,289.1,383,292.3,383z M318.9,383c-0.5-2.8-0.3-5.6-1.5-7.6
				c-0.5-0.9-5.1-0.8-5.5,0c-1.2,2.1-1,4.9-1.4,7.6C313.5,383,315.8,383,318.9,383z M291.7,410.8c0.7-3.2-0.4-4.2-3.8-4.3
				c-3.6-0.1-4,1.4-4,4.4c0,3,0.4,4.4,4,4.4C291.4,415.1,292.4,413.9,291.7,410.8z M320.7,404.6c1.8,0,3.2-0.2,4.5,0
				c3.2,0.5,3.8-1.1,3.7-3.9c0-2.7-0.4-4.2-3.7-4c-4.9,0.3-4.9,0-4.8,4.9C320.5,402.5,320.6,403.4,320.7,404.6z M291.6,446.2
				c0-2.6,0-4.9,0-7.4c-2.6,0-5,0-7.3,0c0,2.6,0,4.9,0,7.4C286.8,446.2,289,446.2,291.6,446.2z M310.9,446c2.7,0,5,0,7.4,0
				c0-2.6,0-4.9,0-7.3c-2.6,0-4.9,0-7.4,0C310.9,441.2,310.9,443.5,310.9,446z M310.9,404.3c2.7,0,5,0,7.4,0c0-2.6,0-4.9,0-7.2
				c-2.6,0-4.9,0-7.4,0C310.9,399.6,310.9,401.8,310.9,404.3z M291.6,397.2c-2.7,0-5.1,0-7.4,0c0,2.6,0,4.9,0,7.2c2.6,0,4.9,0,7.4,0
				C291.6,401.9,291.6,399.7,291.6,397.2z M305.4,341.8c-3.1-0.3-5.2-1.1-6.1,2.2c-0.4,1.4-1.5,2.6-2.3,3.8c-1,1.4-2,2.8-3,4.1
				c0.1,0.1,0.3,0.1,0.4,0.2C297.8,348.9,301.3,345.6,305.4,341.8z M317.8,329.8c-0.2-0.2-0.4-0.4-0.6-0.6c-3.4,3.3-6.8,6.6-10.2,10
				c0.2,0.4,0.4,0.8,0.7,1.2c1.4-0.3,3.5-0.2,4.1-1.1C314.1,336.3,315.8,333,317.8,329.8z M296.8,330.8c2.6,2.7,5.5,5.6,8.8,9
				c-0.4-1.8-0.2-3.8-1-4.4C302,333.5,299.1,332.1,296.8,330.8z M307.3,342.2c-1,3-0.5,4.8,2.4,5.9c2.2,0.9,4.2,2.5,6.3,3.8
				c0.1-0.1,0.1-0.3,0.2-0.4C313.3,348.5,310.4,345.5,307.3,342.2z"/>
			<rect x="251.4" y="359.2" style="fill:#BFBFBF;" width="110.7" height="136.7"/>
		</g>
		<g>
			<g>
				<rect x="269.2" y="364.8" style="fill:#FFFFFF;" width="8" height="8"/>
				<rect x="258.8" y="364.8" style="fill:#FFFFFF;" width="8" height="8"/>
				<rect x="258.8" y="374.8" style="fill:#FFFFFF;" width="8" height="8"/>
				<rect x="269.2" y="374.8" style="fill:#FFFFFF;" width="8" height="8"/>
			</g>
			<g>
				<rect x="320" y="364.8" style="fill:#FFFFFF;" width="8" height="8"/>
				<rect x="309.6" y="364.8" style="fill:#FFFFFF;" width="8" height="8"/>
				<rect x="309.6" y="374.8" style="fill:#FFFFFF;" width="8" height="8"/>
				<rect x="320" y="374.8" style="fill:#FFFFFF;" width="8" height="8"/>
			</g>
			<g>
				<rect x="294.6" y="364.8" style="fill:#FFFFFF;" width="8" height="8"/>
				<rect x="284.2" y="364.8" style="fill:#FFFFFF;" width="8" height="8"/>
				<rect x="284.2" y="374.8" style="fill:#FFFFFF;" width="8" height="8"/>
				<rect x="294.6" y="374.8" style="fill:#FFFFFF;" width="8" height="8"/>
			</g>
			<g>
				<rect x="345.4" y="364.8" style="fill:#FFFFFF;" width="8" height="8"/>
				<rect x="335" y="364.8" style="fill:#FFFFFF;" width="8" height="8"/>
				<rect x="335" y="374.8" style="fill:#FFFFFF;" width="8" height="8"/>
				<rect x="345.4" y="374.8" style="fill:#FFFFFF;" width="8" height="8"/>
			</g>
		</g>
		<g>
			<g>
				<rect x="269.2" y="396.7" style="fill:#FFFFFF;" width="8" height="8"/>
				<rect x="258.8" y="396.7" style="fill:#FFFFFF;" width="8" height="8"/>
				<rect x="258.8" y="406.6" style="fill:#FFFFFF;" width="8" height="8"/>
				<rect x="269.2" y="406.6" style="fill:#FFFFFF;" width="8" height="8"/>
			</g>
			<g>
				<rect x="320" y="396.7" style="fill:#FFFFFF;" width="8" height="8"/>
				<rect x="309.6" y="396.7" style="fill:#FFFFFF;" width="8" height="8"/>
				<rect x="309.6" y="406.6" style="fill:#FFFFFF;" width="8" height="8"/>
				<rect x="320" y="406.6" style="fill:#FFFFFF;" width="8" height="8"/>
			</g>
			<g>
				<rect x="294.6" y="396.7" style="fill:#FFFFFF;" width="8" height="8"/>
				<rect x="284.2" y="396.7" style="fill:#FFFFFF;" width="8" height="8"/>
				<rect x="284.2" y="406.6" style="fill:#FFFFFF;" width="8" height="8"/>
				<rect x="294.6" y="406.6" style="fill:#FFFFFF;" width="8" height="8"/>
			</g>
			<g>
				<rect x="345.4" y="396.7" style="fill:#FFFFFF;" width="8" height="8"/>
				<rect x="335" y="396.7" style="fill:#FFFFFF;" width="8" height="8"/>
				<rect x="335" y="406.6" style="fill:#FFFFFF;" width="8" height="8"/>
				<rect x="345.4" y="406.6" style="fill:#FFFFFF;" width="8" height="8"/>
			</g>
		</g>
		<g>
			<rect x="269.2" y="459.1" style="fill:#FFFFFF;" width="8" height="8"/>
			<rect x="258.8" y="459.1" style="fill:#FFFFFF;" width="8" height="8"/>
			<rect x="258.8" y="469" style="fill:#FFFFFF;" width="8" height="8"/>
			<rect x="269.2" y="469" style="fill:#FFFFFF;" width="8" height="8"/>
		</g>
		<g>
			<g>
				<rect x="269.2" y="428.5" style="fill:#FFFFFF;" width="8" height="8"/>
				<rect x="258.8" y="428.5" style="fill:#FFFFFF;" width="8" height="8"/>
				<rect x="258.8" y="438.5" style="fill:#FFFFFF;" width="8" height="8"/>
				<rect x="269.2" y="438.5" style="fill:#FFFFFF;" width="8" height="8"/>
			</g>
			<g>
				<rect x="320" y="428.5" style="fill:#FFFFFF;" width="8" height="8"/>
				<rect x="309.6" y="428.5" style="fill:#FFFFFF;" width="8" height="8"/>
				<rect x="309.6" y="438.5" style="fill:#FFFFFF;" width="8" height="8"/>
				<rect x="320" y="438.5" style="fill:#FFFFFF;" width="8" height="8"/>
			</g>
			<g>
				<rect x="294.6" y="428.5" style="fill:#FFFFFF;" width="8" height="8"/>
				<rect x="284.2" y="428.5" style="fill:#FFFFFF;" width="8" height="8"/>
				<rect x="284.2" y="438.5" style="fill:#FFFFFF;" width="8" height="8"/>
				<rect x="294.6" y="438.5" style="fill:#FFFFFF;" width="8" height="8"/>
			</g>
			<g>
				<rect x="345.4" y="428.5" style="fill:#FFFFFF;" width="8" height="8"/>
				<rect x="335" y="428.5" style="fill:#FFFFFF;" width="8" height="8"/>
				<rect x="335" y="438.5" style="fill:#FFFFFF;" width="8" height="8"/>
				<rect x="345.4" y="438.5" style="fill:#FFFFFF;" width="8" height="8"/>
			</g>
		</g>
		<g>
			<rect x="345.4" y="459.1" style="fill:#FFFFFF;" width="8" height="8"/>
			<rect x="335" y="459.1" style="fill:#FFFFFF;" width="8" height="8"/>
			<rect x="335" y="469" style="fill:#FFFFFF;" width="8" height="8"/>
			<rect x="345.4" y="469" style="fill:#FFFFFF;" width="8" height="8"/>
		</g>
		<rect x="291.9" y="458.9" style="fill:#FFFFFF;" width="28.2" height="36.4"/>
	</g>
	<g>
		
			<text transform="matrix(1 0 0 1 201.0219 526.4926)" style="fill:#FF3334; font-family:'Raleway-Black'; font-size:18.85px; letter-spacing:1;">MOSSACK FONSECA</text>
	</g>
	<rect x="207.4" y="540.7" style="fill:none;" width="197.4" height="75.6"/>
	<text transform="matrix(1 0 0 1 250.6249 551.5912)"><tspan x="0" y="0" style="fill:#808080; font-family:'Raleway-Medium'; font-size:14.95px;">SPECIALIZES IN</tspan><tspan x="-24.9" y="17.9" style="fill:#808080; font-family:'Raleway-Medium'; font-size:14.95px;"> CREATING OFFSHORE </tspan><tspan x="11.8" y="35.9" style="fill:#808080; font-family:'Raleway-Medium'; font-size:14.95px;">COMPANIES</tspan><tspan x="19.2" y="53.8" style="fill:#F24141; font-family:'Raleway-Medium'; font-size:14.95px;">(PANAMA)</tspan></text>
</g>
<g>
	<g>
		
			<text transform="matrix(1 0 0 1 30.0303 777.0482)" style="fill:#FF3334; font-family:'Raleway-Black'; font-size:18.85px; letter-spacing:1;">SATRA COMPANY LTD </text>
	</g>
	<rect x="42.5" y="791.2" style="fill:none;" width="208.1" height="75.6"/>
	<text transform="matrix(1 0 0 1 60.0195 802.1469)"><tspan x="0" y="0" style="fill:#808080; font-family:'Raleway-Medium'; font-size:14.95px;"> SHELL COMPANY WITH </tspan><tspan x="1.5" y="17.9" style="fill:#808080; font-family:'Raleway-Medium'; font-size:14.95px;">BEARER SHARES AND A </tspan><tspan x="5.4" y="35.9" style="fill:#808080; font-family:'Raleway-Medium'; font-size:14.95px;">BOARD OF DIRECTORS </tspan><tspan x="-6.5" y="53.8" style="fill:#F24141; font-family:'Raleway-Medium'; font-size:14.95px;">(BRITISH VIRGIN ISLANDS)</tspan></text>
	<g>
		<path style="fill:#BFBFBF;" d="M114,645.1c-1.8,0.9-3.6,1.9-5.5,2.8c-3.6,1.7-7.4,3.1-10.8,5.1c-1.9,1.1-3.7,3-4.7,4.9
			c-1.4,2.7-2.2,5.9-2.8,8.9c-0.3,1.4,0.2,3.2,0.8,4.6c0.2,0.5,2.3,0.9,2.8,0.5c4.6-4,10-4.7,15.8-4.5c3.2,0.1,6.4,0,10.6,0
			c-3.5-3.1-2.4-5.7-1.5-8.5c1-3.1,1.7-6.2,2.5-9.4c0.8-3.1,3.3-2,5.3-2.3c2-0.3,3,0.7,3.5,2.5c0.8,3.1,1.8,6.2,2.6,9.3
			c0.7,2.6,1.9,5.4-1.8,8.2c4.8,0,8.5,0.1,12.2-0.1c0.5,0,1.3-1.3,1.3-2c0.1-4.9,0.2-9.8,0-14.6c0-1-1.1-2.1-2.1-2.7
			c-1.7-1.1-3.6-1.9-5.4-2.9c0.2-0.4,0.3-0.8,0.5-1.2c2.2,0.7,4.3,1.4,6.4,2.1c0.3-0.3,0.5-0.5,0.5-0.6c0.6-5.1,0.6-5.1,5.9-5.1
			c4.2,0,8.4,0,12.8,0c-0.5-2.8-2.4-3-4-2.4c-3.9,1.3-4.8-0.6-5.3-3.9c-1.3-8.9-1.9-17.7,2.6-25.9c3.5-6.4,8.9-10.8,16.1-11
			c7.2-0.2,14.6,1.2,19.6,7.4c1.4,1.8,2.7,4.2,2.9,6.4c0.4,7.2,0.2,14.4,0.1,21.7c0,2.2-1.6,3.2-3.6,4c-2.9,1.2-6.1,2.3-8.4,4.4
			c-1.5,1.3-1.9,4.1-2.1,6.4c-0.1,0.9,1.7,2.5,2.9,2.8c4.4,1.1,8.9,1.6,13.3,2.8c1.7,0.5,3.5,1.7,4.7,3.1c1.5,1.8,2.4,4.1,3.4,6.2
			c2.4,5.5-1.2,10.9-7.6,11.3c-1.9,0.1-3.9,0-6.4,0c4.2,7,2.6,14.1,2.7,21c0.2,10.2,0,20.4,0.1,30.5c0,2.8-0.8,3.8-3.7,3.7
			c-11.8-0.1-23.6,0-35.4-0.1c-2.9,0-3.8,1-3.7,3.8c0.1,5.5-0.1,11,0.1,16.6c0,2.4-0.9,3.3-3.3,3.2c-4-0.1-8-0.1-12,0
			c-2.4,0.1-3.2-0.8-3.2-3.2c0.1-6.6,0-13.2,0-20.2c-1.6,0-2.8,0-4.1,0c-12.3,0-24.7-0.1-37,0.1c-2.8,0-3.8-0.7-3.8-3.6
			c0.1-12.8-0.1-25.6,0.2-38.3c0.1-3.3,1.6-6.6,2.3-10c0.2-1.1,0.2-2.5-0.3-3.3c-1.6-2.5-2.4-5-1.4-7.9c1-3,1.7-6.1,3-8.9
			c0.8-1.7,2.3-3.6,4-4.5c5.3-2.8,10.9-5.3,16.4-7.8c0.6-0.3,1.3-0.2,2-0.3C113.8,644.4,113.9,644.7,114,645.1z M120.3,725.2
			c0.2-0.5,0.4-0.7,0.4-0.9c0-13.3,0.5-26.6-0.1-39.9c-0.4-9.1-7.1-14.1-15.2-14c-8.4,0.1-14.5,6.9-14.5,15.2c0,12,0,24,0,36.1
			c0,1.1,0.1,2.3,0.2,3.6C101,725.2,110.6,725.2,120.3,725.2z M160.6,659c1.8,8.5,1.8,8.4,9.2,8.5c6.2,0.1,12.6-1,18.2,3.1
			c0.4,0.3,1.3,0.2,1.9,0.2c2.8,0,5.6-0.1,8.4,0c3.3,0.2,4.4-1.9,4.9-4.4c0.7-3.2-3-10.5-6.2-11.2c-6.4-1.4-12.9-5.3-19.7-0.4
			c-1.2,0.8-3.3,0.4-4.9,0.6c-0.7,0.1-1.4,0.2-2.4,0.3c0.6,1.2,1,2.1,1.6,3.5C167.8,659,164.3,659,160.6,659z M181.6,632.1
			c-0.4-4.1-0.6-8-1.3-11.8c-0.6-3.6-1.3-3.6-4.9-2.9c-2.9,0.6-6.1,1.3-8.7,0.4c-2.7-0.9-4.1-0.4-5.7,1.5c-1.2,1.4-2.1,2.5-1.4,4.6
			c0.6,1.8,0.6,3.8,0.9,5.7c0.8,6.5,4.4,10.2,10.6,10.8c0.2,2.4,0.2,2.4,2.5,2.4c7.9,0.2,14.2-8.5,11.6-16.4
			C183.8,628.4,182.8,630.2,181.6,632.1z M144.2,682.8c-5.5,0.3-8.5,4.1-8.4,10c0.1,5.1,3.9,9,8.9,9.2c6.6,0.2,10.8-3.3,11.2-9.4
			c0.3-4.8-3.2-9.1-8.4-9.7c0,2.7,0.2,5.4-0.1,8c-0.1,0.9-1.2,1.7-1.8,2.6c-0.5-0.9-1.2-1.7-1.3-2.6
			C144.1,688.1,144.2,685.4,144.2,682.8z M137.3,728.5l0.1,21.9c0,0,0,0,0,0c2.8,0,11.1,0,11.2-0.1l0-3.5l-6,0.1v-3l6,0l-0.1-3.1
			l-6,0.1v-3l6.1,0l0-2.8l-6.1-0.1v-3.4l6.3,0l0-2.9C148.8,728.5,137.3,728.5,137.3,728.5z M161,667.5c-0.8-2.5-1.2-4.5-2-6.4
			c-0.3-0.8-1.1-1.9-1.8-1.9c-3.2-0.2-6.4-0.1-9.8-0.1c0,2.4-0.2,4.4,0.1,6.2c0.1,0.8,1.3,2,2,2C153.2,667.6,156.8,667.5,161,667.5z
			 M169.2,644.5c2,2.7-3.2,5.1,0.4,7.5c2.7,1.8,6,2,8.6,0.2c3.5-2.4-2-5.1,0.4-7.7C175.3,644.5,172.7,644.5,169.2,644.5z"/>
		<path style="fill:#BFBFBF;" d="M126.1,643.5c-6.3,0-9.7-3.8-13-7.5c-0.9-1-1.7-2.2-2.3-3.5c-1.1-2.6-2.5-4.6-5.3-6
			c-3.6-1.8-3.7-6.1-0.3-8.7c1.4-1.1,1.8-1.9,1.4-3.7c-0.8-4.3,1.6-7.9,4.1-10.9c6-7.3,8.9-7.7,18.2-5.3c1.7,0.4,3.2,1.2,4.9,1.5
			c5.8,1,8.8,8.5,9.5,13.3c0.3,2.2,0.3,4,2.5,5.5c2.6,1.8,2.9,6.3,0.4,7.5c-4.5,2.2-5.9,6.6-8.7,10
			C134.4,639.8,131,643.3,126.1,643.5z M122.7,616.7c-0.2,0.3-0.4,0.7-0.5,1c1.8,1.6,3.6,3.1,5.5,4.9c-7.3,0.1-12.3-4.2-17.5-9
			c-1.1,8-0.6,14.6,3.8,20.4c6.1,8,12.5,10.6,19.6,3.6c4.3-4.3,7.6-9.3,7.3-15.4C134.5,620.2,128.6,618.5,122.7,616.7z M107.8,625.3
			c-0.2-2.3-0.3-4.1-0.4-6.3C103.8,621.9,103.9,623.4,107.8,625.3z"/>
		<g>
			<path style="fill:#BFBFBF;" d="M173.5,691.3h-10.2c0,0,0,13.3,0,18.7c0,4.2,10.2,8.4,10.2,8.4s10.2-4.2,10.2-8.4
				c0-5.4,0-18.7,0-18.7H173.5z"/>
			<path style="fill:#FFFFFF;" d="M167.5,705.6c0,0-0.1-0.2,0-0.4c0.1-0.2-0.1-0.3-0.1-0.5c-0.1-0.4,0.3-0.5,0.3-0.9
				c0,0,0.3,0.3,0.2,0.5c-0.1,0.2,0.1,0.3,0.1,0.5c0,0.2-0.3,0.5-0.3,0.7L167.5,705.6z"/>
			<path style="fill:#DBDBDB;" d="M171.6,705.2c-0.2-0.3-0.6,0-0.8,0.2c0,0-0.1,0.1-0.1,0.1l-1-1.5c0,0,0-0.1,0-0.1
				c0-0.1-0.1-0.3-0.3-0.3s-0.3,0.1-0.3,0.3c0,0.1,0,0.1,0,0.1l-1,1.5h-0.7c0,0,0,0.5,0.8,0.5c0.1,0.2,0.2,0.3,0.4,0.3
				c-0.1,0-0.1,0.1-0.1,0.2v0.1c0,0,0,0,0,0h1.8c0,0,0,0,0,0v-0.1c0-0.1-0.1-0.2-0.2-0.2c0.3-0.1,0.5-0.4,0.6-0.8c0,0,0.1,0,0.1-0.1
				c0.2-0.1,0.5-0.4,0.6-0.3c0,0,0,0,0,0.1c0,0.1-0.2,0.2-0.3,0.2c-0.2,0.1-0.4,0.3-0.4,0.4c0,0.1,0,0.1,0.1,0.1c0,0,0,0,0,0
				c0,0,0.1,0,0.1-0.1c0-0.1,0.2-0.2,0.3-0.3c0.2-0.1,0.3-0.2,0.4-0.4C171.6,705.3,171.6,705.2,171.6,705.2z M169.9,705.5
				c-0.1-0.2-0.2-0.4-0.3-0.5c0.1,0,0.1-0.1,0.1-0.2c0-0.1-0.1-0.3-0.3-0.3c-0.1,0-0.3,0.1-0.3,0.3c0,0.1,0.1,0.2,0.1,0.2
				c-0.2,0.1-0.3,0.3-0.3,0.5h-0.5l0.9-1.4c0,0,0,0,0.1,0s0,0,0.1,0l0.9,1.4H169.9z"/>
			<path style="fill:#FFFFFF;" d="M172.9,696.6c0,0-1-0.3-1.4,3.1c0,0-2.3,3-2.4,3.1c-0.1,0.2,0,1.4,0.2,1.3
				c0.3-0.1,0.7-0.7,0.7-1.1s0.2-0.7,0.4-0.9c0.4-0.4,2.4-2.2,2.4-2.6C172.9,699.2,172.9,696.6,172.9,696.6z"/>
			<g>
				<path style="fill:#F5F5F5;" d="M174.4,696c0,0,1.5-0.2,1.9,1.3c0,0-1.2,0.7-1.1,1.5c0.2,0.9,0,4.8,0,4.8
					c-2.3,0.8-3.5-0.2-3.5-0.2s0.6-2.2,0.5-4.1c0,0-0.5-0.4-0.4-0.9c0.1-0.5,0.5-1,0.6-1.4c0.1-0.4,0.4-1.1,1.1-1.1
					S174.4,696,174.4,696z"/>
				<path style="fill:#F5F5F5;" d="M172.1,703c0,0-1.2,4.4-0.8,10.3c0,0,3.6,0.5,5.6-0.2c0,0-1-7.1-2-9.9L172.1,703z"/>
			</g>
			<path style="fill:#FFFFFF;" d="M172.7,693.4v1.8c0,0.2,0.2,0.4,0.4,0.4h0c0.1,0,0.3,0.1,0.3,0.3v0.4c0,0,0.2,0.6,1.2-0.1v-2.7
				L172.7,693.4z"/>
			<path style="fill:#CACACA;" d="M172.5,693.1c-0.1,0.1,0,0.5,0.4,0.5c0.5,0,1,0,1.1,0.5c0.1,0.5,0,1.6,0.5,1.7s1.1-0.3,1.1-1.3
				c0-0.9-0.6-1.9-1.4-1.8c0,0-0.7-0.5-1.1,0.1C173.1,692.8,172.7,692.7,172.5,693.1z"/>
			<path style="fill:#FFFFFF;" d="M176.3,697.3c0,0,0.5,3.4,0.5,3.7c0,0.3-1.8,3.1-1.7,3.4c0.1,0.3,0.2,0.7-0.4,0.9
				c-0.6,0.2-0.5-0.7-0.3-1.2c0.2-0.5,1.4-2.9,1.4-3.1c0-0.3-0.7-2.1-0.5-2.8C175.4,697.4,176.3,697.3,176.3,697.3z"/>
			<path style="fill:#FFFFFF;" d="M165.3,694.9c0,0-0.1-0.2,0-0.4c0.1-0.2-0.1-0.3-0.1-0.5c-0.1-0.4,0.3-0.5,0.3-0.9
				c0,0,0.3,0.3,0.2,0.5c-0.1,0.2,0.1,0.3,0.1,0.5s-0.3,0.5-0.3,0.7L165.3,694.9z"/>
			<path style="fill:#DBDBDB;" d="M169.3,694.5c-0.2-0.3-0.6,0-0.8,0.2c0,0-0.1,0.1-0.1,0.1l-1-1.5c0,0,0-0.1,0-0.1
				c0-0.1-0.1-0.3-0.3-0.3s-0.3,0.1-0.3,0.3c0,0.1,0,0.1,0,0.1l-1,1.5h-0.7c0,0,0,0.5,0.8,0.5c0.1,0.2,0.2,0.3,0.4,0.3
				c-0.1,0-0.1,0.1-0.1,0.2v0.1c0,0,0,0,0,0h1.8c0,0,0,0,0,0v-0.1c0-0.1-0.1-0.2-0.2-0.2c0.3-0.1,0.5-0.4,0.6-0.8c0,0,0.1,0,0.1-0.1
				c0.2-0.1,0.5-0.4,0.6-0.3c0,0,0,0,0,0.1c0,0.1-0.2,0.2-0.3,0.2c-0.2,0.1-0.4,0.3-0.4,0.4c0,0.1,0,0.1,0.1,0.1c0,0,0,0,0,0
				c0,0,0.1,0,0.1-0.1c0-0.1,0.2-0.2,0.3-0.3c0.2-0.1,0.3-0.2,0.4-0.4C169.4,694.6,169.3,694.5,169.3,694.5z M167.6,694.8
				c-0.1-0.2-0.2-0.4-0.3-0.5c0.1,0,0.1-0.1,0.1-0.2c0-0.1-0.1-0.3-0.3-0.3s-0.3,0.1-0.3,0.3c0,0.1,0.1,0.2,0.1,0.2
				c-0.2,0.1-0.3,0.3-0.3,0.5h-0.5l0.9-1.4c0,0,0,0,0.1,0c0,0,0,0,0.1,0l0.9,1.4H167.6z"/>
			<path style="fill:#FFFFFF;" d="M165.3,698.4c0,0-0.1-0.2,0-0.4c0.1-0.2-0.1-0.3-0.1-0.5c-0.1-0.4,0.3-0.5,0.3-0.9
				c0,0,0.3,0.3,0.2,0.5s0.1,0.3,0.1,0.5s-0.3,0.5-0.3,0.7L165.3,698.4z"/>
			<path style="fill:#DBDBDB;" d="M169.3,698c-0.2-0.3-0.6,0-0.8,0.2c0,0-0.1,0.1-0.1,0.1l-1-1.5c0,0,0-0.1,0-0.1
				c0-0.1-0.1-0.3-0.3-0.3s-0.3,0.1-0.3,0.3c0,0.1,0,0.1,0,0.1l-1,1.5h-0.7c0,0,0,0.5,0.8,0.5c0.1,0.2,0.2,0.3,0.4,0.3
				c-0.1,0-0.1,0.1-0.1,0.2v0.1c0,0,0,0,0,0h1.8c0,0,0,0,0,0v-0.1c0-0.1-0.1-0.2-0.2-0.2c0.3-0.1,0.5-0.4,0.6-0.8c0,0,0.1,0,0.1-0.1
				c0.2-0.1,0.5-0.4,0.6-0.3c0,0,0,0,0,0.1c0,0.1-0.2,0.2-0.3,0.2c-0.2,0.1-0.4,0.3-0.4,0.4c0,0.1,0,0.1,0.1,0.1c0,0,0,0,0,0
				c0,0,0.1,0,0.1-0.1c0-0.1,0.2-0.2,0.3-0.3c0.2-0.1,0.3-0.2,0.4-0.4C169.4,698.2,169.3,698.1,169.3,698z M167.6,698.4
				c-0.1-0.2-0.2-0.4-0.3-0.5c0.1,0,0.1-0.1,0.1-0.2c0-0.1-0.1-0.3-0.3-0.3s-0.3,0.1-0.3,0.3c0,0.1,0.1,0.2,0.1,0.2
				c-0.2,0.1-0.3,0.3-0.3,0.5h-0.5l0.9-1.4c0,0,0,0,0.1,0c0,0,0,0,0.1,0l0.9,1.4H167.6z"/>
			<path style="fill:#FFFFFF;" d="M165.3,702c0,0-0.1-0.2,0-0.4c0.1-0.2-0.1-0.3-0.1-0.5c-0.1-0.4,0.3-0.5,0.3-0.9
				c0,0,0.3,0.3,0.2,0.5c-0.1,0.2,0.1,0.3,0.1,0.5c0,0.2-0.3,0.5-0.3,0.7L165.3,702z"/>
			<path style="fill:#DBDBDB;" d="M169.3,701.6c-0.2-0.3-0.6,0-0.8,0.2c0,0-0.1,0.1-0.1,0.1l-1-1.5c0,0,0-0.1,0-0.1
				c0-0.1-0.1-0.3-0.3-0.3s-0.3,0.1-0.3,0.3c0,0.1,0,0.1,0,0.1l-1,1.5h-0.7c0,0,0,0.5,0.8,0.5c0.1,0.2,0.2,0.3,0.4,0.3
				c-0.1,0-0.1,0.1-0.1,0.2v0.1c0,0,0,0,0,0h1.8c0,0,0,0,0,0V703c0-0.1-0.1-0.2-0.2-0.2c0.3-0.1,0.5-0.4,0.6-0.8c0,0,0.1,0,0.1-0.1
				c0.2-0.1,0.5-0.4,0.6-0.3c0,0,0,0,0,0.1c0,0.1-0.2,0.2-0.3,0.2c-0.2,0.1-0.4,0.3-0.4,0.4c0,0.1,0,0.1,0.1,0.1c0,0,0,0,0,0
				c0,0,0.1,0,0.1-0.1c0-0.1,0.2-0.2,0.3-0.3c0.2-0.1,0.3-0.2,0.4-0.4C169.4,701.7,169.3,701.7,169.3,701.6z M167.6,702
				c-0.1-0.2-0.2-0.4-0.3-0.5c0.1,0,0.1-0.1,0.1-0.2c0-0.1-0.1-0.3-0.3-0.3s-0.3,0.1-0.3,0.3c0,0.1,0.1,0.2,0.1,0.2
				c-0.2,0.1-0.3,0.3-0.3,0.5h-0.5l0.9-1.4c0,0,0,0,0.1,0c0,0,0,0,0.1,0l0.9,1.4H167.6z"/>
			<path style="fill:#FFFFFF;" d="M165.3,709.1c0,0-0.1-0.2,0-0.4c0.1-0.2-0.1-0.3-0.1-0.5c-0.1-0.4,0.3-0.5,0.3-0.9
				c0,0,0.3,0.3,0.2,0.5c-0.1,0.2,0.1,0.3,0.1,0.5s-0.3,0.5-0.3,0.7L165.3,709.1z"/>
			<path style="fill:#DBDBDB;" d="M169.3,708.7c-0.2-0.3-0.6,0-0.8,0.2c0,0-0.1,0.1-0.1,0.1l-1-1.5c0,0,0-0.1,0-0.1
				c0-0.1-0.1-0.3-0.3-0.3s-0.3,0.1-0.3,0.3c0,0.1,0,0.1,0,0.1l-1,1.5h-0.7c0,0,0,0.5,0.8,0.5c0.1,0.2,0.2,0.3,0.4,0.3
				c-0.1,0-0.1,0.1-0.1,0.2v0.1c0,0,0,0,0,0h1.8c0,0,0,0,0,0v-0.1c0-0.1-0.1-0.2-0.2-0.2c0.3-0.1,0.5-0.4,0.6-0.8c0,0,0.1,0,0.1-0.1
				c0.2-0.1,0.5-0.4,0.6-0.3c0,0,0,0,0,0.1c0,0.1-0.2,0.2-0.3,0.2c-0.2,0.1-0.4,0.3-0.4,0.4c0,0.1,0,0.1,0.1,0.1c0,0,0,0,0,0
				c0,0,0.1,0,0.1-0.1c0-0.1,0.2-0.2,0.3-0.3c0.2-0.1,0.3-0.2,0.4-0.4C169.4,708.9,169.3,708.8,169.3,708.7z M167.6,709.1
				c-0.1-0.2-0.2-0.4-0.3-0.5c0.1,0,0.1-0.1,0.1-0.2c0-0.1-0.1-0.3-0.3-0.3s-0.3,0.1-0.3,0.3c0,0.1,0.1,0.2,0.1,0.2
				c-0.2,0.1-0.3,0.3-0.3,0.5h-0.5l0.9-1.4c0,0,0,0,0.1,0c0,0,0,0,0.1,0l0.9,1.4H167.6z"/>
			<path style="fill:#FFFFFF;" d="M165.3,712.7c0,0-0.1-0.2,0-0.4c0.1-0.2-0.1-0.3-0.1-0.5c-0.1-0.4,0.3-0.5,0.3-0.9
				c0,0,0.3,0.3,0.2,0.5c-0.1,0.2,0.1,0.3,0.1,0.5c0,0.2-0.3,0.5-0.3,0.7L165.3,712.7z"/>
			<path style="fill:#DBDBDB;" d="M169.3,712.3c-0.2-0.3-0.6,0-0.8,0.2c0,0-0.1,0.1-0.1,0.1l-1-1.5c0,0,0-0.1,0-0.1
				c0-0.1-0.1-0.3-0.3-0.3s-0.3,0.1-0.3,0.3c0,0.1,0,0.1,0,0.1l-1,1.5h-0.7c0,0,0,0.5,0.8,0.5c0.1,0.2,0.2,0.3,0.4,0.3
				c-0.1,0-0.1,0.1-0.1,0.2v0.1c0,0,0,0,0,0h1.8c0,0,0,0,0,0v-0.1c0-0.1-0.1-0.2-0.2-0.2c0.3-0.1,0.5-0.4,0.6-0.8c0,0,0.1,0,0.1-0.1
				c0.2-0.1,0.5-0.4,0.6-0.3c0,0,0,0,0,0.1c0,0.1-0.2,0.2-0.3,0.2c-0.2,0.1-0.4,0.3-0.4,0.4c0,0.1,0,0.1,0.1,0.1c0,0,0,0,0,0
				c0,0,0.1,0,0.1-0.1c0-0.1,0.2-0.2,0.3-0.3c0.2-0.1,0.3-0.2,0.4-0.4C169.4,712.4,169.3,712.4,169.3,712.3z M167.6,712.6
				c-0.1-0.2-0.2-0.4-0.3-0.5c0.1,0,0.1-0.1,0.1-0.2c0-0.1-0.1-0.3-0.3-0.3s-0.3,0.1-0.3,0.3c0,0.1,0.1,0.2,0.1,0.2
				c-0.2,0.1-0.3,0.3-0.3,0.5h-0.5l0.9-1.4c0,0,0,0,0.1,0c0,0,0,0,0.1,0l0.9,1.4H167.6z"/>
			<path style="fill:#FFFFFF;" d="M177.7,694.9c0,0-0.1-0.2,0-0.4c0.1-0.2-0.1-0.3-0.1-0.5c-0.1-0.4,0.3-0.5,0.3-0.9
				c0,0,0.3,0.3,0.2,0.5c-0.1,0.2,0.1,0.3,0.1,0.5c0,0.2-0.3,0.5-0.3,0.7L177.7,694.9z"/>
			<path style="fill:#DBDBDB;" d="M181.7,694.5c-0.2-0.3-0.6,0-0.8,0.2c0,0-0.1,0.1-0.1,0.1l-1-1.5c0,0,0-0.1,0-0.1
				c0-0.1-0.1-0.3-0.3-0.3s-0.3,0.1-0.3,0.3c0,0.1,0,0.1,0,0.1l-1,1.5h-0.7c0,0,0,0.5,0.8,0.5c0.1,0.2,0.2,0.3,0.4,0.3
				c-0.1,0-0.1,0.1-0.1,0.2v0.1c0,0,0,0,0,0h1.8c0,0,0,0,0,0v-0.1c0-0.1-0.1-0.2-0.2-0.2c0.3-0.1,0.5-0.4,0.6-0.8c0,0,0.1,0,0.1-0.1
				c0.2-0.1,0.5-0.4,0.6-0.3c0,0,0,0,0,0.1c0,0.1-0.2,0.2-0.3,0.2c-0.2,0.1-0.4,0.3-0.4,0.4c0,0.1,0,0.1,0.1,0.1c0,0,0,0,0,0
				c0,0,0.1,0,0.1-0.1c0-0.1,0.2-0.2,0.3-0.3c0.2-0.1,0.3-0.2,0.4-0.4C181.8,694.6,181.7,694.5,181.7,694.5z M180,694.8
				c-0.1-0.2-0.2-0.4-0.3-0.5c0.1,0,0.1-0.1,0.1-0.2c0-0.1-0.1-0.3-0.3-0.3s-0.3,0.1-0.3,0.3c0,0.1,0.1,0.2,0.1,0.2
				c-0.2,0.1-0.3,0.3-0.3,0.5h-0.5l0.9-1.4c0,0,0,0,0.1,0c0,0,0,0,0.1,0l0.9,1.4H180z"/>
			<path style="fill:#FFFFFF;" d="M177.7,698.4c0,0-0.1-0.2,0-0.4c0.1-0.2-0.1-0.3-0.1-0.5c-0.1-0.4,0.3-0.5,0.3-0.9
				c0,0,0.3,0.3,0.2,0.5s0.1,0.3,0.1,0.5c0,0.2-0.3,0.5-0.3,0.7L177.7,698.4z"/>
			<path style="fill:#DBDBDB;" d="M181.7,698c-0.2-0.3-0.6,0-0.8,0.2c0,0-0.1,0.1-0.1,0.1l-1-1.5c0,0,0-0.1,0-0.1
				c0-0.1-0.1-0.3-0.3-0.3s-0.3,0.1-0.3,0.3c0,0.1,0,0.1,0,0.1l-1,1.5h-0.7c0,0,0,0.5,0.8,0.5c0.1,0.2,0.2,0.3,0.4,0.3
				c-0.1,0-0.1,0.1-0.1,0.2v0.1c0,0,0,0,0,0h1.8c0,0,0,0,0,0v-0.1c0-0.1-0.1-0.2-0.2-0.2c0.3-0.1,0.5-0.4,0.6-0.8c0,0,0.1,0,0.1-0.1
				c0.2-0.1,0.5-0.4,0.6-0.3c0,0,0,0,0,0.1c0,0.1-0.2,0.2-0.3,0.2c-0.2,0.1-0.4,0.3-0.4,0.4c0,0.1,0,0.1,0.1,0.1c0,0,0,0,0,0
				c0,0,0.1,0,0.1-0.1c0-0.1,0.2-0.2,0.3-0.3c0.2-0.1,0.3-0.2,0.4-0.4C181.8,698.2,181.7,698.1,181.7,698z M180,698.4
				c-0.1-0.2-0.2-0.4-0.3-0.5c0.1,0,0.1-0.1,0.1-0.2c0-0.1-0.1-0.3-0.3-0.3s-0.3,0.1-0.3,0.3c0,0.1,0.1,0.2,0.1,0.2
				c-0.2,0.1-0.3,0.3-0.3,0.5h-0.5l0.9-1.4c0,0,0,0,0.1,0c0,0,0,0,0.1,0l0.9,1.4H180z"/>
			<path style="fill:#FFFFFF;" d="M177.7,702c0,0-0.1-0.2,0-0.4c0.1-0.2-0.1-0.3-0.1-0.5c-0.1-0.4,0.3-0.5,0.3-0.9
				c0,0,0.3,0.3,0.2,0.5c-0.1,0.2,0.1,0.3,0.1,0.5c0,0.2-0.3,0.5-0.3,0.7L177.7,702z"/>
			<path style="fill:#DBDBDB;" d="M181.7,701.6c-0.2-0.3-0.6,0-0.8,0.2c0,0-0.1,0.1-0.1,0.1l-1-1.5c0,0,0-0.1,0-0.1
				c0-0.1-0.1-0.3-0.3-0.3s-0.3,0.1-0.3,0.3c0,0.1,0,0.1,0,0.1l-1,1.5h-0.7c0,0,0,0.5,0.8,0.5c0.1,0.2,0.2,0.3,0.4,0.3
				c-0.1,0-0.1,0.1-0.1,0.2v0.1c0,0,0,0,0,0h1.8c0,0,0,0,0,0V703c0-0.1-0.1-0.2-0.2-0.2c0.3-0.1,0.5-0.4,0.6-0.8c0,0,0.1,0,0.1-0.1
				c0.2-0.1,0.5-0.4,0.6-0.3c0,0,0,0,0,0.1c0,0.1-0.2,0.2-0.3,0.2c-0.2,0.1-0.4,0.3-0.4,0.4c0,0.1,0,0.1,0.1,0.1c0,0,0,0,0,0
				c0,0,0.1,0,0.1-0.1c0-0.1,0.2-0.2,0.3-0.3c0.2-0.1,0.3-0.2,0.4-0.4C181.8,701.7,181.7,701.7,181.7,701.6z M180,702
				c-0.1-0.2-0.2-0.4-0.3-0.5c0.1,0,0.1-0.1,0.1-0.2c0-0.1-0.1-0.3-0.3-0.3s-0.3,0.1-0.3,0.3c0,0.1,0.1,0.2,0.1,0.2
				c-0.2,0.1-0.3,0.3-0.3,0.5h-0.5l0.9-1.4c0,0,0,0,0.1,0c0,0,0,0,0.1,0l0.9,1.4H180z"/>
			<path style="fill:#FFFFFF;" d="M177.7,705.6c0,0-0.1-0.2,0-0.4c0.1-0.2-0.1-0.3-0.1-0.5c-0.1-0.4,0.3-0.5,0.3-0.9
				c0,0,0.3,0.3,0.2,0.5c-0.1,0.2,0.1,0.3,0.1,0.5c0,0.2-0.3,0.5-0.3,0.7L177.7,705.6z"/>
			<path style="fill:#DBDBDB;" d="M181.7,705.2c-0.2-0.3-0.6,0-0.8,0.2c0,0-0.1,0.1-0.1,0.1l-1-1.5c0,0,0-0.1,0-0.1
				c0-0.1-0.1-0.3-0.3-0.3s-0.3,0.1-0.3,0.3c0,0.1,0,0.1,0,0.1l-1,1.5h-0.7c0,0,0,0.5,0.8,0.5c0.1,0.2,0.2,0.3,0.4,0.3
				c-0.1,0-0.1,0.1-0.1,0.2v0.1c0,0,0,0,0,0h1.8c0,0,0,0,0,0v-0.1c0-0.1-0.1-0.2-0.2-0.2c0.3-0.1,0.5-0.4,0.6-0.8c0,0,0.1,0,0.1-0.1
				c0.2-0.1,0.5-0.4,0.6-0.3c0,0,0,0,0,0.1c0,0.1-0.2,0.2-0.3,0.2c-0.2,0.1-0.4,0.3-0.4,0.4c0,0.1,0,0.1,0.1,0.1c0,0,0,0,0,0
				c0,0,0.1,0,0.1-0.1c0-0.1,0.2-0.2,0.3-0.3c0.2-0.1,0.3-0.2,0.4-0.4C181.8,705.3,181.7,705.2,181.7,705.2z M180,705.5
				c-0.1-0.2-0.2-0.4-0.3-0.5c0.1,0,0.1-0.1,0.1-0.2c0-0.1-0.1-0.3-0.3-0.3s-0.3,0.1-0.3,0.3c0,0.1,0.1,0.2,0.1,0.2
				c-0.2,0.1-0.3,0.3-0.3,0.5h-0.5l0.9-1.4c0,0,0,0,0.1,0c0,0,0,0,0.1,0l0.9,1.4H180z"/>
			<path style="fill:#FFFFFF;" d="M177.7,709.1c0,0-0.1-0.2,0-0.4c0.1-0.2-0.1-0.3-0.1-0.5c-0.1-0.4,0.3-0.5,0.3-0.9
				c0,0,0.3,0.3,0.2,0.5c-0.1,0.2,0.1,0.3,0.1,0.5c0,0.2-0.3,0.5-0.3,0.7L177.7,709.1z"/>
			<path style="fill:#DBDBDB;" d="M181.7,708.7c-0.2-0.3-0.6,0-0.8,0.2c0,0-0.1,0.1-0.1,0.1l-1-1.5c0,0,0-0.1,0-0.1
				c0-0.1-0.1-0.3-0.3-0.3s-0.3,0.1-0.3,0.3c0,0.1,0,0.1,0,0.1l-1,1.5h-0.7c0,0,0,0.5,0.8,0.5c0.1,0.2,0.2,0.3,0.4,0.3
				c-0.1,0-0.1,0.1-0.1,0.2v0.1c0,0,0,0,0,0h1.8c0,0,0,0,0,0v-0.1c0-0.1-0.1-0.2-0.2-0.2c0.3-0.1,0.5-0.4,0.6-0.8c0,0,0.1,0,0.1-0.1
				c0.2-0.1,0.5-0.4,0.6-0.3c0,0,0,0,0,0.1c0,0.1-0.2,0.2-0.3,0.2c-0.2,0.1-0.4,0.3-0.4,0.4c0,0.1,0,0.1,0.1,0.1c0,0,0,0,0,0
				c0,0,0.1,0,0.1-0.1c0-0.1,0.2-0.2,0.3-0.3c0.2-0.1,0.3-0.2,0.4-0.4C181.8,708.9,181.7,708.8,181.7,708.7z M180,709.1
				c-0.1-0.2-0.2-0.4-0.3-0.5c0.1,0,0.1-0.1,0.1-0.2c0-0.1-0.1-0.3-0.3-0.3s-0.3,0.1-0.3,0.3c0,0.1,0.1,0.2,0.1,0.2
				c-0.2,0.1-0.3,0.3-0.3,0.5h-0.5l0.9-1.4c0,0,0,0,0.1,0c0,0,0,0,0.1,0l0.9,1.4H180z"/>
			<path style="fill:#FFFFFF;" d="M177.7,712.7c0,0-0.1-0.2,0-0.4c0.1-0.2-0.1-0.3-0.1-0.5c-0.1-0.4,0.3-0.5,0.3-0.9
				c0,0,0.3,0.3,0.2,0.5c-0.1,0.2,0.1,0.3,0.1,0.5c0,0.2-0.3,0.5-0.3,0.7L177.7,712.7z"/>
			<path style="fill:#DBDBDB;" d="M181.7,712.3c-0.2-0.3-0.6,0-0.8,0.2c0,0-0.1,0.1-0.1,0.1l-1-1.5c0,0,0-0.1,0-0.1
				c0-0.1-0.1-0.3-0.3-0.3s-0.3,0.1-0.3,0.3c0,0.1,0,0.1,0,0.1l-1,1.5h-0.7c0,0,0,0.5,0.8,0.5c0.1,0.2,0.2,0.3,0.4,0.3
				c-0.1,0-0.1,0.1-0.1,0.2v0.1c0,0,0,0,0,0h1.8c0,0,0,0,0,0v-0.1c0-0.1-0.1-0.2-0.2-0.2c0.3-0.1,0.5-0.4,0.6-0.8c0,0,0.1,0,0.1-0.1
				c0.2-0.1,0.5-0.4,0.6-0.3c0,0,0,0,0,0.1c0,0.1-0.2,0.2-0.3,0.2c-0.2,0.1-0.4,0.3-0.4,0.4c0,0.1,0,0.1,0.1,0.1c0,0,0,0,0,0
				c0,0,0.1,0,0.1-0.1c0-0.1,0.2-0.2,0.3-0.3c0.2-0.1,0.3-0.2,0.4-0.4C181.8,712.4,181.7,712.4,181.7,712.3z M180,712.6
				c-0.1-0.2-0.2-0.4-0.3-0.5c0.1,0,0.1-0.1,0.1-0.2c0-0.1-0.1-0.3-0.3-0.3s-0.3,0.1-0.3,0.3c0,0.1,0.1,0.2,0.1,0.2
				c-0.2,0.1-0.3,0.3-0.3,0.5h-0.5l0.9-1.4c0,0,0,0,0.1,0c0,0,0,0,0.1,0l0.9,1.4H180z"/>
			<g>
				<path style="fill:#F5F5F5;" d="M183.8,691.3c0,0,0,13.3,0,18.7c0,4.2-10.2,8.4-10.2,8.4s-10.2-4.2-10.2-8.4c0-5.4,0-18.7,0-18.7
					h10.2H183.8 M184.4,690.7h-0.6h-10.2h-10.2h-0.6v0.6V710c0,2,1.8,4.1,5.4,6.3c2.6,1.6,5.1,2.6,5.2,2.7l0.2,0.1l0.2-0.1
					c0.1,0,2.6-1.1,5.2-2.7c3.6-2.2,5.4-4.3,5.4-6.3v-18.7V690.7L184.4,690.7z"/>
				<path style="fill:#F5F5F5;" d="M184.5,713.3l2.7,1.9c-3.2,4.1-8.1,6.7-13.7,6.7c-5.5,0-10.5-2.6-13.7-6.7l2.7-1.9
					c2.6,3.2,6.5,5.3,10.9,5.3C177.9,718.6,181.9,716.5,184.5,713.3 M184.3,712.5l-0.4,0.4c-2.6,3.2-6.4,5-10.5,5
					c-4.1,0-7.9-1.8-10.5-5l-0.4-0.4l-0.5,0.3l-2.7,1.9l-0.5,0.4l0.4,0.5c3.4,4.4,8.6,6.9,14.1,6.9s10.7-2.5,14.1-6.9l0.4-0.5
					l-0.5-0.4l-2.7-1.9L184.3,712.5L184.3,712.5z"/>
			</g>
			<path style="fill:#BFBFBF;" d="M173.5,721.9c5.5,0,10.5-2.6,13.7-6.7l-2.7-1.9c-2.6,3.2-6.5,5.3-10.9,5.3s-8.4-2.1-10.9-5.3
				l-2.7,1.9C163,719.3,168,721.9,173.5,721.9z"/>
		</g>
	</g>
</g>
<g>
	<g>
		
			<text transform="matrix(1 0 0 1 384.8863 777.0482)" style="fill:#FF3334; font-family:'Raleway-Black'; font-size:18.85px; letter-spacing:1;">BANK ACCOUNT</text>
	</g>
	<rect x="382.4" y="791.2" style="fill:none;" width="175.2" height="75.6"/>
	<text transform="matrix(1 0 0 1 388.8697 802.1469)"><tspan x="0" y="0" style="fill:#808080; font-family:'Raleway-Medium'; font-size:14.95px;">OPEN ACCOUNT WITH </tspan><tspan x="5.4" y="17.9" style="fill:#808080; font-family:'Raleway-Medium'; font-size:14.95px;">THE UNION BANK OF </tspan><tspan x="6.1" y="35.9" style="fill:#808080; font-family:'Raleway-Medium'; font-size:14.95px;">SWITZERLAND (UBS)  </tspan><tspan x="23.2" y="53.8" style="fill:#F24141; font-family:'Raleway-Medium'; font-size:14.95px;">(SWITZERLAND)</tspan></text>
	<g>
		<path style="fill:#919191;" d="M469.6,633.3c24.9,0,49.7,0,74.6,0c5.1,0,5.4-0.3,4.8-5.3c-0.1-0.9-1-2-1.9-2.5
			c-2-1.2-4.3-2-6.4-3.1c-13.3-6.3-26.7-12.7-40-19c-9-4.3-18.1-8.3-26.9-12.8c-3.1-1.6-5.7-1.2-8.4,0.4c-0.7,0.4-1.3,0.9-1.9,1.2
			c-13.7,6.4-27.4,12.8-41.1,19.2c-9.7,4.5-19.3,9.2-29.1,13.6c-3.5,1.5-2.4,4.3-2.3,6.6c0.2,2.7,2.6,1.7,4.1,1.7
			C419.9,633.3,444.7,633.3,469.6,633.3z"/>
		<path style="fill:#BFBFBF;" d="M469.6,633.3c-24.9,0-49.7,0-74.6,0c-1.5,0-4,1-4.1-1.7c-0.1-2.4-1.2-5.1,2.3-6.6
			c9.8-4.4,19.4-9,29.1-13.6c13.7-6.4,27.4-12.8,41.1-19.2c0.7-0.3,1.3-0.8,1.9-1.2c2.7-1.6,5.3-2,8.4-0.4
			c8.9,4.5,17.9,8.5,26.9,12.8c13.4,6.3,26.7,12.7,40,19c2.1,1,4.4,1.9,6.4,3.1c0.8,0.5,1.8,1.6,1.9,2.5c0.6,5,0.3,5.3-4.8,5.3
			C519.3,633.3,494.4,633.3,469.6,633.3z"/>
		<path style="fill:#BFBFBF;" d="M469.8,731.6c-22.9,0-45.8,0-68.7,0c-4.5,0-5.1-0.7-4.3-5.1c0.1-0.8,1.1-1.5,1.9-2
			c0.5-0.3,1.3-0.1,1.9-0.1c46.2,0,92.5,0,138.7-0.1c3.2,0,4.1,1,4,4.1c-0.1,2.7-1.1,3.2-3.5,3.2
			C516.4,731.6,493.1,731.6,469.8,731.6z"/>
		<path style="fill:#BFBFBF;" d="M469.7,742.7c-25.1,0-50.1-0.1-75.2,0.1c-3.1,0-4-0.9-3.8-3.9c0.1-1.9,0.7-2.8,2.7-2.7
			c0.4,0,0.9,0,1.3,0c50.1,0,100.2,0,150.4,0c1.9,0,3.9-0.5,4,2.7c0.1,3-0.9,3.9-3.9,3.9C520.1,742.7,494.9,742.7,469.7,742.7z"/>
		<path style="fill:#BFBFBF;" d="M469.9,644.4c-23.1,0-46.2,0-69.3,0c-3.9,0-4.6-0.7-3.8-4.6c0.1-0.8,1.2-1.5,1.9-2
			c0.5-0.3,1.3-0.1,1.9-0.1c46.2,0,92.4,0,138.7,0c2.2,0,4-0.2,4,3.1c0,2.8-0.8,3.7-3.7,3.7C516.4,644.4,493.1,644.4,469.9,644.4z"
			/>
		<path style="fill:#BFBFBF;" d="M536.1,716.7c0,3-0.9,4.3-3.9,3.8c-0.2,0-0.4,0-0.6,0c-5.3,0-5.4,0-5.3-5.2c0.2-21,0.4-42,0.6-63.1
			c0-1.8,0-3.7,2.6-3.4c2.2,0.3,5.5-1.4,5.6,2.8c0.1,7.4,0,14.7,0,22.1C535.4,673.8,535.9,702.4,536.1,716.7z"/>
		<path style="fill:#BFBFBF;" d="M505.5,716.9c0,2.8-0.8,3.8-3.7,3.7c-7-0.2-6.2,0.6-6.1-6c0.2-20.8,0.5-41.6,0.6-62.4
			c0-2.9,1.2-3.4,3.7-3.3c2.4,0.1,4.4-0.1,4.3,3.4c-0.2,8.8-0.1,17.5-0.1,26.3C504.6,678.6,505.3,704.1,505.5,716.9z"/>
		<path style="fill:#BFBFBF;" d="M474.9,716.9c0,2.9-0.9,3.8-3.7,3.7c-7.1-0.2-6.1,0.6-6.1-6c0-0.7,0-1.3,0-2
			c0.2-20.1,0.5-40.3,0.6-60.4c0-2.9,1.2-3.5,3.7-3.3c2.1,0.1,4.3-0.5,4.3,3.1c-0.2,10.1-0.1,20.1-0.1,30.2
			C474,682.2,474.7,705.3,474.9,716.9z"/>
		<path style="fill:#BFBFBF;" d="M444.3,716.9c0,2.9-0.9,3.8-3.7,3.7c-7.2-0.2-6.2,0.5-6.2-6.3c0-7,0-14.1,0.1-21.1
			c0.2-13.8,0.5-27.5,0.6-41.3c0-3.3,1.9-3,4-3c2.2,0,4-0.1,3.9,3.1c-0.1,11.4-0.1,22.7-0.1,34.1
			C443.3,686.1,444.1,706.6,444.3,716.9z"/>
		<path style="fill:#BFBFBF;" d="M404.5,696.5c0-14.9,0.1-29.7-0.1-44.6c0-3.2,1.8-3.1,4-3.1c2.2,0,4-0.1,4,3.1
			c0.1,14.8,0.3,29.5,0.6,44.2c0.1,7.2,0.4,14.3,0.7,21.5c0.1,2-0.6,2.9-2.8,2.9c-7.3,0.2-7.3,0.3-7.1-6.8
			C403.8,708,404.2,696.5,404.5,696.5z"/>
		<g>
			<rect x="466.4" y="601.9" style="fill:#FFFFFF;" width="6.9" height="27.1"/>
			<rect x="459.2" y="611" style="fill:#FFFFFF;" width="20.8" height="9.1"/>
		</g>
	</g>
</g>
<polygon style="fill:#F24141;" points="133.4,421.1 135.6,418.5 139.7,430.6 152.3,432.7 150.1,435.3 137.5,433.1 "/>
<polygon style="fill:#F24141;" points="125.8,434.2 127.1,431 134.9,441.1 147.5,439 146.3,442.2 133.6,444.2 "/>
<polygon style="fill:#F24141;" points="121.6,447.1 122.1,443.7 132,451.7 143.8,446.7 143.3,450.1 131.5,455 "/>
<polygon style="fill:#F24141;" points="120.1,458.9 120.1,455.5 131.1,462 142.1,455.5 142,459 131,465.4 "/>
<polygon style="fill:#F24141;" points="145.6,411.1 148.7,409.6 147.6,422.3 158.2,429.4 155.1,430.9 144.5,423.7 "/>
<g>
	<polygon style="fill:#F24141;" points="502,314.7 502,311.3 491,317.8 480,311.3 480,314.7 491.1,321.2 	"/>
	<polygon style="fill:#F24141;" points="502,323.4 502,320 491,326.5 480,320 480,323.4 491.1,329.9 	"/>
	<polygon style="fill:#F24141;" points="501.7,332.1 501.7,328.7 490.7,335.2 479.7,328.7 479.7,332.1 490.8,338.6 	"/>
	<polygon style="fill:#F24141;" points="502.2,340.9 502.2,337.4 491.3,343.9 480.3,337.4 480.3,340.9 491.3,347.4 	"/>
	<polygon style="fill:#F24141;" points="502.2,349.6 502.2,346.2 491.3,352.7 480.3,346.2 480.3,349.6 491.3,356.1 	"/>
	<polygon style="fill:#F24141;" points="502.2,358.3 502.2,354.9 491.3,361.4 480.3,354.9 480.3,358.3 491.3,364.8 	"/>
	<polygon style="fill:#F24141;" points="502.2,367 502.2,363.6 491.3,370.1 480.3,363.6 480.3,367 491.3,373.5 	"/>
	<polygon style="fill:#F24141;" points="501.9,375.7 501.9,372.3 490.9,378.8 480,372.3 480,375.7 491,382.2 	"/>
	<polygon style="fill:#F24141;" points="502.7,384.4 502.7,381 491.7,387.5 480.7,381 480.7,384.4 491.8,390.9 	"/>
</g>
<g>
	<polygon style="fill:#F24141;" points="432.3,427.5 435.7,427.5 429.2,416.5 435.7,405.5 432.3,405.5 425.8,416.6 	"/>
	<polygon style="fill:#F24141;" points="441,427.5 444.4,427.5 437.9,416.5 444.4,405.5 441,405.5 434.5,416.6 	"/>
	<polygon style="fill:#F24141;" points="423.6,427.5 427,427.5 420.5,416.5 427,405.5 423.6,405.5 417.1,416.6 	"/>
	<polygon style="fill:#F24141;" points="414.9,427.5 418.3,427.5 411.8,416.5 418.3,405.5 414.9,405.5 408.4,416.6 	"/>
	<polygon style="fill:#F24141;" points="406.2,427.5 409.6,427.5 403.1,416.5 409.6,405.5 406.2,405.5 399.7,416.6 	"/>
	<polygon style="fill:#F24141;" points="397.4,427.2 400.9,427.2 394.4,416.2 400.9,405.2 397.4,405.2 390.9,416.3 	"/>
	<polygon style="fill:#F24141;" points="388.7,427.7 392.1,427.7 385.6,416.8 392.1,405.8 388.7,405.8 382.2,416.8 	"/>
</g>
<polygon style="fill:#F24141;" points="489.5,414.2 492.1,412 480,407.8 477.9,395.3 475.3,397.5 477.5,410.1 "/>
<polygon style="fill:#F24141;" points="476.4,421.8 479.6,420.5 469.5,412.7 471.6,400.1 468.4,401.3 466.4,414 "/>
<polygon style="fill:#F24141;" points="463.5,426 466.9,425.5 459,415.6 463.9,403.8 460.5,404.3 455.6,416.1 "/>
<polygon style="fill:#F24141;" points="451.7,427.5 455.2,427.5 448.6,416.5 455.1,405.5 451.7,405.5 445.2,416.6 "/>
<polygon style="fill:#F24141;" points="499.5,402 501,398.9 488.3,400 481.2,389.4 479.8,392.5 486.9,403.1 "/>
</svg>
