<?xml version="1.0" encoding="utf-8"?>
<!-- Generator: Adobe Illustrator 22.0.0, SVG Export Plug-In . SVG Version: 6.00 Build 0)  -->
<svg version="1.1" id="Layer_1" xmlns="http://www.w3.org/2000/svg" xmlns:xlink="http://www.w3.org/1999/xlink" x="0px" y="0px"
	 width="600px" height="1585px" viewBox="0 0 600 1585" style="enable-background:new 0 0 600 1585;" xml:space="preserve">
<text transform="matrix(1 0 0 1 66.6875 162.7999)" style="fill:#106DA0; font-family:'HelveticaLTStd-BoldCond'; font-size:18px;">The general public is strongly discouraged from wearing masks</text>
<circle style="fill:#106DA0;" cx="36.7" cy="155.1" r="17.2"/>
<text transform="matrix(1 0 0 1 28.7842 163.2544)" style="fill:#FFFFFF; font-family:'HelveticaLTStd-BoldCond'; font-size:22.9835px;">1.</text>
<line style="fill:none;stroke:#106DA0;stroke-miterlimit:10;" x1="37.1" y1="172.4" x2="37.1" y2="184.5"/>
<rect x="21.7" y="614.8" style="fill:#F7EBEE;" width="556.5" height="248.1"/>
<rect x="22" y="934.3" style="fill:#F9F4EA;" width="556.5" height="297.7"/>
<rect x="22" y="1298.3" style="fill:#E9F4EE;" width="556.5" height="265.7"/>
<line style="fill:none;stroke:#000000;stroke-width:0.75;stroke-miterlimit:10;" x1="369.9" y1="713.1" x2="417.1" y2="713.1"/>
<rect x="21.8" y="183.3" style="fill:#DEF0F9;" width="556.5" height="350.2"/>
<line style="fill:none;stroke:#000000;stroke-width:0.75;stroke-miterlimit:10;" x1="300" y1="193.8" x2="300" y2="1551.3"/>
<rect x="260" y="210" style="fill:#DEF0F9;" width="79" height="23"/>
<rect x="260" y="276" style="fill:#DEF0F9;" width="79" height="23"/>
<rect x="260" y="351" style="fill:#DEF0F9;" width="79" height="23"/>
<rect x="260" y="428" style="fill:#DEF0F9;" width="79" height="23"/>
<rect x="260" y="641" style="fill:#F7EBEE;" width="79" height="23"/>
<rect x="260" y="712" style="fill:#F7EBEE;" width="79" height="23"/>
<rect x="260" y="788" style="fill:#F7EBEE;" width="79" height="23"/>
<rect x="260" y="941" style="fill:#F9F4EA;" width="79" height="23"/>
<rect x="260" y="1007" style="fill:#F9F4EA;" width="79" height="23"/>
<rect x="260" y="1081" style="fill:#F9F4EA;" width="79" height="23"/>
<rect x="260" y="1156" style="fill:#F9F4EA;" width="79" height="23"/>
<rect x="260" y="1314" style="fill:#E9F4EE;" width="79" height="23"/>
<rect x="260" y="1418.5" style="fill:#E9F4EE;" width="79" height="23"/>
<line style="fill:none;stroke:#000000;stroke-width:0.75;stroke-miterlimit:10;" x1="25.5" y1="124.9" x2="576.5" y2="124.9"/>
<g>
	<circle style="fill:#DEF0F9;" cx="299.5" cy="242.9" r="5.6"/>
	<path style="fill:#106DA0;" d="M299.5,238.8c2.3,0,4.1,1.9,4.1,4.1s-1.9,4.1-4.1,4.1s-4.1-1.9-4.1-4.1S297.2,238.8,299.5,238.8
		 M299.5,235.8c-3.9,0-7.1,3.2-7.1,7.1s3.2,7.1,7.1,7.1s7.1-3.2,7.1-7.1S303.5,235.8,299.5,235.8L299.5,235.8z"/>
</g>
<g>
	<circle style="fill:#DEF0F9;" cx="299.5" cy="309.3" r="5.6"/>
	<path style="fill:#106DA0;" d="M299.5,305.2c2.3,0,4.1,1.9,4.1,4.1s-1.9,4.1-4.1,4.1s-4.1-1.9-4.1-4.1S297.2,305.2,299.5,305.2
		 M299.5,302.2c-3.9,0-7.1,3.2-7.1,7.1s3.2,7.1,7.1,7.1s7.1-3.2,7.1-7.1C306.6,305.4,303.5,302.2,299.5,302.2L299.5,302.2z"/>
</g>
<g>
	<circle style="fill:#DEF0F9;" cx="299.5" cy="383.9" r="5.6"/>
	<path style="fill:#106DA0;" d="M299.5,379.8c2.3,0,4.1,1.9,4.1,4.1s-1.9,4.1-4.1,4.1s-4.1-1.9-4.1-4.1S297.2,379.8,299.5,379.8
		 M299.5,376.8c-3.9,0-7.1,3.2-7.1,7.1s3.2,7.1,7.1,7.1s7.1-3.2,7.1-7.1S303.5,376.8,299.5,376.8L299.5,376.8z"/>
</g>
<g>
	<circle style="fill:#DEF0F9;" cx="299.5" cy="463.1" r="5.6"/>
	<path style="fill:#106DA0;" d="M299.5,459c2.3,0,4.1,1.9,4.1,4.1s-1.9,4.1-4.1,4.1s-4.1-1.9-4.1-4.1S297.2,459,299.5,459
		 M299.5,456c-3.9,0-7.1,3.2-7.1,7.1s3.2,7.1,7.1,7.1s7.1-3.2,7.1-7.1S303.5,456,299.5,456L299.5,456z"/>
</g>
<line style="fill:none;stroke:#106DA0;stroke-miterlimit:10;" x1="242.1" y1="309.6" x2="286.4" y2="309.6"/>
<line style="fill:none;stroke:#106DA0;stroke-miterlimit:10;" x1="313.1" y1="243.6" x2="357.4" y2="243.6"/>
<line style="fill:none;stroke:#106DA0;stroke-miterlimit:10;" x1="313.1" y1="383.6" x2="357.4" y2="383.6"/>
<line style="fill:none;stroke:#106DA0;stroke-miterlimit:10;" x1="242.1" y1="462.6" x2="286.4" y2="462.6"/>
<line style="fill:none;stroke:#BA2F36;stroke-miterlimit:10;" x1="313.1" y1="679.6" x2="357.4" y2="679.6"/>
<line style="fill:none;stroke:#BA2F36;stroke-miterlimit:10;" x1="313.1" y1="828.6" x2="357.4" y2="828.6"/>
<line style="fill:none;stroke:#BA2F36;stroke-miterlimit:10;" x1="242.1" y1="752.6" x2="286.4" y2="752.6"/>
<circle style="fill:#BA2F36;" cx="36.6" cy="571.5" r="17.2"/>
<text transform="matrix(1 0 0 1 28.7217 579.6523)" style="fill:#FFFFFF; font-family:'HelveticaLTStd-BoldCond'; font-size:22.9835px;">2.</text>
<line style="fill:none;stroke:#BA2F36;stroke-miterlimit:10;" x1="36.2" y1="588.4" x2="36.2" y2="615"/>
<circle style="fill:#C69246;" cx="44.9" cy="898.5" r="17.2"/>
<text transform="matrix(1 0 0 1 36.9717 906.6523)" style="fill:#FFFFFF; font-family:'HelveticaLTStd-BoldCond'; font-size:22.9835px;">3.</text>
<line style="fill:none;stroke:#D3A14A;stroke-miterlimit:10;" x1="44.5" y1="915.4" x2="44.5" y2="935"/>
<g>
	<circle style="fill:#F9E5E8;" cx="300" cy="677.4" r="5.6"/>
	<path style="fill:#BA2F36;" d="M300,673.2c2.3,0,4.1,1.9,4.1,4.1s-1.9,4.1-4.1,4.1s-4.1-1.9-4.1-4.1S297.7,673.2,300,673.2
		 M300,670.2c-3.9,0-7.1,3.2-7.1,7.1c0,3.9,3.2,7.1,7.1,7.1s7.1-3.2,7.1-7.1S303.9,670.2,300,670.2L300,670.2z"/>
</g>
<g>
	<circle style="fill:#F9E5E8;" cx="300" cy="752.1" r="5.6"/>
	<path style="fill:#BA2F36;" d="M300,747.9c2.3,0,4.1,1.9,4.1,4.1s-1.9,4.1-4.1,4.1s-4.1-1.9-4.1-4.1S297.7,747.9,300,747.9
		 M300,744.9c-3.9,0-7.1,3.2-7.1,7.1c0,3.9,3.2,7.1,7.1,7.1s7.1-3.2,7.1-7.1C307.1,748.1,303.9,744.9,300,744.9L300,744.9z"/>
</g>
<g>
	<circle style="fill:#F9E5E8;" cx="300" cy="828.9" r="5.6"/>
	<path style="fill:#BA2F36;" d="M300,824.8c2.3,0,4.1,1.9,4.1,4.1s-1.9,4.1-4.1,4.1s-4.1-1.9-4.1-4.1S297.7,824.8,300,824.8
		 M300,821.8c-3.9,0-7.1,3.2-7.1,7.1c0,3.9,3.2,7.1,7.1,7.1s7.1-3.2,7.1-7.1S303.9,821.8,300,821.8L300,821.8z"/>
</g>
<rect x="259" y="547" style="fill:#FFFFFF;" width="79" height="55"/>
<rect x="259" y="874" style="fill:#FFFFFF;" width="79" height="42"/>
<rect x="259" y="1245" style="fill:#FFFFFF;" width="79" height="42"/>
<g>
	<circle style="fill:#F9F4EA;" cx="300.5" cy="983.7" r="5.6"/>
	<path style="fill:#C69246;" d="M300.5,979.5c2.3,0,4.1,1.9,4.1,4.1s-1.9,4.1-4.1,4.1s-4.1-1.9-4.1-4.1S298.3,979.5,300.5,979.5
		 M300.5,976.5c-3.9,0-7.1,3.2-7.1,7.1s3.2,7.1,7.1,7.1s7.1-3.2,7.1-7.1S304.5,976.5,300.5,976.5L300.5,976.5z"/>
</g>
<g>
	<circle style="fill:#F9F4EA;" cx="300.5" cy="1049.3" r="5.6"/>
	<path style="fill:#C69246;" d="M300.5,1045.2c2.3,0,4.1,1.9,4.1,4.1s-1.9,4.1-4.1,4.1s-4.1-1.9-4.1-4.1S298.3,1045.2,300.5,1045.2
		 M300.5,1042.2c-3.9,0-7.1,3.2-7.1,7.1s3.2,7.1,7.1,7.1s7.1-3.2,7.1-7.1C307.7,1045.4,304.5,1042.2,300.5,1042.2L300.5,1042.2z"/>
</g>
<g>
	<circle style="fill:#F9F4EA;" cx="299.8" cy="1119.5" r="5.6"/>
	<path style="fill:#C69246;" d="M299.8,1115.3c2.3,0,4.1,1.9,4.1,4.1s-1.9,4.1-4.1,4.1s-4.1-1.9-4.1-4.1S297.6,1115.3,299.8,1115.3
		 M299.8,1112.3c-3.9,0-7.1,3.2-7.1,7.1s3.2,7.1,7.1,7.1s7.1-3.2,7.1-7.1C307,1115.5,303.8,1112.3,299.8,1112.3L299.8,1112.3z"/>
</g>
<g>
	<circle style="fill:#F9F4EA;" cx="300.5" cy="1194.1" r="5.6"/>
	<path style="fill:#C69246;" d="M300.5,1190c2.3,0,4.1,1.9,4.1,4.1s-1.9,4.1-4.1,4.1s-4.1-1.9-4.1-4.1S298.3,1190,300.5,1190
		 M300.5,1187c-3.9,0-7.1,3.2-7.1,7.1s3.2,7.1,7.1,7.1s7.1-3.2,7.1-7.1S304.5,1187,300.5,1187L300.5,1187z"/>
</g>
<line style="fill:none;stroke:#C69246;stroke-miterlimit:10;" x1="313.7" y1="984" x2="358.5" y2="984"/>
<line style="fill:none;stroke:#C69246;stroke-miterlimit:10;" x1="313.7" y1="1120.9" x2="360.5" y2="1120.9"/>
<line style="fill:none;stroke:#C69246;stroke-miterlimit:10;" x1="242.5" y1="1049.7" x2="286.7" y2="1049.7"/>
<line style="fill:none;stroke:#C69246;stroke-miterlimit:10;" x1="242.5" y1="1193.7" x2="286.7" y2="1193.7"/>
<text transform="matrix(1 0 0 1 74.5625 1272.585)" style="fill:#278955; font-family:'HelveticaLTStd-BoldCond'; font-size:18px;">Mass supply of masks begins</text>
<circle style="fill:#278955;" cx="44.6" cy="1268.9" r="17.2"/>
<text transform="matrix(1 0 0 1 36.6592 1277.04)" style="fill:#FFFFFF; font-family:'HelveticaLTStd-BoldCond'; font-size:22.9835px;">4.</text>
<line style="fill:none;stroke:#278955;stroke-miterlimit:10;" x1="242.2" y1="1456.5" x2="286.4" y2="1456.5"/>
<line style="fill:none;stroke:#278955;stroke-miterlimit:10;" x1="314.2" y1="1351" x2="358.4" y2="1351"/>
<text transform="matrix(1 0 0 1 283.3845 1331.3772)" style="fill:#278955; font-family:'HelveticaLTStd-BoldCond'; font-size:15px;">4 mai</text>
<text transform="matrix(1 0 0 1 282.1355 1435.3254)" style="fill:#278955; font-family:'HelveticaLTStd-BoldCond'; font-size:15px;">6 mai</text>
<g>
	<circle style="fill:#E9F4EE;" cx="299.6" cy="1349.9" r="5.6"/>
	<path style="fill:#278955;" d="M299.6,1345.7c2.3,0,4.1,1.9,4.1,4.1s-1.9,4.1-4.1,4.1s-4.1-1.9-4.1-4.1S297.3,1345.7,299.6,1345.7
		 M299.6,1342.7c-3.9,0-7.1,3.2-7.1,7.1s3.2,7.1,7.1,7.1s7.1-3.2,7.1-7.1S303.5,1342.7,299.6,1342.7L299.6,1342.7z"/>
</g>
<g>
	<circle style="fill:#E9F4EE;" cx="299.6" cy="1455.6" r="5.6"/>
	<path style="fill:#278955;" d="M299.6,1451.4c2.3,0,4.1,1.9,4.1,4.1s-1.9,4.1-4.1,4.1s-4.1-1.9-4.1-4.1S297.3,1451.4,299.6,1451.4
		 M299.6,1448.4c-3.9,0-7.1,3.2-7.1,7.1s3.2,7.1,7.1,7.1s7.1-3.2,7.1-7.1S303.5,1448.4,299.6,1448.4L299.6,1448.4z"/>
</g>
<rect x="369.2" y="1324.2" style="fill:none;" width="152.4" height="114.4"/>
<text transform="matrix(1 0 0 1 369.2188 1335.4873)"><tspan x="0" y="0" style="font-family:'HelveticaLTStd-Cond'; font-size:15px;">The Central Pharmacy </tspan><tspan x="0" y="18" style="font-family:'HelveticaLTStd-Cond'; font-size:15px;">supplies pharmacies with </tspan><tspan x="0" y="36" style="font-family:'HelveticaLTStd-Cond'; font-size:15px;">surgical masks but not </tspan><tspan x="0" y="54" style="font-family:'HelveticaLTStd-Cond'; font-size:15px;">fabric masks due to  </tspan><tspan x="0" y="72" style="font-family:'HelveticaLTStd-Cond'; font-size:15px;">production delays.</tspan></text>
<rect x="38.4" y="1449.5" style="fill:none;" width="191.9" height="85.5"/>
<text transform="matrix(1 0 0 1 55.8414 1460.7373)"><tspan x="0" y="0" style="font-family:'HelveticaLTStd-Cond'; font-size:15px;">The fabric masks yet to arrive </tspan><tspan x="-7.5" y="18" style="font-family:'HelveticaLTStd-Cond'; font-size:15px;">will be delivered directly by the </tspan><tspan x="-0.1" y="36" style="font-family:'HelveticaLTStd-Cond'; font-size:15px;">manufacturers, without going </tspan><tspan x="-2.6" y="54" style="font-family:'HelveticaLTStd-Cond'; font-size:15px;">through the Central Pharmacy</tspan></text>
<rect x="50.1" y="322.2" style="fill:none;" width="183.2" height="33.5"/>
<text transform="matrix(1 0 0 1 140.0042 333.404)"><tspan x="0" y="0" style="font-family:'HelveticaLTStd-Cond'; font-size:15px;">Khalil Ammous,  </tspan><tspan x="-77.5" y="18" style="font-family:'HelveticaLTStd-Cond'; font-size:15px;">CEO of the Central Pharmacy </tspan></text>
<rect x="37.1" y="260.9" style="fill:none;" width="196.2" height="51.1"/>
<text transform="matrix(1 0 0 1 48.3249 272.154)"><tspan x="0" y="0" style="font-family:'HelveticaLTStd-BoldCondObl'; font-size:15px;">&quot;Citizens must be made aware </tspan><tspan x="-0.4" y="18" style="font-family:'HelveticaLTStd-BoldCondObl'; font-size:15px;">not to buy masks without good </tspan><tspan x="133.4" y="36" style="font-family:'HelveticaLTStd-BoldCondObl'; font-size:15px;">reason.&quot;</tspan></text>
<rect x="263.7" y="214.5" style="fill:none;" width="73.7" height="25.5"/>
<text transform="matrix(1 0 0 1 263.6875 225.7373)" style="fill:#106DA0; font-family:'HelveticaLTStd-BoldCond'; font-size:15px;">February 26</text>
<rect x="270.1" y="280.5" style="fill:none;" width="60.9" height="25.5"/>
<text transform="matrix(1 0 0 1 270.0625 291.7373)" style="fill:#106DA0; font-family:'HelveticaLTStd-BoldCond'; font-size:15px;">March 1st</text>
<rect x="267.8" y="355.5" style="fill:none;" width="65.4" height="25.5"/>
<text transform="matrix(1 0 0 1 267.8125 366.7373)" style="fill:#106DA0; font-family:'HelveticaLTStd-BoldCond'; font-size:15px;">March 2nd</text>
<rect x="271.6" y="431.5" style="fill:none;" width="57.9" height="25.5"/>
<text transform="matrix(1 0 0 1 271.5625 442.7373)" style="fill:#106DA0; font-family:'HelveticaLTStd-BoldCond'; font-size:15px;">March 19</text>
<rect x="367.8" y="362.1" style="fill:none;" width="193.2" height="34.5"/>
<text transform="matrix(1 0 0 1 367.8438 373.3206)"><tspan x="0" y="0" style="font-family:'HelveticaLTStd-BoldCondObl'; font-size:15px;">&quot;Masks are only useful for sick </tspan><tspan x="0" y="18" style="font-family:'HelveticaLTStd-BoldCondObl'; font-size:15px;">people.&quot; </tspan></text>
<rect x="367.8" y="405" style="fill:none;" width="167.8" height="38"/>
<text transform="matrix(1 0 0 1 367.8438 416.2373)"><tspan x="0" y="0" style="font-family:'HelveticaLTStd-Cond'; font-size:15px;">Nissaf Ben Alaya, Director </tspan><tspan x="0" y="18" style="font-family:'HelveticaLTStd-Cond'; font-size:15px;">General of the ONMNE </tspan></text>
<rect x="116" y="473.4" style="fill:none;" width="117.3" height="32.6"/>
<text transform="matrix(1 0 0 1 135.8662 484.654)"><tspan x="0" y="0" style="font-family:'HelveticaLTStd-Cond'; font-size:15px;">Abdellatif Mekki,  </tspan><tspan x="-7.5" y="18" style="font-family:'HelveticaLTStd-Cond'; font-size:15px;">Minister of Health</tspan></text>
<rect x="47.3" y="412.2" style="fill:none;" width="186.1" height="50.4"/>
<text transform="matrix(1 0 0 1 75.4447 423.4873)"><tspan x="0" y="0" style="font-family:'HelveticaLTStd-BoldCondObl'; font-size:15px;">&quot;Only &apos;sick&apos; people should </tspan><tspan x="-23.3" y="18" style="font-family:'HelveticaLTStd-BoldCondObl'; font-size:15px;">wear masks. Its effectiveness </tspan><tspan x="19.6" y="36" style="font-family:'HelveticaLTStd-BoldCondObl'; font-size:15px;">is very low for others.&quot; </tspan></text>
<rect x="370.5" y="667.2" style="fill:none;" width="163.1" height="33.8"/>
<text transform="matrix(1 0 0 1 370.4688 678.4873)"><tspan x="0" y="0" style="font-family:'HelveticaLTStd-Cond'; font-size:15px;">Abdellatif Mekki,  </tspan><tspan x="0" y="18" style="font-family:'HelveticaLTStd-Cond'; font-size:15px;">Minister of Health</tspan></text>
<rect x="370.5" y="728.8" style="fill:none;" width="187.2" height="32.2"/>
<text transform="matrix(1 0 0 1 370.4688 740.0706)"><tspan x="0" y="0" style="font-family:'HelveticaLTStd-Cond'; font-size:15px;">An order of medical equipment </tspan><tspan x="0" y="18" style="font-family:'HelveticaLTStd-Cond'; font-size:15px;">remains blocked in China</tspan></text>
<rect x="371.2" y="801.2" style="fill:none;" width="186.4" height="50.4"/>
<text transform="matrix(1 0 0 1 371.2188 812.4873)"><tspan x="0" y="0" style="font-family:'HelveticaLTStd-Cond'; font-size:15px;">The Ministry of Health  </tspan><tspan x="0" y="18" style="font-family:'HelveticaLTStd-Cond'; font-size:15px;">recommends wearing a mask  </tspan><tspan x="0" y="36" style="font-family:'HelveticaLTStd-Cond'; font-size:15px;">over social media networks. </tspan></text>
<rect x="61" y="727" style="fill:none;" width="176.4" height="52"/>
<text transform="matrix(1 0 0 1 70.7914 738.229)"><tspan x="0" y="0" style="font-family:'HelveticaLTStd-Cond'; font-size:15px;">Authorization for companies </tspan><tspan x="14.6" y="18" style="font-family:'HelveticaLTStd-Cond'; font-size:15px;">to manufacture masks for </tspan><tspan x="93.3" y="36" style="font-family:'HelveticaLTStd-Cond'; font-size:15px;">non-medical</tspan></text>
<rect x="370.5" y="628" style="fill:none;" width="203.5" height="32.3"/>
<text transform="matrix(1 0 0 1 370.4688 639.2373)"><tspan x="0" y="0" style="font-family:'HelveticaLTStd-BoldCondObl'; font-size:15px;">&quot;Everyone will be required to </tspan><tspan x="0" y="18" style="font-family:'HelveticaLTStd-BoldCondObl'; font-size:15px;">wear masks after confinement.&quot;</tspan></text>
<text transform="matrix(1 0 0 1 273.7188 656.0371)" style="fill:#BA2F36; font-family:'HelveticaLTStd-BoldCond'; font-size:15px;">April 5th</text>
<text transform="matrix(1 0 0 1 276.167 727.2871)" style="fill:#BA2F36; font-family:'HelveticaLTStd-BoldCond'; font-size:15px;">April 11</text>
<text transform="matrix(1 0 0 1 276.2188 803.0371)" style="fill:#BA2F36; font-family:'HelveticaLTStd-BoldCond'; font-size:15px;">April 14</text>
<g>
	
		<text transform="matrix(1 0 0 1 275.6304 958.0371)" style="fill:#C69246; font-family:'HelveticaLTStd-BoldCond'; font-size:15px;">April 16</text>
</g>
<g>
	
		<text transform="matrix(1 0 0 1 275.6304 1024.2871)" style="fill:#C69246; font-family:'HelveticaLTStd-BoldCond'; font-size:15px;">April 19</text>
</g>
<g>
	
		<text transform="matrix(1 0 0 1 275.6304 1173.2871)" style="fill:#C69246; font-family:'HelveticaLTStd-BoldCond'; font-size:15px;">April 29</text>
</g>
<g>
	
		<text transform="matrix(1 0 0 1 275.6304 1099.0371)" style="fill:#C69246; font-family:'HelveticaLTStd-BoldCond'; font-size:15px;">April 24</text>
</g>
<rect x="368.8" y="961.2" style="fill:none;" width="159.6" height="69.8"/>
<text transform="matrix(1 0 0 1 368.7711 972.4519)"><tspan x="0" y="0" style="font-family:'HelveticaLTStd-Cond'; font-size:15px;">The INLUCC suspects  </tspan><tspan x="0" y="18" style="font-family:'HelveticaLTStd-Cond'; font-size:15px;">corruption in the process  </tspan><tspan x="0" y="36" style="font-family:'HelveticaLTStd-Cond'; font-size:15px;">of awarding contracts for  </tspan><tspan x="0" y="54" style="font-family:'HelveticaLTStd-Cond'; font-size:15px;">mask manufacturing</tspan></text>
<rect x="32.7" y="997.9" style="fill:none;" width="202.6" height="67.8"/>
<text transform="matrix(1 0 0 1 76.6184 1009.1335)"><tspan x="0" y="0" style="font-family:'HelveticaLTStd-Cond'; font-size:15px;">Elyes Fakhfakh defends his  </tspan><tspan x="-41.7" y="18" style="font-family:'HelveticaLTStd-Cond'; font-size:15px;">minister as he faces suspicions of </tspan><tspan x="-29.2" y="36" style="font-family:'HelveticaLTStd-Cond'; font-size:15px;">corruption in the manufacturing </tspan><tspan x="46.2" y="54" style="font-family:'HelveticaLTStd-Cond'; font-size:15px;">of washable masks</tspan></text>
<rect x="372.2" y="1106.9" style="fill:none;" width="164.2" height="73.5"/>
<text transform="matrix(1 0 0 1 372.1537 1118.1941)"><tspan x="0" y="0" style="font-family:'HelveticaLTStd-Cond'; font-size:15px;">The price of cloth masks  </tspan><tspan x="0" y="18" style="font-family:'HelveticaLTStd-Cond'; font-size:15px;">is set at 1.850 dinars</tspan></text>
<rect x="34.9" y="1185" style="fill:none;" width="197.4" height="35.3"/>
<text transform="matrix(1 0 0 1 134.8176 1196.2938)"><tspan x="0" y="0" style="font-family:'HelveticaLTStd-Cond'; font-size:15px;">Abdellatif Mekki,  </tspan><tspan x="-7.5" y="18" style="font-family:'HelveticaLTStd-Cond'; font-size:15px;">Minister of Health</tspan></text>
<rect x="106.6" y="1403.1" style="fill:none;" width="123.8" height="22.5"/>
<text transform="matrix(1 0 0 1 115.7953 1414.3207)" style="font-family:'HelveticaLTStd-Cond'; font-size:15px;">(Central Pharmacy) </text>
<rect x="36.3" y="1108.9" style="fill:none;" width="196" height="65.5"/>
<text transform="matrix(1 0 0 1 49.8118 1120.1261)"><tspan x="0" y="0" style="font-family:'HelveticaLTStd-BoldCondObl'; font-size:15px;">&quot;The production of masks was </tspan><tspan x="0.8" y="18" style="font-family:'HelveticaLTStd-BoldCondObl'; font-size:15px;">delayed by 15 days due to the </tspan><tspan x="-2.9" y="36" style="font-family:'HelveticaLTStd-BoldCondObl'; font-size:15px;">controversy over suspicions of </tspan><tspan x="110" y="54" style="font-family:'HelveticaLTStd-BoldCondObl'; font-size:15px;">corruption.&quot;</tspan></text>
<rect x="33.7" y="1327.3" style="fill:none;" width="196.6" height="68"/>
<text transform="matrix(1 0 0 1 47.0205 1338.5826)"><tspan x="0" y="0" style="font-family:'HelveticaLTStd-BoldCondObl'; font-size:15px;">&quot;25 million surgical masks for </tspan><tspan x="-3.8" y="18" style="font-family:'HelveticaLTStd-BoldCondObl'; font-size:15px;">public hospitals were received </tspan><tspan x="-2.1" y="36" style="font-family:'HelveticaLTStd-BoldCondObl'; font-size:15px;">from China and 4 million were </tspan><tspan x="24.6" y="54" style="font-family:'HelveticaLTStd-BoldCondObl'; font-size:15px;">distributed in three days.&quot; </tspan></text>
<line style="fill:none;stroke:#000000;stroke-width:0.5625;stroke-miterlimit:10;" x1="183.1" y1="1434" x2="230.3" y2="1434"/>
<text transform="matrix(1 0 0 1 28.5811 53.6836)"><tspan x="0" y="0" style="fill:#1A1A1A; font-family:'HelveticaLTStd-BlkCond'; font-size:39px;">Key Dates in the Evolution </tspan><tspan x="0" y="46.8" style="fill:#1A1A1A; font-family:'HelveticaLTStd-BlkCond'; font-size:39px;">of Tunisia’s Mask Policy </tspan></text>
<text transform="matrix(1 0 0 1 68.4688 573.2573)"><tspan x="0" y="0" style="fill:#BA2F36; font-family:'HelveticaLTStd-BoldCond'; font-size:18px;">The general public is encouraged to wear masks in the </tspan><tspan x="0" y="21.6" style="fill:#BA2F36; font-family:'HelveticaLTStd-BoldCond'; font-size:18px;">deconfinement period, orders and calls for tenders begin</tspan></text>
<text transform="matrix(1 0 0 1 75.7188 899.2573)"><tspan x="0" y="0" style="fill:#C69246; font-family:'HelveticaLTStd-BoldCond'; font-size:18px;">Controversies related to the delay in supplying masks to the </tspan><tspan x="0" y="21.6" style="fill:#C69246; font-family:'HelveticaLTStd-BoldCond'; font-size:18px;">general public </tspan></text>
<text transform="matrix(1 0 0 1 367.8438 224.5371)"><tspan x="0" y="0" style="font-family:'HelveticaLTStd-BoldCondObl'; font-size:15px;">&quot;The use of masks by healthy </tspan><tspan x="0" y="18" style="font-family:'HelveticaLTStd-BoldCondObl'; font-size:15px;">people is useless.&quot;</tspan></text>
<text transform="matrix(1 0 0 1 367.8438 273.5371)"><tspan x="0" y="0" style="font-family:'HelveticaLTStd-Cond'; font-size:15px;">Chokri Hamouda, representative </tspan><tspan x="0" y="18" style="font-family:'HelveticaLTStd-Cond'; font-size:15px;">of the Ministry of Health</tspan></text>
</svg>
