<?xml version="1.0" encoding="utf-8"?>
<!-- Generator: Adobe Illustrator 22.0.0, SVG Export Plug-In . SVG Version: 6.00 Build 0)  -->
<svg version="1.1" id="sound-control" xmlns="http://www.w3.org/2000/svg" xmlns:xlink="http://www.w3.org/1999/xlink" x="0px" y="0px"
	 viewBox="0 0 372 372" style="enable-background:new 0 0 372 276;" xml:space="preserve" class="btn-svg">
	<style>
		.volume-off{
			display: none;
		}
		.muted .volume-off{
			display: block;
		}
		.muted .volume-on{
			display: none;
		}
		.btn-svg {
			max-height : 20px
		}
	</style>
	<g style="transform: translate(0,30px)">
	<g class="volume-off">
		<g>
			<path d="M203.1,21.2c-3-2.2-6.7-3.5-10.1-5.2c-1.7,0-3.3,0-5,0c-4.8,2.6-9.7,4.9-14.4,7.7c-27.7,16.4-55.4,33-83.2,49.4 c-2.6,1.5-5.9,2.4-8.8,2.4c-14.5,0.2-29,0.1-43.4,0.1c-16.8,0-25.5,6.8-29.5,23C8.5,99.1,8.2,99.6,8,100c0,26.7,0,53.3,0,80 c0.2,0.4,0.6,0.8,0.7,1.3c3.5,15.2,12.8,22.8,28.2,22.8c15,0,30-0.1,45,0.1c2.8,0,5.9,0.9,8.4,2.3c30.2,17.6,60.3,35.4,90.4,53.1 c4.4,2.6,9,4.1,14.3,2.9c9.4-2.2,14.4-8.9,14.4-19.4c0-49,0-97.9,0-146.9c0-20.2-0.1-40.3,0-60.5 C209.4,29.9,207.8,24.7,203.1,21.2z   M74.7,185.8c-12.5-0.2-25,0-37.5-0.1c-7.5,0-10.1-2.8-10.1-10.4c0-23.5,0-47,0-70.5 c0-7.4,2.6-10.1,9.8-10.1c14-0.1,27.9,0,42.5,0c0,5.2,0,9.5,0,13.8c0,24.2-0.1,48.3,0.1,72.5C79.5,184.7,78.5,185.9,74.7,185.8z M189.4,243.4c-1.9-1-3.4-1.7-4.8-2.5c-27.5-16.3-55-32.7-82.5-48.9c-2.9-1.7-4-3.6-4-7.1c0.1-30.2,0.1-60.3,0-90.5 c0-2.7,0.5-4.5,3.1-6c28.3-16.6,56.5-33.4,84.7-50.1c0.9-0.6,2-0.9,3.5-1.6C189.4,105.7,189.4,174.2,189.4,243.4z"/>
		</g>
		<path d="M301,138l35,35c1.6,1.8,2.3,3.8,2.3,6.2c0,2.3-0.9,4.4-2.7,6.2c-1.8,1.8-3.8,2.7-6,2.7c-2.2,0-4.2-0.9-6-2.7l-35-35l-35,35 c-0.2,0.4-0.4,0.6-0.7,0.3c-1.8,1.6-3.8,2.3-6,2.3c-2.2,0-4.2-0.9-5.8-2.7c-1.7-1.8-2.5-3.8-2.5-6.2c0-2.3,0.9-4.4,2.7-6.2l35-35 l-35-35c-1.8-1.8-2.7-3.8-2.7-6c0-2.2,0.9-4.2,2.7-6c1.8-1.8,3.8-2.7,6.2-2.7c2.3,0,4.4,0.8,6.2,2.3l35,35l35-35 c1.5-1.3,3.4-2,5.7-2c2.2,0,4.2,0.7,6,2.2c1.8,1.5,2.7,3.4,2.8,5.8c0.1,2.5-0.6,4.6-2.2,6.3l-17.7,17.7 C308.1,130.6,302.3,136.4,301,138z"/>
	</g>
<g class="volume-on">
	<path d="M203.1,21.2c-3-2.2-6.7-3.5-10.1-5.2c-1.7,0-3.3,0-5,0c-4.8,2.6-9.7,4.9-14.4,7.7c-27.7,16.4-55.4,33-83.2,49.4
		c-2.6,1.5-5.9,2.4-8.8,2.4c-14.5,0.2-29,0.1-43.4,0.1c-16.8,0-25.5,6.8-29.5,23C8.5,99.1,8.2,99.6,8,100c0,26.7,0,53.3,0,80
		c0.2,0.4,0.6,0.8,0.7,1.3c3.5,15.2,12.8,22.8,28.2,22.8c15,0,30-0.1,45,0.1c2.8,0,5.9,0.9,8.4,2.3c30.2,17.6,60.3,35.4,90.4,53.1
		c4.4,2.6,9,4.1,14.3,2.9c9.4-2.2,14.4-8.9,14.4-19.4c0-49,0-97.9,0-146.9c0-20.2-0.1-40.3,0-60.5C209.4,29.9,207.8,24.7,203.1,21.2
		z M74.7,185.8c-12.5-0.2-25,0-37.5-0.1c-7.5,0-10.1-2.8-10.1-10.4c0-23.5,0-47,0-70.5c0-7.4,2.6-10.1,9.8-10.1
		c14-0.1,27.9,0,42.5,0c0,5.2,0,9.5,0,13.8c0,24.2-0.1,48.3,0.1,72.5C79.5,184.7,78.5,185.9,74.7,185.8z M189.4,243.4
		c-1.9-1-3.4-1.7-4.8-2.5c-27.5-16.3-55-32.7-82.5-48.9c-2.9-1.7-4-3.6-4-7.1c0.1-30.2,0.1-60.3,0-90.5c0-2.7,0.5-4.5,3.1-6
		c28.3-16.6,56.5-33.4,84.7-50.1c0.9-0.6,2-0.9,3.5-1.6C189.4,105.7,189.4,174.2,189.4,243.4z"/>
	<path d="M360.3,101.3C353,72,337.5,47.2,315.7,26.3c-4.5-4.3-9.9-4.4-13.8-0.5c-3.9,3.9-3.7,9.3,0.5,13.8c0.7,0.7,1.4,1.4,2.1,2.1
		c28.2,28.2,42.2,62.4,42.8,102.2c0,18.2-3.4,35.7-10.1,52.7c-6.5,16.5-15.9,31-27.7,44.2c-4.5,5-4.4,10.3-0.1,14.1
		c4.2,3.8,9.9,3.1,14.4-2.1C362.3,208.7,374.7,158.1,360.3,101.3z"/>
	<path d="M288.4,59.5c-6.2-6.4-11.9-7.3-16.3-2.8c-4.3,4.5-3.2,9.4,2.9,15.9c25.9,27.5,34.4,59.7,25.2,96.4
		c-3.9,15.5-11.7,28.9-22.3,40.8c-5,5.6-4.6,12,0.9,15.4c4.4,2.7,8.9,1.7,13.2-3.1c20.1-22.6,30.2-49,30.7-80
		C322.1,110.5,310.9,82.7,288.4,59.5z"/>
	<path d="M255.9,87.9c-4.7-4.6-10.1-4.9-14.1-0.8c-4,4-3.6,9.4,1,14.1c22.1,22.8,23.3,53.8,3.1,78.1c-4.4,5.3-4.5,10.9-0.1,14.5
		c4.4,3.7,9.7,2.9,14.4-2.4c12.4-14.1,18.4-30.7,18.8-49.8C278.4,120.9,271.1,102.7,255.9,87.9z"/>
</g>
</g>
</svg>
