<?xml version="1.0" encoding="utf-8"?>
<!-- Generator: Adobe Illustrator 22.0.0, SVG Export Plug-In . SVG Version: 6.00 Build 0)  -->
<svg version="1.1" xmlns="http://www.w3.org/2000/svg" xmlns:xlink="http://www.w3.org/1999/xlink" x="0px" y="0px" width="423px"
	 height="178px" viewBox="0 0 423 178" style="enable-background:new 0 0 423 178;" xml:space="preserve">
<style type="text/css">
	.st0{fill:#FF3333;}
</style>
<g id="Calque_0_xA0_Image_1_">
</g>
<g id="Calque_0_copie_xA0_Image_1_">
</g>
<g id="_x3C_Texte_x3E_">
</g>
<g id="inkylab_1_">
</g>
<g id="inkylab">
	<g>
		<path d="M77.4,118.2V61.4h3v56.8H77.4z"/>
		<path d="M97.4,66.7v51.6h-2.9V61.4h2.2l44,52.4V61.4h2.9v56.8h-2.9L97.4,66.7z"/>
		<path d="M157.7,118.2V61.4h2.9v35.8l36.6-35.8h3.6l-25.2,24.9l26.4,31.9h-3.5L173.6,88l-13,12.7v17.6H157.7z"/>
		<path d="M207.5,61.4l22,32.3l22.2-32.3h3.2L231,96.4v21.8h-3V96.3l-23.9-34.9H207.5z"/>
		<path class="st0" d="M263.9,118.2V61.4h7.6v50.4h33.4v6.4H263.9z"/>
		<path class="st0" d="M335.5,61.4h6.4l24.4,56.8h-8.1l-7.1-16.7h-25.1l-7,16.7H311L335.5,61.4z M349.5,96l-10.8-26.3L327.6,96
			H349.5z"/>
		<path class="st0" d="M420.3,103.6c0,2.2-0.5,4.2-1.4,6c-0.9,1.8-2.2,3.4-3.8,4.6c-1.6,1.3-3.5,2.3-5.6,3c-2.1,0.7-4.4,1-6.8,1
			h-28.4V61.4h29.8c2.1,0,4,0.4,5.6,1.3c1.7,0.9,3.1,2,4.3,3.3c1.2,1.4,2.1,2.9,2.7,4.6c0.6,1.7,1,3.5,1,5.2c0,2.8-0.7,5.4-2.2,7.8
			c-1.5,2.4-3.6,4.2-6.4,5.4c3.4,1,6.1,2.7,8.1,5.3C419.3,97,420.3,100,420.3,103.6z M381.9,67.6v19h19c1.3,0,2.6-0.3,3.7-0.8
			c1.1-0.5,2.1-1.2,2.9-2c0.8-0.9,1.5-1.9,1.9-3c0.5-1.1,0.7-2.4,0.7-3.6c0-1.3-0.2-2.6-0.7-3.8c-0.5-1.2-1.1-2.2-1.8-3
			c-0.8-0.9-1.7-1.5-2.8-2c-1.1-0.5-2.3-0.7-3.5-0.7H381.9z M412.6,102.3c0-1.3-0.2-2.5-0.7-3.7c-0.5-1.2-1.1-2.3-1.9-3.2
			c-0.8-0.9-1.8-1.6-2.9-2.2c-1.1-0.5-2.4-0.8-3.7-0.8h-21.4V112h20.8c1.4,0,2.7-0.3,3.9-0.8c1.2-0.5,2.2-1.2,3.1-2.1
			c0.9-0.9,1.6-1.9,2.1-3.1C412.4,104.8,412.6,103.6,412.6,102.3z"/>
	</g>
	<g>
		<g>
			<path d="M6,175.4c-0.1,0-0.2,0-0.3-0.1c-0.3-0.1-0.5-0.4-0.5-0.7v-56.8c0-0.4,0.4-0.8,0.8-0.8h56.8c0.3,0,0.6,0.2,0.7,0.5
				c0.1,0.3,0.1,0.6-0.2,0.9L6.6,175.2C6.4,175.3,6.2,175.4,6,175.4z M6.8,118.7v54.1l54.1-54.1H6.8z"/>
		</g>
		<g>
			<path d="M6,118.7c-0.1,0-0.2,0-0.3-0.1c-0.3-0.1-0.5-0.4-0.5-0.7V61.1c0-0.3,0.2-0.6,0.5-0.7c0.3-0.1,0.6-0.1,0.9,0.2l28.4,28.4
				c0.3,0.3,0.3,0.8,0,1.1L6.6,118.4C6.4,118.6,6.2,118.7,6,118.7z M6.8,63v53l26.5-26.5L6.8,63z"/>
		</g>
		<g>
			<path d="M62.8,118.7c-0.2,0-0.4-0.1-0.6-0.2L33.8,90c-0.3-0.3-0.3-0.8,0-1.1l28.4-28.4c0.2-0.2,0.6-0.3,0.9-0.2
				c0.3,0.1,0.5,0.4,0.5,0.7v56.8c0,0.3-0.2,0.6-0.5,0.7C63,118.6,62.9,118.7,62.8,118.7z M35.5,89.5L62,116V63L35.5,89.5z"/>
		</g>
		<g>
			<path d="M62.8,61.9c-0.2,0-0.4-0.1-0.6-0.2L33.8,33.3c-0.3-0.3-0.3-0.8,0-1.1L62.2,3.8c0.2-0.2,0.6-0.3,0.9-0.2
				c0.3,0.1,0.5,0.4,0.5,0.7v56.8c0,0.3-0.2,0.6-0.5,0.7C63,61.9,62.9,61.9,62.8,61.9z M35.5,32.7L62,59.2v-53L35.5,32.7z"/>
		</g>
		<g>
			<path d="M62.8,118.7H6c-0.3,0-0.6-0.2-0.7-0.5c-0.1-0.3-0.1-0.6,0.2-0.9l28.4-28.4c0.3-0.3,0.8-0.3,1.1,0l28.4,28.4
				c0.2,0.2,0.3,0.6,0.2,0.9C63.4,118.5,63.1,118.7,62.8,118.7z M7.9,117.1h53L34.4,90.6L7.9,117.1z"/>
		</g>
		<g>
			<path d="M34.4,90.3c-0.2,0-0.4-0.1-0.6-0.2L5.4,61.7c-0.2-0.2-0.3-0.6-0.2-0.9c0.1-0.3,0.4-0.5,0.7-0.5h56.8
				c0.3,0,0.6,0.2,0.7,0.5c0.1,0.3,0.1,0.6-0.2,0.9L34.9,90C34.8,90.2,34.6,90.3,34.4,90.3z M7.9,61.9l26.5,26.5l26.5-26.5H7.9z"/>
		</g>
		<g>
			<path d="M62.8,61.9H6c-0.3,0-0.6-0.2-0.7-0.5c-0.1-0.3-0.1-0.6,0.2-0.9l28.4-28.4c0.3-0.3,0.8-0.3,1.1,0l28.4,28.4
				c0.2,0.2,0.3,0.6,0.2,0.9C63.4,61.7,63.1,61.9,62.8,61.9z M7.9,60.3h53L34.4,33.8L7.9,60.3z"/>
		</g>
	</g>
</g>
</svg>
