<?xml version="1.0" encoding="utf-8"?>
<!-- Generator: Adobe Illustrator 22.0.0, SVG Export Plug-In . SVG Version: 6.00 Build 0)  -->
<svg version="1.1" id="Layer_1" xmlns="http://www.w3.org/2000/svg" xmlns:xlink="http://www.w3.org/1999/xlink" x="0px" y="0px"
	 width="394px" height="164.7px" viewBox="0 0 394 164.7" style="enable-background:new 0 0 394 164.7;" xml:space="preserve">
<style type="text/css">
	.logo-part{fill:none;stroke:#FFFFFF;stroke-width:2;stroke-linejoin:round;stroke-miterlimit:10;}
	.logo-text{fill:#FFFFFF;}
</style>
<g>
	<polygon class="logo-part" points="3.9,158.7 3.9,107.3 55.2,107.3 55.2,107.3 	"/>
	<polygon class="logo-part" points="3.9,56 3.9,107.3 29.5,81.7 	"/>
	<polygon class="logo-part" points="29.5,81.7 55.2,107.3 55.2,56 	"/>
	<polygon class="logo-part" points="29.5,30.3 55.2,56 55.2,4.7 	"/>
	<polygon class="logo-part" points="3.9,107.3 55.2,107.3 29.5,81.7 	"/>
	<polygon class="logo-part" points="3.9,56 55.2,56 29.5,81.7 	"/>
	<polygon class="logo-part" points="3.9,56 55.2,56 29.5,30.3 	"/>
</g>
<g>
	<path class="logo-text" d="M103.7,25.9V35h-7.5v-9.1H103.7z M103.7,45.5v61.8h-7.4V45.5H103.7z"/>
	<path class="logo-text" d="M120.3,107.3V45.5h4.4l2,4c1.8-3.2,4.8-5.2,9.1-5.2c8.8,0,12,4.7,12,14.2v48.8h-7.4V58.5
		c0-4.7-1.6-7.8-6.2-7.8c-4.7,0-6.5,3-6.5,7.9v48.7H120.3z"/>
	<path class="logo-text" d="M171.9,72.4l12-26.9h8.2l-14,29.8l15.2,32H185l-13.1-28.9v28.9h-7.4V19.6h7.4V72.4z"/>
	<path class="logo-text" d="M200.7,127.7V121c1.2,0.5,3.1,0.9,4.8,0.9c3.7,0,5.9-2.2,6.9-7.2l1.4-7.3l-12.1-61.9h7.7l8,48.3l7.9-48.3h7.7
		L219.6,115c-1.8,9.4-5.2,13.4-14.1,13.4C204,128.3,201.8,128,200.7,127.7z"/>
	<path class="logo-text" d="M265.8,19.1v6.6c-1.2-0.6-2.7-0.9-4.6-0.9c-4.6,0-5.9,2-5.9,7.4v13.3h9V52h-9v55.2h-7.4V52.1h-5.7v-6.5h5.7
		V32.2c0-9,2.7-13.8,13.1-13.8C262.6,18.3,264.5,18.6,265.8,19.1z"/>
	<path class="logo-text" d="M274.5,86.5c0-9.5,4.6-14.5,20.1-19.2v-9c0-4.6-1.9-7.7-6.1-7.7c-4.9,0-6.2,3.1-6.2,7.8v2.8H275v-3
		c0-8.3,3-14.1,13.5-14.1c10.6,0,13.5,5.8,13.5,14.1v48.9h-4.3l-2-3.7c-1.6,3.2-4.2,4.9-8.8,4.9c-8.8,0-12.5-4.7-12.5-14.1
		L274.5,86.5L274.5,86.5z M294.6,72.9c-10.5,3.3-12.7,7-12.7,13.5v8c0,4.8,1.6,7.7,6.4,7.7c4.6,0,6.3-3.2,6.3-7.7L294.6,72.9
		L294.6,72.9z"/>
	<path class="logo-text" d="M341.2,107.3l-2-3.8c-1.7,3.2-4.7,5.1-9.1,5.1c-8.8,0-12-4.7-12-14.2V58.6c0-9.6,3.1-14.3,11.7-14.3
		c3.7,0,6.8,1.9,8.4,4.5V19.6h7.4v87.7C345.6,107.3,341.2,107.3,341.2,107.3z M338.2,58.9c0-4.8-1.9-8.2-6.5-8.2s-6.2,3.2-6.2,7.9
		v35.6c0,4.8,1.6,7.9,6.2,7.9c4.7,0,6.5-3.1,6.5-7.9V58.9z"/>
	<path class="logo-text" d="M361.1,86.5c0-9.5,4.6-14.5,20.1-19.2v-9c0-4.6-1.9-7.7-6.1-7.7c-4.9,0-6.2,3.1-6.2,7.8v2.8h-7.3v-3
		c0-8.3,3-14.1,13.5-14.1c10.6,0,13.5,5.8,13.5,14.1v48.9h-4.3l-2-3.7c-1.6,3.2-4.2,4.9-8.8,4.9c-8.8,0-12.5-4.7-12.5-14.1
		L361.1,86.5L361.1,86.5z M381.2,72.9c-10.5,3.3-12.7,7-12.7,13.5v8c0,4.8,1.6,7.7,6.4,7.7c4.6,0,6.3-3.2,6.3-7.7L381.2,72.9
		L381.2,72.9z"/>
</g>
</svg>
