<?xml version="1.0" encoding="utf-8"?>
<!-- Generator: Adobe Illustrator 22.0.0, SVG Export Plug-In . SVG Version: 6.00 Build 0)  -->
<svg version="1.1" id="Layer_1" xmlns="http://www.w3.org/2000/svg" xmlns:xlink="http://www.w3.org/1999/xlink" x="0px" y="0px"
	 width="302.1px" height="164.7px" viewBox="0 0 302.1 164.7" style="enable-background:new 0 0 302.1 164.7;" xml:space="preserve"
	>
<style type="text/css">
	.st0{fill:#FFFFFF;}
	.st1{fill:#1F333E;}
	.st2{fill:#44606D;}
	.st3{fill:#547482;}
	.st4{fill:#90C2D9;}
	.st5{fill:#2A404A;}
	.st6{fill:#6A8FA1;}
	.st7{fill:#77A1B4;}
</style>
<g>
	<g>
		<rect x="220.2" y="56.1" class="st0" width="6" height="57"/>
		<path class="st0" d="M202.3,107.1h-18.5V93.4c0-5-1.6-9.1-4.8-12.1c-5.7-5.3-14.4-5.1-15.6-5h-5.9c6.9-10.7,20.8-18.7,21-18.8
			l-3.1-5.5c-0.8,0.5-19.8,11.4-26,26.2l-1.8,4.3h15.9h0.2c0.1,0,7.1-0.4,11,3.3c1.9,1.8,2.8,4.2,2.8,7.5V107h-41.3V76.8h-6V107h-18
			V76.3h-10.6c-8.5,0-20.3,5.8-20.3,18.7c0,5.6,1.6,9.4,3.6,12.1H66.3v-51h-6V107v6h6h64h6h66h6v-6V76.8h-6V107.1z M101.6,82.5h4.3
			V107H99c-3.3,0-5.7-0.9-6.2-1.1c-1.6-1-5.2-3.9-5.2-11C87.5,84.8,97.9,82.5,101.6,82.5z"/>
		<rect x="3.2" y="56.1" class="st0" width="6" height="57"/>
		<path class="st0" d="M30.3,71.9l-3.5,5.2C27,77.2,42.7,88.3,44.4,107H19.5v6.3h31.3v-3.1C50.8,86.2,31.2,72.5,30.3,71.9z"/>
		<path class="st0" d="M205.3,59.9c-2.6,0-4.7,2.1-4.7,4.6c0,2.6,2.1,4.7,4.7,4.7c2.6,0,4.7-2.1,4.7-4.7S207.9,59.9,205.3,59.9z"/>
		<path class="st0" d="M98.6,69.2c2.6,0,4.6-2.1,4.6-4.7s-2.1-4.6-4.6-4.6s-4.7,2.1-4.7,4.6C93.9,67.1,96,69.2,98.6,69.2z"/>
		<path class="st0" d="M127.2,118.5c-2.6,0-4.7,2.1-4.7,4.7s2.1,4.7,4.7,4.7c2.6,0,4.7-2.1,4.7-4.7S129.7,118.5,127.2,118.5z"/>
		<path class="st0" d="M140.9,118.5c-2.6,0-4.7,2.1-4.7,4.7s2.1,4.7,4.7,4.7c2.6,0,4.7-2.1,4.7-4.7S143.5,118.5,140.9,118.5z"/>
	</g>
	<g>
		<polygon class="st1" points="245.1,160.4 245.1,108.5 297,108.5 297,108.5 		"/>
		<polygon class="st2" points="245.1,56.6 245.1,108.5 271.1,82.6 		"/>
		<polygon class="st3" points="271.1,82.6 297,108.5 297,56.6 		"/>
		<polygon class="st4" points="271.1,30.7 297,56.6 297,4.8 		"/>
		<polygon class="st5" points="245.1,108.5 297,108.5 271.1,82.6 		"/>
		<polygon class="st6" points="245.1,56.6 297,56.6 271.1,82.6 		"/>
		<polygon class="st7" points="245.1,56.6 297,56.6 271.1,30.7 		"/>
	</g>
</g>
</svg>
