[
    {
        "isDataField": false,
        "name": "container_class",
        "label": "container_class",
        "default": "site-header light",
        "type": "text",
        "tab": ""
    },
    {
        "isDataField": false,
        "name": "DIRURL",
        "label": "DIRURL",
        "default": null,
        "type": "text",
        "tab": ""
    },
    {
        "isDataField": true,
        "name": "global.lang",
        "label": "global.lang",
        "default": null,
        "type": "text",
        "tab": ""
    }
]