<?xml version="1.0" encoding="utf-8"?>
<!-- Generator: Adobe Illustrator 22.0.0, SVG Export Plug-In . SVG Version: 6.00 Build 0)  -->
<svg version="1.1" xmlns="http://www.w3.org/2000/svg" xmlns:xlink="http://www.w3.org/1999/xlink" x="0px" y="0px" width="200px"
	 height="185px" viewBox="0 0 200 185" style="enable-background:new 0 0 200 185;" xml:space="preserve">
<g id="ar">
	<g>
		<g >
			<polygon points="-30.3,99.5 29.4,99.5 29.4,85.7 -30.3,85.7 -30.3,23 33.6,23 33.6,9.2 -45.3,9.2 -45.3,178.6 36.2,178.6 
				36.2,164.8 -30.3,164.8 			"/>
			<path d="M121.5,111.9c0,8.4,0.5,20.6,1.4,37.2c-3.8-9.1-9.8-22.9-14-31.5L70.1,33.8H55.4v144.8H70v-81c0-10-0.5-23.8-0.9-34.3
				c3.3,8.5,9.2,22.7,13,30.9l39,83.8l0.3,0.6h14.7V33.8h-14.6V111.9z"/>
			<path d="M194.9,98.5v13.4h27.7v24.5c0,17.8-9.9,28.4-26.5,28.4c-16.7,0-26.3-11.1-26.3-30.4V74c0-19.9,8.8-30.4,25.3-30.4
				c16.2,0,25.2,9.7,26.1,28v0.9h14.2v-1c-1-26.1-16.1-41.8-40.4-41.8c-24.8,0-39.6,16.5-39.6,44v60.6c0,27.3,15.5,44.2,40.6,44.2
				c24.6,0,40.6-16.6,40.6-42.2V98.5H194.9z"/>
		</g>
	</g>
	<g id="ar" >
		<path  d="M89,86.1h70.4v-17H89c-1.9,0-3.9,0.1-5.9,0.3V45.7c0-0.1,0.2-10.4,6.1-16.3c3-3,7-4.4,12.3-4.4H158V8h-56.5
			c-9.9,0-18.1,3.2-24.3,9.4c-11,11-11.1,27.6-11.1,28.3v28.5c-19.2,8.9-31.5,28.1-31.5,49.3c0,30,24.4,54.3,54.3,54.3h70.5v-17H89
			c-20.6,0-37.4-16.8-37.4-37.4C51.7,102.9,68.4,86.1,89,86.1z"/>
	</g>
	<g>
		<path d="M89.6,83.9h72.9V66.3H89.6c-2,0-4,0.1-6.1,0.3V42c0-0.1,0.2-10.7,6.3-16.8c3.1-3.1,7.2-4.6,12.7-4.6h58.5V3h-58.5
			c-10.3,0-18.7,3.3-25.2,9.7C66,24.1,65.9,41.3,65.9,42v29.5c-19.9,9.2-32.6,29.1-32.6,51c0,31,25.2,56.3,56.3,56.3h72.9v-17.6
			H89.6c-21.3,0-38.7-17.4-38.7-38.7C50.9,101.2,68.2,83.9,89.6,83.9z"/>
	</g>
</g>
<g id="en">
	<g >
		<path d="M87.4,158.8V178H1V3.2h83.7v19H21.5v57.7h58.7v18.7H21.5v60.2H87.4z"/>
		<path d="M198.8,94.9V178h-19.5V96.3c0-23.7-6.5-34.2-21.5-34.2c-15.7,0-26.2,13-26.2,35.5V178h-19.5V46.7h14.7l2.5,15.5
			c6.7-11.5,18-18.7,33.5-18.7C184.8,43.4,198.8,58.9,198.8,94.9z"/>
	</g>
</g>
<g id="fr" >
	<g >
		<path d="M43.4,22.2v59.4h55.9v19H43.4V178H23V3.2h80.9v19H43.4z"/>
		<path d="M187.5,45.4v20c-4.7-1.7-10-2.7-16.5-2.7c-17.5,0-29,12.7-29,35V178h-19.5V46.7h14.7l2.7,16c6.7-11.7,18-19,34-19
			C179.3,43.7,183.5,44.2,187.5,45.4z"/>
	</g>
</g>
</svg>
