<?xml version="1.0" encoding="utf-8"?>
<!-- Generator: Adobe Illustrator 16.0.0, SVG Export Plug-In . SVG Version: 6.00 Build 0)  -->
<!DOCTYPE svg PUBLIC "-//W3C//DTD SVG 1.1//EN" "http://www.w3.org/Graphics/SVG/1.1/DTD/svg11.dtd">
<svg version="1.1" id="Calque_1" xmlns="http://www.w3.org/2000/svg" xmlns:xlink="http://www.w3.org/1999/xlink" x="0px" y="0px"
	 width="350px" height="184px" viewBox="0 0 350 184" enable-background="new 0 0 350 184" xml:space="preserve">
<g>
	<path style="stroke-width:10; fill:red;" d="M237.084,11.125H112.913c-25.422,0-46.104,20.683-46.104,46.106v69.536c0,25.424,20.683,46.107,46.104,46.107h124.171
		c25.424,0,46.107-20.684,46.107-46.107V57.231C283.191,31.809,262.508,11.125,237.084,11.125z M237.084,160.131H112.913
		c-18.396,0-33.361-14.967-33.361-33.363V57.231c0-18.396,14.966-33.362,33.361-33.362h124.171
		c18.396,0,33.363,14.966,33.363,33.362v69.536C270.447,145.164,255.48,160.131,237.084,160.131z"/>
	<path d="M208.78,87.085l-52.936-33.821c-1.795-1.146-4.073-1.224-5.942-0.2c-1.868,1.024-3.03,2.985-3.03,5.115v67.643
		c0,2.131,1.162,4.092,3.03,5.115c0.875,0.479,1.839,0.717,2.802,0.717c1.094,0,2.186-0.309,3.141-0.918l52.936-33.822
		c1.678-1.07,2.692-2.924,2.692-4.914S210.458,88.157,208.78,87.085z M158.536,115.174V68.826L194.808,92L158.536,115.174z"/>
</g>
</svg>
