<?xml version="1.0" encoding="utf-8"?>
<!-- Generator: Adobe Illustrator 22.0.0, SVG Export Plug-In . SVG Version: 6.00 Build 0)  -->
<svg version="1.1" id="Layer_1" xmlns="http://www.w3.org/2000/svg" xmlns:xlink="http://www.w3.org/1999/xlink" x="0px" y="0px"
	 width="900px" height="276px" viewBox="0 0 900 276" style="enable-background:new 0 0 900 276;" xml:space="preserve">
<style type="text/css">
	.st0{fill:#262626;}
</style>
<g>
	<path class="st0" d="M193.7,27.6l-6.7-13.5c-4.4-8.8-15-12.4-23.7-8L50.7,61.9H68L193.7,27.6z"/>
	<path class="st0" d="M255.4,61.9l-5.5-20.3c-2.1-7.9-9.3-13.1-17.1-13.1c-1.6,0-3.1,0.2-4.7,0.6l-29.6,8.1l-90.2,24.6H255.4z"/>
	<path class="st0" d="M367,252.1c-7.9,0-14.9-7.7-14.9-15.8v-48.7h30.9v-18h-30.9v-38.8h-18.9v38.8h-14.9v18h14.9v49.2
		c0,18.7,14.9,33.4,33.4,33.4h22.2l-4.8-18H367z"/>
	<path class="st0" d="M448.9,167.3c-14,0-27.2,5.3-37.3,15.1c-9.9,10.1-15.4,23.3-15.4,37.3s5.5,27.2,15.4,37.3
		c10.1,9.9,23.3,15.4,37.3,15.4c14,0,27.2-5.5,37.1-15.4c10.1-10.1,15.6-23.3,15.6-37.3s-5.5-27.2-15.6-37.3
		C476.1,172.6,462.9,167.3,448.9,167.3z M448.9,253.6c-18.7,0-33.8-15.1-33.8-33.8c0-18.7,15.1-33.6,33.8-33.6
		c18.7,0,33.8,14.9,33.8,33.6C482.7,238.4,467.6,253.6,448.9,253.6z"/>
	<path class="st0" d="M596.2,227c0,14.7-12.5,26.8-27.7,26.8c-15.4,0-27.7-12.1-27.7-26.8v-57.5H522V227c0,12.3,4.8,23.7,13.6,32.3
		c8.8,8.6,20.4,12.9,32.9,12.9c12.3,0,23.9-4.4,32.7-12.9c8.8-8.6,13.8-20,13.8-32.3v-57.5h-18.9V227z"/>
	<path class="st0" d="M687.9,253.8c-18.7,0-33.8-15.4-33.8-34c0-18.7,15.1-34,33.8-34c11.2,0,21.1,5.7,27.2,14l15.1-11.2
		c-1.5-2.2-3.3-4.2-5.3-6.1c-9.9-9.9-23-15.1-37.1-15.1s-27.4,5.3-37.3,15.1c-9.9,10.1-15.4,23.3-15.4,37.3s5.5,27.2,15.4,37.3
		c9.9,9.9,23.3,15.1,37.3,15.1s27.2-5.3,37.1-15.1c2-2,3.7-4.2,5.5-6.4l-15.4-11.2C709,248.1,699.1,253.8,687.9,253.8z"/>
	<path class="st0" d="M796.1,167.6c-10.8,0-21.1,5-29.6,11.6V109h-18.9V270h18.9v-54c0-16.5,13.4-30.1,29.6-30.1
		c16.5,0,29.6,13.6,29.6,30.1v54h18.9v-54c0-13.2-5-25.2-14-34.5C821.3,172.4,809,167.6,796.1,167.6z"/>
	<path class="st0" d="M881.4,153.3c6.8,0,12.3-5.7,12.3-12.5c0-6.8-5.5-12.3-12.3-12.3c-7,0-12.5,5.5-12.5,12.3
		C868.9,147.6,874.4,153.3,881.4,153.3z"/>
	<rect x="872" y="169.5" class="st0" width="18.9" height="100.5"/>
	<path class="st0" d="M241.2,134.7c-10.3,4.5-16.5,12.8-16.6,22.2c-0.5,16.1,13,22.4,34.7,27.2c0,0,0.1,0,0.1,0
		c0.7,0.2,1.3,0.3,1.9,0.4c1.2,0.3,2.3,0.5,3.4,0.9c0.7,0.2,1.9,0.4,3,0.6c0.1,0,0.1,0,0.2,0c6.8,1.5,19.3,4.4,30.4,10.7
		c1.1,0.6,2.1,1.3,3.1,2v-48.3C281.4,133.1,258.9,127.3,241.2,134.7z M265.7,151.7c5.4,0,9.8,4.4,9.8,9.8c0,5.4-4.4,9.8-9.8,9.8
		c-5.4,0-9.8-4.4-9.8-9.8C255.9,156.1,260.3,151.7,265.7,151.7z"/>
	<path class="st0" d="M288.2,71.8H17.9c-7.3,0-13.2,7.7-13.2,17.3v164.6c0,9.5,5.9,17.3,13.2,17.3h211c-9.1-4.6-17.8-10.6-25.9-17.9
		c-1-0.9-1.6-2.2-1.7-3.6c-0.1-1.4,0.4-2.7,1.4-3.7l5.9-6.3c1.9-2,5.1-2.2,7.1-0.3c26.9,24.2,52.4,26.4,67.2,20.4
		c11.2-4.7,17.6-13.9,18-26.1c0.2-8.7-3.7-15.2-12.4-20.3c-9.2-5.3-20.8-7.6-24.6-8.3c-0.1,0-0.2-0.1-0.4-0.1
		c-1.6-0.5-2.6-0.7-3.7-0.9c-0.2,0-0.4-0.1-0.6-0.2c-0.6-0.2-1.4-0.4-2.4-0.6c-0.6-0.1-1.2-0.3-1.9-0.4l-0.5-0.1
		c-7.8-1.8-19.5-4.4-29.4-10.4c-13.3-8.1-20.1-20.3-19.6-35.5c0.2-8.5,3.1-16.6,8.2-23.4c4.8-6.5,11.5-11.7,19.8-15.4
		c11-4.7,24.1-5.6,38-2.8c10.6,2.1,20.5,6.1,29.9,12V89.1C301.5,79.5,295.5,71.8,288.2,71.8z M21.8,104.7c0-1.6,0.2-3.1,0.6-4.6
		l1.2,0.3c-0.4,1.4-0.6,2.8-0.6,4.3v0.6h-1.3V104.7z M21.8,110.4h1.3v5.1h-1.3V110.4z M21.8,120.6h1.3v5.1h-1.3V120.6z M21.8,130.8
		h1.3v5.1h-1.3V130.8z M21.8,141h1.3v5.1h-1.3V141z M21.8,151.2h1.3v5.1h-1.3V151.2z M21.8,161.4h1.3v5.1h-1.3V161.4z M21.8,171.6
		h1.3v5.1h-1.3V171.6z M21.8,181.7h1.3v5.1h-1.3V181.7z M21.8,191.9h1.3v5.1h-1.3V191.9z M21.8,202.1h1.3v5.1h-1.3V202.1z
		 M21.8,212.3h1.3v5.1h-1.3V212.3z M21.8,222.5h1.3v5.1h-1.3V222.5z M21.8,232.7h1.3v5.1h-1.3V232.7z M24.9,247.7
		c-1-1.4-1.9-3-2.4-4.7l1.2-0.4c0.5,1.6,1.2,3.1,2.2,4.3L24.9,247.7z M25.7,96.1l-1-0.7c1.1-1.5,2.4-2.7,3.9-3.6l0.7,1.1
		C27.8,93.6,26.7,94.7,25.7,96.1z M34.1,252.6c-1.8,0-3.5-0.5-5.2-1.4l0.6-1.1c1.4,0.8,3,1.2,4.6,1.2L34.1,252.6z M38.8,91.4h-4.6
		c-0.2,0-0.3,0-0.5,0l-0.1-1.3c0.2,0,0.3,0,0.5,0h4.6V91.4z M44.3,252.6h-5.1v-1.3h5.1V252.6z M48.9,91.4h-5.1v-1.3h5.1V91.4z
		 M54.5,252.6h-5.1v-1.3h5.1V252.6z M59.1,91.4H54v-1.3h5.1V91.4z M64.6,252.6h-5.1v-1.3h5.1V252.6z M69.3,91.4h-5.1v-1.3h5.1V91.4z
		 M74.8,252.6h-5.1v-1.3h5.1V252.6z M79.5,91.4h-5.1v-1.3h5.1V91.4z M85,252.6h-5.1v-1.3H85V252.6z M89.7,91.4h-5.1v-1.3h5.1V91.4z
		 M95.2,252.6h-5.1v-1.3h5.1V252.6z M99.9,91.4h-5.1v-1.3h5.1V91.4z M105.4,252.6h-5.1v-1.3h5.1V252.6z M110.1,91.4H105v-1.3h5.1
		V91.4z M115.6,252.6h-5.1v-1.3h5.1V252.6z M120.2,91.4h-5.1v-1.3h5.1V91.4z M125.8,252.6h-5.1v-1.3h5.1V252.6z M130.4,91.4h-5.1
		v-1.3h5.1V91.4z M135.9,252.6h-5.1v-1.3h5.1V252.6z M140.6,91.4h-5.1v-1.3h5.1V91.4z M146.1,252.6H141v-1.3h5.1V252.6z M150.8,91.4
		h-5.1v-1.3h5.1V91.4z M156.3,252.6h-5.1v-1.3h5.1V252.6z M161,91.4h-5.1v-1.3h5.1V91.4z M166.5,252.6h-5.1v-1.3h5.1V252.6z
		 M171.2,91.4h-5.1v-1.3h5.1V91.4z M176.7,252.6h-5.1v-1.3h5.1V252.6z M181.4,91.4h-5.1v-1.3h5.1V91.4z M186.9,252.6h-5.1v-1.3h5.1
		V252.6z M191.6,91.4h-5.1v-1.3h5.1V91.4z M194.5,252.6H192v-1.3h2.5V252.6z M201.7,91.4h-5.1v-1.3h5.1V91.4z M211.9,91.4h-5.1v-1.3
		h5.1V91.4z M222.1,91.4H217v-1.3h5.1V91.4z M232.3,91.4h-5.1v-1.3h5.1V91.4z M242.5,91.4h-5.1v-1.3h5.1V91.4z M252.7,91.4h-5.1
		v-1.3h5.1V91.4z M262.9,91.4h-5.1v-1.3h5.1V91.4z M273,91.4h-5.1v-1.3h5.1V91.4z M281.6,95.1c-1.1-1.3-2.4-2.2-3.8-2.9l0.5-1.2
		c1.6,0.7,3,1.8,4.3,3.2L281.6,95.1z M284,99.2l1.2-0.5c0.6,1.6,1,3.4,1.1,5.2L285,104C284.9,102.3,284.6,100.7,284,99.2z
		 M286.3,111.6H285v-2.5h1.3V111.6z"/>
</g>
</svg>
