<?xml version="1.0" encoding="utf-8"?>
<!-- Generator: Adobe Illustrator 22.0.0, SVG Export Plug-In . SVG Version: 6.00 Build 0)  -->
<svg version="1.1" id="Calque_1" xmlns="http://www.w3.org/2000/svg" xmlns:xlink="http://www.w3.org/1999/xlink" x="0px" y="0px"
	 width="602px" height="154px" viewBox="0 0 602 154" style="enable-background:new 0 0 602 154;" xml:space="preserve">
<style type="text/css">
	.st0{fill:#FFFDFD;}
</style>
<g>
	<rect x="213.4" y="56.2" class="st0" width="11.7" height="62.5"/>
	<path class="st0" d="M219.2,30.7c-4.4,0-7.8,3.4-7.8,7.6c0,4.2,3.4,7.8,7.8,7.8c4.2,0,7.6-3.5,7.6-7.8
		C226.9,34.1,223.5,30.7,219.2,30.7z"/>
	<path class="st0" d="M272.4,55c-6.7,0-13.1,3.1-18.4,7.2v-6h-11.7v62.5H254V85.1c0-10.2,8.3-18.7,18.4-18.7
		c10.2,0,18.4,8.5,18.4,18.7v33.5h11.7V85.1c0-8.2-3.1-15.7-8.7-21.4C288.1,58,280.5,55,272.4,55z"/>
	<polygon class="st0" points="367.4,56.2 350.6,56.2 323.4,81.4 323.4,18.6 311.7,18.6 311.7,118.7 323.4,118.7 323.4,97.1 
		334.2,87 357.1,118.7 372,118.7 343.1,78.8 	"/>
	<path class="st0" d="M421.4,91.9c0,9.1-7.8,16.6-17.2,16.6c-9.5,0-17.2-7.5-17.2-16.6V56.2h-11.7v35.7c0,7.6,3,14.7,8.5,20
		c5.5,5.3,12.7,8,20.5,8c7.6,0,14.9-2.7,20.3-8c5.5-5.3,8.6-12.4,8.6-20V56.2h-11.7V91.9z"/>
	<path class="st0" d="M447.4,103.1c-4.4,0-7.8,3.5-7.8,7.8c0,4.2,3.4,7.8,7.8,7.8c4.2,0,7.6-3.5,7.6-7.8
		C455,106.7,451.6,103.1,447.4,103.1z"/>
	<path class="st0" d="M498,54.8c-7.8,0-15.1,3.7-21,8.6V18.6h-11.7v100.1H477v-7.2c5.9,4.9,13.2,8.6,21,8.6c8.7,0,16.9-3.3,23-9.4
		c6.3-6.3,9.7-14.5,9.7-23.2c0-8.7-3.4-16.9-9.7-23.2C514.9,58.1,506.7,54.8,498,54.8z M498,108.6c-11.6,0-21-9.5-21-21.1
		c0-11.6,9.4-21.1,21-21.1c11.6,0,21,9.5,21,21.1C519,99,509.6,108.6,498,108.6z"/>
	<path class="st0" d="M595.8,90.3c0.1-1.2,0.3-4.4-0.7-10c-1.1-5.7-4-10.9-7.8-15.1c-5.6-6-13.1-9.4-21.3-9.4
		c-8,0-15.7,3.4-21.1,9.4c-3.8,4.2-6.5,9.4-7.8,15.1c-0.5,2.5-0.8,4.9-0.8,7.4c0,1,0,1.9,0.1,2.9c0.5,7.5,3.5,14.3,8.5,19.6
		c5.5,6.1,13,9.5,21.1,9.5c5.9-0.3,11.7-1.8,16.5-4.6c3.1-1.9,5.9-4.2,8.3-7l-9.8-5.9c-4,4-9.7,6.3-15.3,6.5
		c-9-0.1-16.8-7.9-18.1-18.3v-0.3H595.8z M548.7,80.2c2.9-8,9.8-13.5,17.3-13.5c7.6,0,14.6,5.5,17.3,13.5l0.1,0.3h-34.9L548.7,80.2z
		"/>
	<polygon class="st0" points="94.7,142 32.3,79.5 95.1,16.7 104,25.7 105.3,24.5 95.1,14.2 30.4,78.9 29.7,79.5 94.1,143.9 
		94.7,144.5 106.3,132.9 105,131.6 	"/>
	<polygon class="st0" points="68.4,143.4 6,81 68.8,18.2 77.8,27.2 79.1,25.9 68.8,15.7 4.1,80.4 3.5,81 67.8,145.3 68.4,146 
		80.1,134.3 78.8,133.1 	"/>
	<path class="st0" d="M55,77.6l65,65.3l64.7-64.7l0.6-0.6L120,12.5L55,77.6z M119.1,78.5v61l-60.6-61H119.1z M58.5,76.7l60.6-60.8
		v60.8H58.5z M120.9,78.5h61l-61,61V78.5z M120.9,76.7V15.9l61,60.8H120.9z"/>
</g>
</svg>
