<svg width="34" height="34" viewBox="0 0 34 34" fill="currentColor" xmlns="http://www.w3.org/2000/svg" id="icon">
<path d="M7.31926 11.8186L2.41193 8.98526C1.77273 8.61693 2.32126 7.62526 2.97859 8.00379L7.88593 10.8371C8.53193 11.2111 7.96753 12.1937 7.31926 11.8186ZM29.8885 24.8497L24.9811 22.0163C24.3419 21.6469 24.8905 20.6563 25.5478 21.0349L30.4551 23.8682C31.1011 24.2422 30.5367 25.2237 29.8885 24.8497ZM10.8439 7.87913L8.01059 2.97179C7.64113 2.33259 8.61126 1.74779 8.99206 2.40513L11.8254 7.31246C12.1994 7.95846 11.2179 8.52739 10.8439 7.87913ZM23.8739 30.4483L21.0405 25.541C20.6722 24.9018 21.6412 24.317 22.022 24.9743L24.8553 29.8817C25.2293 30.5277 24.2479 31.0966 23.8739 30.4483ZM21.0405 7.31133L23.8739 2.40399C24.2433 1.76593 25.2339 2.31333 24.8553 2.97066L22.022 7.87799C21.6503 8.52626 20.6665 7.96073 21.0405 7.31133ZM8.01059 29.8817L10.8439 24.9743C11.2123 24.3351 12.2039 24.8837 11.8254 25.541L8.99206 30.4483C8.61806 31.0943 7.63659 30.5299 8.01059 29.8817ZM24.9811 10.8349L29.8885 8.00153C30.5277 7.63319 31.1125 8.60446 30.4551 8.98413L25.5478 11.8175C24.9018 12.1915 24.3329 11.2089 24.9811 10.8349ZM2.41193 23.8682L7.31926 21.0349C7.95733 20.6665 8.54326 21.6355 7.88593 22.0163L2.97859 24.8497C2.33259 25.2237 1.76366 24.2422 2.41193 23.8682ZM26.6335 15.8669H32.3002C33.0369 15.8669 33.0595 17.0002 32.3002 17.0002H26.6335C25.8855 17.0002 25.8855 15.8669 26.6335 15.8669ZM0.566859 15.8669H6.23353C6.97019 15.8669 6.99286 17.0002 6.23353 17.0002H0.566859C-0.181141 17.0002 -0.181141 15.8669 0.566859 15.8669ZM17.0002 26.6335V32.3002C17.0002 33.0369 15.8669 33.0595 15.8669 32.3002V26.6335C15.8669 25.8855 17.0002 25.8855 17.0002 26.6335ZM17.0002 0.566859V6.23353C17.0002 6.97019 15.8669 6.99286 15.8669 6.23353V0.566859C15.8669 -0.181141 17.0002 -0.181141 17.0002 0.566859ZM16.4335 9.06686C12.3717 9.06686 9.06686 12.3717 9.06686 16.4335C9.06686 20.4954 12.3717 23.8002 16.4335 23.8002C20.4954 23.8002 23.8002 20.4954 23.8002 16.4335C23.8002 12.3717 20.4954 9.06686 16.4335 9.06686ZM16.4335 10.2002C19.8823 10.2002 22.6669 12.9848 22.6669 16.4335C22.6669 19.8834 19.8823 22.6669 16.4335 22.6669C12.9848 22.6669 10.2002 19.8834 10.2002 16.4335C10.2002 12.9848 12.9848 10.2002 16.4335 10.2002Z" fill="currentColor"/>
</svg>
