<svg width="40" height="39" viewBox="0 0 40 39" fill="none" xmlns="http://www.w3.org/2000/svg">
<path d="M39.6719 19.5C39.6719 8.73045 30.9414 0 20.1719 0C9.40232 0 0.671875 8.73045 0.671875 19.5C0.671875 30.2696 9.40232 39 20.1719 39C30.9414 39 39.6719 30.2696 39.6719 19.5Z" fill="white"/>
<path d="M14.1555 21.6738L8.8709 19.9344C8.8709 19.9344 8.23932 19.6755 8.44269 19.0885C8.48456 18.9675 8.569 18.8644 8.82163 18.6874C9.99257 17.8629 30.4947 10.4185 30.4947 10.4185C30.4947 10.4185 31.0735 10.2214 31.4149 10.3525C31.4994 10.3789 31.5754 10.4275 31.6351 10.4933C31.6949 10.5592 31.7363 10.6398 31.7551 10.7272C31.792 10.8813 31.8074 11.0398 31.8009 11.1984C31.7993 11.3355 31.7828 11.4625 31.7704 11.6618C31.6456 13.6971 27.9088 28.8874 27.9088 28.8874C27.9088 28.8874 27.6852 29.7763 26.8842 29.8067C26.6874 29.8132 26.4912 29.7794 26.3075 29.7077C26.1238 29.6359 25.9563 29.5275 25.8151 29.3889C24.2432 28.023 18.8102 24.3344 17.6097 23.5232C17.5826 23.5045 17.5598 23.4803 17.5428 23.452C17.5258 23.4236 17.515 23.392 17.5112 23.3592C17.4944 23.2736 17.5864 23.1677 17.5864 23.1677C17.5864 23.1677 27.0466 14.6727 27.2983 13.781C27.3178 13.7118 27.2442 13.6778 27.1454 13.708C26.517 13.9415 15.6248 20.8905 14.4226 21.6574C14.3361 21.6838 14.2446 21.6895 14.1555 21.6738Z" fill="#C8937D"/>
</svg>
