<svg width="48" height="48" viewBox="0 0 48 48" fill="none" xmlns="http://www.w3.org/2000/svg">
<path d="M30.2562 15.5548H31.6744L35.7164 11.5128L35.9149 9.79676C33.5994 7.75302 30.8011 6.3333 27.7844 5.67172C24.7677 5.01014 21.6321 5.12854 18.6738 6.01574C15.7155 6.90293 13.0323 8.52963 10.8775 10.7422C8.72271 12.9547 7.16754 15.68 6.35889 18.6607C6.80918 18.4762 7.30799 18.4462 7.77712 18.5756L15.8611 17.2425C15.8611 17.2425 16.2724 16.5617 16.4851 16.6043C18.2172 14.702 20.611 13.5337 23.1764 13.3386C25.7417 13.1435 28.2846 13.9363 30.2845 15.5548H30.2562Z" fill="#EA4335"/>
<path d="M41.4749 18.6603C40.5458 15.239 38.6383 12.1633 35.9863 9.81055L30.3134 15.4835C31.4957 16.4495 32.4431 17.6715 33.0844 19.0571C33.7256 20.4427 34.0438 21.9558 34.0149 23.4823V24.4893C34.678 24.4893 35.3345 24.6199 35.9471 24.8736C36.5597 25.1274 37.1162 25.4993 37.5851 25.9681C38.0539 26.4369 38.4258 26.9935 38.6795 27.6061C38.9333 28.2186 39.0639 28.8752 39.0639 29.5382C39.0639 30.2013 38.9333 30.8578 38.6795 31.4704C38.4258 32.0829 38.0539 32.6395 37.5851 33.1083C37.1162 33.5772 36.5597 33.9491 35.9471 34.2028C35.3345 34.4565 34.678 34.5871 34.0149 34.5871H23.9171L22.9102 35.6083V41.6641L23.9171 42.6711H34.0149C36.8347 42.693 39.5867 41.8068 41.8638 40.1435C44.1408 38.4801 45.822 36.128 46.6587 33.4352C47.4954 30.7423 47.443 27.8516 46.5095 25.1907C45.5759 22.5299 43.8106 20.2402 41.4749 18.6603Z" fill="#4285F4"/>
<path d="M13.8049 42.6149H23.9027V34.531H13.8049C13.0855 34.5308 12.3745 34.3761 11.7201 34.0771L10.3019 34.5168L6.23151 38.5588L5.87695 39.977C8.15951 41.7006 10.9447 42.6273 13.8049 42.6149Z" fill="#34A853"/>
<path d="M13.8044 16.3907C11.0684 16.4071 8.40578 17.2775 6.18848 18.8806C3.97118 20.4836 2.30993 22.7391 1.43674 25.3321C0.563554 27.9252 0.522043 30.7261 1.31801 33.3439C2.11397 35.9616 3.70766 38.2654 5.87648 39.9334L11.7338 34.0761C10.9895 33.7398 10.3378 33.228 9.83478 32.5845C9.33175 31.941 8.99235 31.185 8.8457 30.3815C8.69904 29.578 8.74952 28.7509 8.9928 27.9712C9.23608 27.1915 9.66489 26.4824 10.2424 25.9049C10.82 25.3273 11.5291 24.8985 12.3088 24.6552C13.0885 24.412 13.9156 24.3615 14.7191 24.5081C15.5226 24.6548 16.2785 24.9942 16.922 25.4972C17.5655 26.0002 18.0774 26.6519 18.4137 27.3962L24.271 21.5389C23.0416 19.9317 21.4571 18.6307 19.6414 17.7376C17.8256 16.8445 15.8279 16.3835 13.8044 16.3907Z" fill="#FBBC05"/>
</svg>
