<svg width="60" height="60" viewBox="0 0 60 60" fill="none" xmlns="http://www.w3.org/2000/svg">
<g clip-path="url(#clip0)">
<path d="M59 17H54.2002L54 14.9048C53.9507 14.3901 53.5171 13.9976 53 14H29C14.4175 14.0186 2.479 25.6026 2.021 40.1782C0.814941 40.5923 0.00390625 41.7251 0 43V45C0 45.5523 0.447754 46 1 46H47C47.5522 46 48 45.5523 48 45V42H49C49.5522 42 50 41.5523 50 41C50 38.794 52.2431 37 55 37C55.2827 37.0015 55.5522 36.8828 55.7431 36.6743C55.9336 36.4658 56.0268 36.186 56 35.9048L54.9692 25.1338L59.4468 22.8999C59.7876 22.73 60.0019 22.3809 60 22V18C60 17.4478 59.5522 17 59 17ZM46 44H2V43C2 42.4478 2.44775 42 3 42H46V44ZM48.1001 40H4.02002C4.57226 26.5996 15.5884 16.0161 29 16H52.0908L53.9072 35.0733C51.1235 35.3203 48.7973 37.294 48.1001 40ZM58 21.3818L54.7671 23L54.3862 19H58V21.3818Z" fill="#B5CEBF"/>
<path d="M49 20H30C23.9277 20.0073 19.0073 24.9277 19 31C19 31.5522 19.4478 32 20 32H49C49.5522 32 50 31.5522 50 31V21C50 20.4478 49.5522 20 49 20ZM26 30V29C26 28.4478 26.4478 28 27 28H31C31.5522 28 32 28.4478 32 29V30H26ZM48 30H34V29C34 27.3433 32.6567 26 31 26H27C25.3433 26 24 27.3433 24 29V30H21.0562C21.5703 25.4478 25.4185 22.0054 30 22H48V30Z" fill="#B5CEBF"/>
</g>
<defs>
<clipPath id="clip0">
<rect width="60" height="60" fill="white"/>
</clipPath>
</defs>
</svg>
