<svg width="60" height="60" viewBox="0 0 60 60" fill="none" xmlns="http://www.w3.org/2000/svg">
<g clip-path="url(#clip0)">
<path d="M58.9992 1.99999H43.9993V0.999996C43.9993 0.447752 43.552 0 42.9993 0C42.4471 0 41.9993 0.447752 41.9993 0.999996V1.99999H17.9994V0.999996C17.9994 0.447752 17.5521 0 16.9994 0C16.4472 0 15.9994 0.447752 15.9994 0.999996V1.99999H0.999457C0.447213 1.99999 -0.000539259 2.44775 -0.000539259 2.99999C-0.000539259 3.55223 0.447213 3.99999 0.999457 3.99999H15.9994V5.99998H11.9994C11.7689 5.99998 11.5453 6.08006 11.3666 6.22605L0.366647 15.226C-0.0254415 15.5463 -0.116261 16.1098 0.15571 16.5371L7.15568 27.537C7.31389 27.786 7.57414 27.952 7.86662 27.9911C8.1591 28.0292 8.45353 27.9374 8.67277 27.7401L10.9994 25.6239V58.9998C10.9994 59.552 11.4472 59.9998 11.9994 59.9998H47.9993C48.552 59.9998 48.9993 59.552 48.9993 58.9998V25.8378L51.3665 27.7738C51.5818 27.9501 51.8606 28.0287 52.136 27.9906C52.4114 27.9525 52.6589 27.8017 52.8186 27.5741L59.8186 17.5742C60.1071 17.162 60.0446 16.5996 59.6726 16.2612L48.6726 6.26121C48.4885 6.09324 48.2483 6.00047 47.9993 5.99998H43.9993V3.99999H58.9992C59.552 3.99999 59.9992 3.55223 59.9992 2.99999C59.9992 2.44775 59.552 1.99999 58.9992 1.99999ZM47.6126 7.99997L57.6755 17.1479L51.7986 25.5483L48.6326 22.9589C48.3342 22.7153 47.9221 22.6645 47.5735 22.8285C47.2249 22.9926 47.0012 23.3427 46.9993 23.7279V57.9998H12.9994V23.3642C12.9999 22.9682 12.7665 22.6093 12.4042 22.4491C12.0419 22.289 11.6195 22.3573 11.3266 22.6239L8.20548 25.4608L2.31976 16.2119L12.3568 7.99997H15.9994V8.99997C15.9994 9.55221 16.4472 9.99996 16.9994 9.99996C17.5521 9.99996 17.9994 9.55221 17.9994 8.99997V7.99997H23.0707C23.5653 11.4467 26.5179 14.0058 29.9993 14.0058C33.4813 14.0058 36.4339 11.4467 36.9285 7.99997H41.9993V8.99997C41.9993 9.55221 42.4471 9.99996 42.9993 9.99996C43.552 9.99996 43.9993 9.55221 43.9993 8.99997V7.99997H47.6126ZM41.9993 5.99998H35.9993C35.4471 5.99998 34.9993 6.44773 34.9993 6.99998C34.9993 9.76168 32.7611 12 29.9993 12C27.2381 12 24.9994 9.76168 24.9994 6.99998C24.9994 6.44773 24.5521 5.99998 23.9994 5.99998H17.9994V3.99999H41.9993V5.99998Z" fill="#F5E5C9"/>
</g>
<defs>
<clipPath id="clip0">
<rect width="60" height="60" fill="white"/>
</clipPath>
</defs>
</svg>
