<mxfile host="app.diagrams.net" modified="2020-08-04T17:59:35.035Z" agent="5.0 (Windows)" etag="_Q6E1hhbZebW1NN9CByg" version="13.5.9" type="gitlab">
  <diagram id="C5RBs43oDa-KdzZeNtuy" name="Page-1">
    <mxGraphModel dx="870" dy="623" grid="1" gridSize="10" guides="1" tooltips="1" connect="1" arrows="1" fold="1" page="1" pageScale="1" pageWidth="827" pageHeight="1169" math="0" shadow="0">
      <root>
        <mxCell id="WIyWlLk6GJQsqaUBKTNV-0" />
        <mxCell id="WIyWlLk6GJQsqaUBKTNV-1" parent="WIyWlLk6GJQsqaUBKTNV-0" />
        <mxCell id="uyDJ_8XVgsvvkE6BjcCt-0" value="Start" style="ellipse;whiteSpace=wrap;html=1;" parent="WIyWlLk6GJQsqaUBKTNV-1" vertex="1">
          <mxGeometry x="346" y="200" width="90" height="40" as="geometry" />
        </mxCell>
        <mxCell id="uyDJ_8XVgsvvkE6BjcCt-7" value="Procesy inicjacyjne" style="rounded=1;whiteSpace=wrap;html=1;fontSize=12;glass=0;strokeWidth=1;shadow=0;" parent="WIyWlLk6GJQsqaUBKTNV-1" vertex="1">
          <mxGeometry x="331" y="280" width="120" height="40" as="geometry" />
        </mxCell>
        <mxCell id="uyDJ_8XVgsvvkE6BjcCt-8" value="Detekcja twarzy" style="rounded=1;whiteSpace=wrap;html=1;fontSize=12;glass=0;strokeWidth=1;shadow=0;" parent="WIyWlLk6GJQsqaUBKTNV-1" vertex="1">
          <mxGeometry x="211" y="580" width="120" height="40" as="geometry" />
        </mxCell>
        <mxCell id="uyDJ_8XVgsvvkE6BjcCt-9" value="Wczytanie&lt;br&gt;obrazu" style="shape=parallelogram;perimeter=parallelogramPerimeter;whiteSpace=wrap;html=1;fixedSize=1;" parent="WIyWlLk6GJQsqaUBKTNV-1" vertex="1">
          <mxGeometry x="331" y="360" width="120" height="40" as="geometry" />
        </mxCell>
        <mxCell id="uyDJ_8XVgsvvkE6BjcCt-10" value="Detekcja punktów charakterystycznych należących do oka" style="rounded=1;whiteSpace=wrap;html=1;fontSize=12;glass=0;strokeWidth=1;shadow=0;" parent="WIyWlLk6GJQsqaUBKTNV-1" vertex="1">
          <mxGeometry x="331" y="660" width="120" height="50" as="geometry" />
        </mxCell>
        <mxCell id="kRn7SSrxejRdCxO8mhes-16" style="edgeStyle=orthogonalEdgeStyle;rounded=0;orthogonalLoop=1;jettySize=auto;html=1;exitX=0;exitY=0.5;exitDx=0;exitDy=0;entryX=0.25;entryY=1;entryDx=0;entryDy=0;entryPerimeter=0;endArrow=block;endFill=0;" edge="1" parent="WIyWlLk6GJQsqaUBKTNV-1" source="uyDJ_8XVgsvvkE6BjcCt-13" target="kRn7SSrxejRdCxO8mhes-11">
          <mxGeometry relative="1" as="geometry">
            <mxPoint x="192" y="480" as="targetPoint" />
          </mxGeometry>
        </mxCell>
        <mxCell id="uyDJ_8XVgsvvkE6BjcCt-13" value="Czy oko &lt;br&gt;jest otwarte?" style="rhombus;whiteSpace=wrap;html=1;shadow=0;fontFamily=Helvetica;fontSize=12;align=center;strokeWidth=1;spacing=6;spacingTop=-4;" parent="WIyWlLk6GJQsqaUBKTNV-1" vertex="1">
          <mxGeometry x="331" y="760" width="120" height="80" as="geometry" />
        </mxCell>
        <mxCell id="uyDJ_8XVgsvvkE6BjcCt-39" value="" style="edgeStyle=orthogonalEdgeStyle;rounded=0;orthogonalLoop=1;jettySize=auto;html=1;endArrow=block;endFill=0;entryX=0.25;entryY=1;entryDx=0;entryDy=0;entryPerimeter=0;" parent="WIyWlLk6GJQsqaUBKTNV-1" source="uyDJ_8XVgsvvkE6BjcCt-14" target="uyDJ_8XVgsvvkE6BjcCt-38" edge="1">
          <mxGeometry relative="1" as="geometry" />
        </mxCell>
        <mxCell id="uyDJ_8XVgsvvkE6BjcCt-14" value="Wyodrębnienie fragmentu obrazu zawierającego oko" style="rounded=1;whiteSpace=wrap;html=1;fontSize=12;glass=0;strokeWidth=1;shadow=0;" parent="WIyWlLk6GJQsqaUBKTNV-1" vertex="1">
          <mxGeometry x="480" y="575" width="120" height="50" as="geometry" />
        </mxCell>
        <mxCell id="uyDJ_8XVgsvvkE6BjcCt-18" value="" style="endArrow=block;html=1;exitX=0.5;exitY=1;exitDx=0;exitDy=0;rounded=0;endFill=0;entryX=0.5;entryY=0;entryDx=0;entryDy=0;" parent="WIyWlLk6GJQsqaUBKTNV-1" source="uyDJ_8XVgsvvkE6BjcCt-7" target="uyDJ_8XVgsvvkE6BjcCt-9" edge="1">
          <mxGeometry width="50" height="50" relative="1" as="geometry">
            <mxPoint x="411" y="200" as="sourcePoint" />
            <mxPoint x="411" y="240" as="targetPoint" />
          </mxGeometry>
        </mxCell>
        <mxCell id="uyDJ_8XVgsvvkE6BjcCt-19" value="" style="endArrow=block;html=1;exitX=0.5;exitY=1;exitDx=0;exitDy=0;rounded=0;endFill=0;entryX=0.5;entryY=0;entryDx=0;entryDy=0;" parent="WIyWlLk6GJQsqaUBKTNV-1" source="uyDJ_8XVgsvvkE6BjcCt-9" target="kRn7SSrxejRdCxO8mhes-0" edge="1">
          <mxGeometry width="50" height="50" relative="1" as="geometry">
            <mxPoint x="421" y="230" as="sourcePoint" />
            <mxPoint x="421" y="270" as="targetPoint" />
          </mxGeometry>
        </mxCell>
        <mxCell id="uyDJ_8XVgsvvkE6BjcCt-21" value="" style="endArrow=block;html=1;exitX=0.5;exitY=1;exitDx=0;exitDy=0;rounded=0;endFill=0;entryX=0.5;entryY=0;entryDx=0;entryDy=0;" parent="WIyWlLk6GJQsqaUBKTNV-1" source="uyDJ_8XVgsvvkE6BjcCt-10" target="uyDJ_8XVgsvvkE6BjcCt-13" edge="1">
          <mxGeometry width="50" height="50" relative="1" as="geometry">
            <mxPoint x="391" y="720" as="sourcePoint" />
            <mxPoint x="391" y="740" as="targetPoint" />
          </mxGeometry>
        </mxCell>
        <mxCell id="uyDJ_8XVgsvvkE6BjcCt-23" value="" style="endArrow=block;html=1;exitX=1;exitY=0.5;exitDx=0;exitDy=0;rounded=0;endFill=0;entryX=0.5;entryY=1;entryDx=0;entryDy=0;" parent="WIyWlLk6GJQsqaUBKTNV-1" source="uyDJ_8XVgsvvkE6BjcCt-13" target="uyDJ_8XVgsvvkE6BjcCt-14" edge="1">
          <mxGeometry width="50" height="50" relative="1" as="geometry">
            <mxPoint x="461" y="370" as="sourcePoint" />
            <mxPoint x="461" y="410" as="targetPoint" />
            <Array as="points">
              <mxPoint x="521" y="800" />
              <mxPoint x="540" y="800" />
            </Array>
          </mxGeometry>
        </mxCell>
        <mxCell id="uyDJ_8XVgsvvkE6BjcCt-27" value="Tak" style="text;html=1;strokeColor=none;fillColor=none;align=center;verticalAlign=middle;whiteSpace=wrap;rounded=0;" parent="WIyWlLk6GJQsqaUBKTNV-1" vertex="1">
          <mxGeometry x="451" y="780" width="40" height="20" as="geometry" />
        </mxCell>
        <mxCell id="uyDJ_8XVgsvvkE6BjcCt-29" value="Nie" style="text;html=1;strokeColor=none;fillColor=none;align=center;verticalAlign=middle;whiteSpace=wrap;rounded=0;" parent="WIyWlLk6GJQsqaUBKTNV-1" vertex="1">
          <mxGeometry x="291" y="780" width="40" height="20" as="geometry" />
        </mxCell>
        <mxCell id="uyDJ_8XVgsvvkE6BjcCt-34" value="" style="endArrow=block;html=1;exitX=0.5;exitY=1;exitDx=0;exitDy=0;rounded=0;endFill=0;entryX=0.5;entryY=0;entryDx=0;entryDy=0;" parent="WIyWlLk6GJQsqaUBKTNV-1" source="uyDJ_8XVgsvvkE6BjcCt-0" target="uyDJ_8XVgsvvkE6BjcCt-7" edge="1">
          <mxGeometry width="50" height="50" relative="1" as="geometry">
            <mxPoint x="391" y="240" as="sourcePoint" />
            <mxPoint x="401" y="210" as="targetPoint" />
          </mxGeometry>
        </mxCell>
        <mxCell id="uyDJ_8XVgsvvkE6BjcCt-40" style="edgeStyle=orthogonalEdgeStyle;rounded=0;orthogonalLoop=1;jettySize=auto;html=1;entryX=1;entryY=0.5;entryDx=0;entryDy=0;endArrow=block;endFill=0;exitX=0.75;exitY=0;exitDx=0;exitDy=0;exitPerimeter=0;" parent="WIyWlLk6GJQsqaUBKTNV-1" source="uyDJ_8XVgsvvkE6BjcCt-38" target="uyDJ_8XVgsvvkE6BjcCt-9" edge="1">
          <mxGeometry relative="1" as="geometry">
            <Array as="points">
              <mxPoint x="600" y="380" />
            </Array>
          </mxGeometry>
        </mxCell>
        <mxCell id="uyDJ_8XVgsvvkE6BjcCt-38" value="Algorytm ruchu kursora" style="shape=tape;whiteSpace=wrap;html=1;rounded=1;shadow=0;strokeWidth=1;glass=0;size=0.2;" parent="WIyWlLk6GJQsqaUBKTNV-1" vertex="1">
          <mxGeometry x="510" y="420" width="120" height="60" as="geometry" />
        </mxCell>
        <mxCell id="kRn7SSrxejRdCxO8mhes-0" value="Czy twarz &lt;br&gt;została wykryta na obrazie?" style="rhombus;whiteSpace=wrap;html=1;shadow=0;fontFamily=Helvetica;fontSize=12;align=center;strokeWidth=1;spacing=6;spacingTop=-4;" vertex="1" parent="WIyWlLk6GJQsqaUBKTNV-1">
          <mxGeometry x="331" y="475" width="120" height="80" as="geometry" />
        </mxCell>
        <mxCell id="kRn7SSrxejRdCxO8mhes-4" value="" style="endArrow=block;html=1;exitX=0.5;exitY=1;exitDx=0;exitDy=0;rounded=0;endFill=0;entryX=0.5;entryY=0;entryDx=0;entryDy=0;" edge="1" parent="WIyWlLk6GJQsqaUBKTNV-1" source="kRn7SSrxejRdCxO8mhes-0" target="uyDJ_8XVgsvvkE6BjcCt-10">
          <mxGeometry width="50" height="50" relative="1" as="geometry">
            <mxPoint x="401" y="430" as="sourcePoint" />
            <mxPoint x="401" y="470" as="targetPoint" />
            <Array as="points" />
          </mxGeometry>
        </mxCell>
        <mxCell id="kRn7SSrxejRdCxO8mhes-6" value="" style="endArrow=block;html=1;exitX=0;exitY=0.5;exitDx=0;exitDy=0;rounded=0;endFill=0;entryX=0.5;entryY=0;entryDx=0;entryDy=0;" edge="1" parent="WIyWlLk6GJQsqaUBKTNV-1" source="kRn7SSrxejRdCxO8mhes-0" target="uyDJ_8XVgsvvkE6BjcCt-8">
          <mxGeometry width="50" height="50" relative="1" as="geometry">
            <mxPoint x="411" y="440" as="sourcePoint" />
            <mxPoint x="411" y="480" as="targetPoint" />
            <Array as="points">
              <mxPoint x="271" y="515" />
            </Array>
          </mxGeometry>
        </mxCell>
        <mxCell id="kRn7SSrxejRdCxO8mhes-7" value="" style="endArrow=block;html=1;exitX=0.5;exitY=1;exitDx=0;exitDy=0;rounded=0;endFill=0;entryX=0;entryY=0.5;entryDx=0;entryDy=0;" edge="1" parent="WIyWlLk6GJQsqaUBKTNV-1" source="uyDJ_8XVgsvvkE6BjcCt-8" target="uyDJ_8XVgsvvkE6BjcCt-10">
          <mxGeometry width="50" height="50" relative="1" as="geometry">
            <mxPoint x="421" y="450" as="sourcePoint" />
            <mxPoint x="291" y="650" as="targetPoint" />
            <Array as="points">
              <mxPoint x="271" y="685" />
            </Array>
          </mxGeometry>
        </mxCell>
        <mxCell id="kRn7SSrxejRdCxO8mhes-8" value="Nie" style="text;html=1;strokeColor=none;fillColor=none;align=center;verticalAlign=middle;whiteSpace=wrap;rounded=0;" vertex="1" parent="WIyWlLk6GJQsqaUBKTNV-1">
          <mxGeometry x="282" y="495" width="40" height="20" as="geometry" />
        </mxCell>
        <mxCell id="kRn7SSrxejRdCxO8mhes-10" value="Tak" style="text;html=1;strokeColor=none;fillColor=none;align=center;verticalAlign=middle;whiteSpace=wrap;rounded=0;" vertex="1" parent="WIyWlLk6GJQsqaUBKTNV-1">
          <mxGeometry x="396" y="555" width="40" height="20" as="geometry" />
        </mxCell>
        <mxCell id="kRn7SSrxejRdCxO8mhes-15" style="edgeStyle=orthogonalEdgeStyle;rounded=0;orthogonalLoop=1;jettySize=auto;html=1;entryX=0;entryY=0.5;entryDx=0;entryDy=0;endArrow=block;endFill=0;exitX=0.75;exitY=0;exitDx=0;exitDy=0;exitPerimeter=0;" edge="1" parent="WIyWlLk6GJQsqaUBKTNV-1" source="kRn7SSrxejRdCxO8mhes-11" target="uyDJ_8XVgsvvkE6BjcCt-9">
          <mxGeometry relative="1" as="geometry">
            <Array as="points">
              <mxPoint x="240" y="380" />
            </Array>
          </mxGeometry>
        </mxCell>
        <mxCell id="kRn7SSrxejRdCxO8mhes-11" value="Generacja kliknięć" style="shape=tape;whiteSpace=wrap;html=1;rounded=1;shadow=0;strokeWidth=1;glass=0;size=0.2;" vertex="1" parent="WIyWlLk6GJQsqaUBKTNV-1">
          <mxGeometry x="150" y="420" width="120" height="60" as="geometry" />
        </mxCell>
      </root>
    </mxGraphModel>
  </diagram>
</mxfile>
