module ugautodetal/citilink-go

go 1.19

require (
	github.com/PuerkitoBio/goquery v1.8.0 // indirect
	github.com/andybalholm/cascadia v1.3.1 // indirect
	github.com/boltdb/bolt v1.3.1 // indirect
	github.com/gin-contrib/sse v0.1.0 // indirect
	github.com/gin-gonic/gin v1.8.1 // indirect
	github.com/go-playground/locales v0.14.0 // indirect
	github.com/go-playground/universal-translator v0.18.0 // indirect
	github.com/go-playground/validator/v10 v10.11.0 // indirect
	github.com/goccy/go-json v0.9.10 // indirect
	github.com/json-iterator/go v1.1.12 // indirect
	github.com/leodido/go-urn v1.2.1 // indirect
	github.com/mattn/go-isatty v0.0.14 // indirect
	github.com/modern-go/concurrent v0.0.0-20180306012644-bacd9c7ef1dd // indirect
	github.com/modern-go/reflect2 v1.0.2 // indirect
	github.com/mohae/deepcopy v0.0.0-20170929034955-c48cc78d4826 // indirect
	github.com/parnurzeal/gorequest v0.2.16 // indirect
	github.com/pelletier/go-toml/v2 v2.0.2 // indirect
	github.com/pkg/errors v0.9.1 // indirect
	github.com/richardlehane/mscfb v1.0.4 // indirect
	github.com/richardlehane/msoleps v1.0.1 // indirect
	github.com/ugorji/go/codec v1.2.7 // indirect
	github.com/xuri/efp v0.0.0-20220407160117-ad0f7a785be8 // indirect
	github.com/xuri/excelize/v2 v2.6.0 // indirect
	github.com/xuri/nfp v0.0.0-20220409054826-5e722a1d9e22 // indirect
	go.dtapp.net/gorandom v1.0.1 // indirect
	go.dtapp.net/gorequest v1.0.27 // indirect
	go.dtapp.net/gostring v1.0.6 // indirect
	go.dtapp.net/gotime v1.0.5 // indirect
	go.dtapp.net/gotrace_id v1.0.5 // indirect
	go.etcd.io/bbolt v1.3.6 // indirect
	golang.org/x/crypto v0.0.0-20220722155217-630584e8d5aa // indirect
	golang.org/x/exp v0.0.0-20220722155223-a9213eeb770e // indirect
	golang.org/x/net v0.0.0-20220812174116-3211cb980234 // indirect
	golang.org/x/sys v0.0.0-20220811171246-fbc7d0a398ab // indirect
	golang.org/x/text v0.3.7 // indirect
	google.golang.org/protobuf v1.28.1 // indirect
	gopkg.in/yaml.v2 v2.4.0 // indirect
	moul.io/http2curl v1.0.0 // indirect
	tideland.dev/go/slices v0.1.1 // indirect
)
