%YAML 1.1
%TAG !u! tag:unity3d.com,2011:
--- !u!114 &11400000
MonoBehaviour:
  m_ObjectHideFlags: 0
  m_CorrespondingSourceObject: {fileID: 0}
  m_PrefabInstance: {fileID: 0}
  m_PrefabAsset: {fileID: 0}
  m_GameObject: {fileID: 0}
  m_Enabled: 1
  m_EditorHideFlags: 0
  m_Script: {fileID: 11500000, guid: 24ee5213c35d0304fa6f5f2b97e552c8, type: 3}
  m_Name: Fructosa-1,6-Bifosfato
  m_EditorClassIdentifier: 
  cardType: {fileID: 11400000, guid: a7d105bcdd9fff3439eb0c539943905c, type: 2}
  properties:
  - stringValue: Fructosa-1,6-Bifosfato
    intValue: 0
    sprite: {fileID: 0}
    element: {fileID: 11400000, guid: 47e2c1069f08c98488f11bed0bef9063, type: 2}
  - stringValue: 
    intValue: 25
    sprite: {fileID: 0}
    element: {fileID: 11400000, guid: 9f919a37a9aa09344908f04ca9e21729, type: 2}
  - stringValue: 
    intValue: 0
    sprite: {fileID: 21300000, guid: 9c134e239daaddd47bcce18f1ce6f3fe, type: 3}
    element: {fileID: 11400000, guid: 838858937a841be4291cfdec893849c6, type: 2}
  - stringValue: Intermediario
    intValue: 0
    sprite: {fileID: 0}
    element: {fileID: 11400000, guid: 0142ee63d30479c4cb361b0235210b35, type: 2}
