%YAML 1.1
%TAG !u! tag:unity3d.com,2011:
--- !u!114 &11400000
MonoBehaviour:
  m_ObjectHideFlags: 0
  m_CorrespondingSourceObject: {fileID: 0}
  m_PrefabInstance: {fileID: 0}
  m_PrefabAsset: {fileID: 0}
  m_GameObject: {fileID: 0}
  m_Enabled: 1
  m_EditorHideFlags: 0
  m_Script: {fileID: 11500000, guid: c1b28e8fa08601341969f2b1a6a4df7b, type: 3}
  m_Name: ResourcesManager
  m_EditorClassIdentifier: 
  typeElement: {fileID: 11400000, guid: 0142ee63d30479c4cb361b0235210b35, type: 2}
  allCards:
  - {fileID: 11400000, guid: b75d0dd73a54e214e95ac34d66a74938, type: 2}
  - {fileID: 11400000, guid: 745bdcc1673a1734cb64e35ab3d668c9, type: 2}
  - {fileID: 11400000, guid: 2c68f1a3f57dd7b43b6b59a697c148e4, type: 2}
  - {fileID: 11400000, guid: fd54863de15924b42957a5797db14bc4, type: 2}
  - {fileID: 11400000, guid: cc880fab6d31ffe4386e8a28478525ec, type: 2}
  - {fileID: 11400000, guid: 78572c0faf56e5843be8196f8f3be20e, type: 2}
  - {fileID: 11400000, guid: 744bd3dcd82a6dc48bca8a96f3b1fdbb, type: 2}
  - {fileID: 11400000, guid: 5ba8dff34b0cae14f9baf394d06e4a1d, type: 2}
  - {fileID: 11400000, guid: 4e6bbf3c84b45434890f2a84f980f799, type: 2}
  - {fileID: 11400000, guid: af172441780fd27449162e091c9a0b81, type: 2}
  - {fileID: 11400000, guid: 98412f83afcae784e8f65a2028185a86, type: 2}
  - {fileID: 11400000, guid: 62090ba57eac97d44a5a46b3d5638524, type: 2}
  - {fileID: 11400000, guid: 28abbfef0c0484e49af9219ca6f758c7, type: 2}
  - {fileID: 11400000, guid: fcdd24379ea0b3447b9ba23cbd3f59f6, type: 2}
  - {fileID: 11400000, guid: 1dc2c1399f8f94a45b2a212577816566, type: 2}
  - {fileID: 11400000, guid: 9c550a407805c5d4abf35fbae1b2c3d3, type: 2}
  - {fileID: 11400000, guid: b92f0247931036d47a76b7f11e371c86, type: 2}
  - {fileID: 11400000, guid: 129b290f12a66784ebfce30d74b476ba, type: 2}
  - {fileID: 11400000, guid: 11389d765b0373c4d90ad8d009021925, type: 2}
  - {fileID: 11400000, guid: 1056f4736eb0fce4fa692ab255cbdcc6, type: 2}
  - {fileID: 11400000, guid: 29a0d368babd3aa4bac3c8868d15d987, type: 2}
  - {fileID: 11400000, guid: eb37f4b6c6ca78b499a12a88303e376e, type: 2}
  - {fileID: 11400000, guid: 337c4906472206d4387ee12bc20d845d, type: 2}
  - {fileID: 11400000, guid: e868c6640010be64cbdb3166cd30f38c, type: 2}
  - {fileID: 11400000, guid: de62a2c2cb677c54e88939e4eb1640e9, type: 2}
  - {fileID: 11400000, guid: a7050af2eef2c354c99625c11982ab43, type: 2}
  - {fileID: 11400000, guid: 0349b70e05d756d449f6e52e45f5661a, type: 2}
  - {fileID: 11400000, guid: 269d0a2405a291040b489f67475a0c93, type: 2}
  - {fileID: 11400000, guid: 55648f1835f2b0943b4fa5e5563f00d9, type: 2}
  - {fileID: 11400000, guid: 9e5bf5951a634d142af817ded0fcd2f9, type: 2}
  - {fileID: 11400000, guid: 156d72a28fddde34780adc3dda4b17bd, type: 2}
  - {fileID: 11400000, guid: f05814790cac0c641a4d5914c8076401, type: 2}
