%YAML 1.1
%TAG !u! tag:unity3d.com,2011:
--- !u!1045 &1
EditorBuildSettings:
  m_ObjectHideFlags: 0
  serializedVersion: 2
  m_Scenes:
  - enabled: 1
    path: Assets/Scenes/MainMenu.unity
    guid: 7cb27a1a39c0d7943b969a5571195080
  - enabled: 1
    path: Assets/Scenes/Instrucciones.unity
    guid: 95e90e7ce02018444a5303e17481dd2d
  - enabled: 1
    path: Assets/Scenes/Clasificacion.unity
    guid: a2b643347fad907478b4a59f84552d90
  - enabled: 1
    path: Assets/Scenes/Game 1.unity
    guid: b55a025c3e7c81141ab5061222a9056c
  m_configObjects: {}
