%YAML 1.1
%TAG !u! tag:unity3d.com,2011:
--- !u!114 &11400000
MonoBehaviour:
  m_ObjectHideFlags: 0
  m_CorrespondingSourceObject: {fileID: 0}
  m_PrefabInstance: {fileID: 0}
  m_PrefabAsset: {fileID: 0}
  m_GameObject: {fileID: 0}
  m_Enabled: 1
  m_EditorHideFlags: 0
  m_Script: {fileID: 11500000, guid: caf058626c684fa479f7def57793844f, type: 3}
  m_Name: Gliceraldehido-3-Fosfato
  m_EditorClassIdentifier: 
  card: {fileID: 11400000, guid: ae822199d184013418d8cd7db840bb66, type: 2}
  cofactorType: {fileID: 11400000, guid: a7d105bcdd9fff3439eb0c539943905c, type: 2}
  productType: {fileID: 11400000, guid: e604db5c00b422a4ebe418c2595a474d, type: 2}
  areaGrid: {fileID: 11400000, guid: 99376b2e17f10444f8eba90f0d7e14ec, type: 2}
  productGrid: {fileID: 11400000, guid: 3febd3e1e873a5141bdd2c662e9957dd, type: 2}
  cardDownLogic: {fileID: 11400000, guid: 1d87deb970aa3d6408ad0a5744ac3459, type: 2}
  areaName: Gliceraldehido-3-Fosfato
  isActive: 1
