<?xml version="1.0" encoding="utf-8"?>
<!-- Generator: Adobe Illustrator 23.0.4, SVG Export Plug-In . SVG Version: 6.00 Build 0)  -->
<svg version="1.1" id="Layer_1" xmlns="http://www.w3.org/2000/svg" xmlns:xlink="http://www.w3.org/1999/xlink" x="0px" y="0px"
	 viewBox="0 0 50 50" style="enable-background:new 0 0 50 50;" xml:space="preserve">
<g>
	<path fill="currentColor" class="st0" d="M35,15.7c0-0.1-0.1-0.1-0.1-0.1H15.4c-0.1,0-0.1,0.1-0.1,0.1v12.6H35V15.7z M33.7,26.8H16.6v-9.8h17.1V26.8z"
		/>
	<path fill="currentColor" class="st0" d="M35.3,29.5H15.1l-2.4,4.7c0,0.1,0,0.1,0,0.1c0,0,0.1,0.1,0.1,0.1h24.8c0.1,0,0.1,0,0.1-0.1c0,0,0-0.1,0-0.1
		L35.3,29.5z M20.5,32.8l0.7-1.8h7.9l0.7,1.8H20.5z"/>
	<path fill="currentColor" class="st0" d="M25,0C11.2,0,0,11.2,0,25s11.2,25,25,25s25-11.2,25-25S38.8,0,25,0z M38.7,35c-0.2,0.4-0.7,0.6-1.1,0.6H12.8
		c-0.5,0-0.9-0.2-1.1-0.6c-0.2-0.4-0.3-0.9,0-1.3l2.5-4.9v-13c0-0.7,0.6-1.3,1.3-1.3h19.5c0.7,0,1.3,0.6,1.3,1.3v13l2.5,4.9
		C38.9,34.1,38.9,34.6,38.7,35z"/>
</g>
</svg>
