<svg width="369px" height="9px" viewBox="0 0 369 9" version="1.1" xmlns="http://www.w3.org/2000/svg" xmlns:xlink="http://www.w3.org/1999/xlink">
    <!-- Generator: Sketch 55.2 (78181) - https://sketchapp.com -->
    <title>Line</title>
    <desc>Created with Sketch.</desc>
    <g id="Symbols" stroke="none" stroke-width="1" fill="none" fill-rule="evenodd">
        <g id="Section/50-50/Blog/The-Latest/Desktop" transform="translate(-131.000000, -285.000000)" fill="#000000" fill-rule="nonzero">
            <polygon id="Line" points="131 294 131 285 500 285 500 294"></polygon>
        </g>
    </g>
</svg>