<svg width="21" height="25" viewBox="0 0 21 25" fill="none" xmlns="http://www.w3.org/2000/svg">
<path d="M19.18 1.34H1.81995C1.47771 1.34 1.19995 1.61776 1.19995 1.96V5.68C1.19995 6.02224 1.47771 6.3 1.81995 6.3H3.05995C3.40219 6.3 3.67995 6.02224 3.67995 5.68V3.82H9.25995V21.18H7.39995C7.05771 21.18 6.77995 21.4578 6.77995 21.8V23.04C6.77995 23.3822 7.05771 23.66 7.39995 23.66H13.6C13.9422 23.66 14.22 23.3822 14.22 23.04V21.8C14.22 21.4578 13.9422 21.18 13.6 21.18H11.74V3.82H17.32V5.68C17.32 6.02224 17.5977 6.3 17.94 6.3H19.18C19.5222 6.3 19.8 6.02224 19.8 5.68V1.96C19.8 1.61776 19.5222 1.34 19.18 1.34Z" fill="black" stroke="black" stroke-width="1.24" stroke-miterlimit="10" stroke-linejoin="round"/>
</svg>
