<svg width="16" height="28" viewBox="0 0 16 28" fill="none" xmlns="http://www.w3.org/2000/svg">
<path fill-rule="evenodd" clip-rule="evenodd" d="M14.2388 27.5966C14.5402 27.5966 14.8416 27.4832 15.0715 27.2555C15.5307 26.8003 15.5307 26.0622 15.0715 25.6069L3.34546 14L15.0715 2.39321C15.5307 1.93792 15.5307 1.19982 15.0715 0.744527C14.6116 0.290012 13.866 0.290012 13.406 0.744527L0.84798 13.1757C0.388826 13.631 0.388826 14.3691 0.84798 14.8244L13.406 27.2555C13.636 27.4832 13.9374 27.5966 14.2388 27.5966Z" fill="#333333"/>
</svg>
