<?xml version="1.0"?>
<svg xmlns="http://www.w3.org/2000/svg" xmlns:xlink="http://www.w3.org/1999/xlink" version="1.1" id="Capa_1" x="0px" y="0px" width="512px" height="512px" viewBox="0 0 512 512" style="enable-background:new 0 0 512 512;" xml:space="preserve" class=""><g><g>
	<path d="M256,0C114.609,0,0,114.609,0,256c0,141.391,114.609,256,256,256c141.391,0,256-114.609,256-256   C512,114.609,397.391,0,256,0z M256,472c-119.297,0-216-96.703-216-216S136.703,40,256,40s216,96.703,216,216S375.297,472,256,472z   " data-original="#000000" class="active-path" data-old_color="#ffffff" fill="#ffffff"/>
	<path d="M335.688,240H320l0.047-46.219c0-27.5-28.562-49.781-63.875-49.781c-35.266,0-63.875,22.281-63.875,49.781L192,240h-16.031   c-8.828,0-15.625,7.125-15.625,14L160,354c0,6.875,7.484,14,16.312,14h159.75c8.797,0,15.594-7.125,15.594-14L352,254   C352,247.125,344.484,240,335.688,240z M224,192c0-13.719,14.594-23.117,32.172-23.117c17.594,0,31.828,9.398,31.828,23.117   l-0.219,48H224V192z" data-original="#000000" class="active-path" data-old_color="#ffffff" fill="#ffffff"/>
</g></g> </svg>
