{
    "/js/app.js": "/js/app.js?id=c0d8a5a98369a99a0d84",
    "/css/app.css": "/css/app.css?id=11ec8ae10c5f25d18f4f",
    "/js/admin.js": "/js/admin.js?id=948fc7126c8292492f0a",
    "/css/admin.css": "/css/admin.css?id=4b935c5e753f34a96525",
    "/js/admin.js.map": "/js/admin.js.map?id=9335c72e6bc527559dd9",
    "/img/sprite.svg": "/img/sprite.svg?id=45db1f7302c720ba4dba",
    "/css/auth.css": "/css/auth.css?id=9ecfd2270bfc468680c7",
    "/auth/socials.svg": "/auth/socials.svg?id=c815da213852645234a7"
}
