<?xml version="1.0" encoding="utf-8"?>
<!-- Generator: Adobe Illustrator 21.0.0, SVG Export Plug-In . SVG Version: 6.00 Build 0)  -->
<svg version="1.1" id="Слой_1" xmlns="http://www.w3.org/2000/svg" xmlns:xlink="http://www.w3.org/1999/xlink" x="0px" y="0px"
	 viewBox="0 0 520 496" style="enable-background:new 0 0 520 496;" xml:space="preserve">
<style type="text/css">
	.st0{fill:#E2E2E2;}
	.st1{fill:#CECECE;}
	.st2{fill:#3068E8;}
	.st3{fill:#D3D3D3;}
	.st4{fill:#3F80EA;}
	.st5{fill:#D8D8D8;}
	.st6{fill:#AAAAAA;}
	.st7{fill:#FFFFFF;}
</style>
<title>pie-chart111</title>
<path class="st0" d="M50.8,27h416.1c7.1,0,12.8,5.7,12.8,12.8v416.1c0,7.1-5.7,12.8-12.8,12.8H50.8c-7.1,0-12.8-5.7-12.8-12.8V39.8
	C38,32.7,43.7,27,50.8,27z"/>
<path class="st1" d="M50.8,27h416c7.1,0,12.9,5.8,12.9,12.9l0,0l0,0v22.7H38V39.7C38,32.7,43.7,27,50.8,27L50.8,27z"/>
<path class="st2" d="M326.5,431H195c-3.9,0-7-3.2-7-7V199.8c0-3.9,3.2-7,7-7h131.4c3.9,0,7,3.2,7,7V424
	C333.5,427.8,330.3,431,326.5,431z"/>
<path class="st3" d="M68.2,333.2h107.9c1.6,0,3,1.3,3,3l0,0c0,1.6-1.4,3-3,3H68.2c-1.7,0-3-1.4-3-3l0,0
	C65.2,334.5,66.5,333.2,68.2,333.2z"/>
<path class="st3" d="M67.2,355.3h107.9c1.6,0,3,1.3,3,3l0,0c0,1.6-1.4,3-3,3H67.2c-1.7,0-3-1.4-3-3l0,0
	C64.2,356.6,65.5,355.3,67.2,355.3z"/>
<path class="st3" d="M68.2,387.4H117c1.7,0,3,1.3,3,3l0,0c0,1.6-1.3,3-3,3H68.2c-1.7,0-3-1.4-3-3l0,0
	C65.2,388.7,66.5,387.4,68.2,387.4z"/>
<path class="st4" d="M207.6,333.2h107.9c1.6,0,3,1.3,3,3l0,0c0,1.6-1.4,3-3,3H207.6c-1.6,0-3-1.4-3-3l0,0
	C204.6,334.5,205.9,333.2,207.6,333.2z"/>
<path class="st4" d="M206.6,355.3h107.9c1.6,0,3,1.3,3,3l0,0c0,1.6-1.4,3-3,3H206.6c-1.6,0-3-1.4-3-3l0,0
	C203.6,356.6,204.9,355.3,206.6,355.3z"/>
<path class="st4" d="M207.6,387.4h48.9c1.6,0,3,1.3,3,3l0,0c0,1.6-1.4,3-3,3h-48.9c-1.6,0-3-1.4-3-3l0,0
	C204.6,388.7,205.9,387.4,207.6,387.4z"/>
<path class="st3" d="M346.2,333.2h107.9c1.6,0,3,1.3,3,3l0,0c0,1.6-1.4,3-3,3H346.2c-1.6,0-3-1.4-3-3l0,0
	C343.2,334.5,344.6,333.2,346.2,333.2z"/>
<path class="st3" d="M345.2,355.3h107.9c1.6,0,3,1.3,3,3l0,0c0,1.6-1.4,3-3,3H345.2c-1.6,0-3-1.4-3-3l0,0
	C342.2,356.6,343.6,355.3,345.2,355.3z"/>
<path class="st3" d="M346.2,387.4h48.9c1.6,0,3,1.3,3,3l0,0c0,1.6-1.4,3-3,3h-48.9c-1.6,0-3-1.4-3-3l0,0
	C343.2,388.7,344.6,387.4,346.2,387.4z"/>
<path class="st5" d="M172.3,306.4H71.9c-4.9,0-8.9-4-8.9-8.9v-83.1c0-4.9,4-8.9,8.9-8.9h100.4c4.9,0,8.9,4,8.9,8.9v83.1
	C181.2,302.4,177.2,306.4,172.3,306.4z"/>
<g>
	<g>
	</g>
	<g>
	</g>
	<g>
	</g>
	<g>
	</g>
	<g>
	</g>
	<g>
	</g>
	<g>
	</g>
	<g>
	</g>
	<g>
	</g>
	<g>
	</g>
	<g>
	</g>
	<g>
	</g>
	<g>
	</g>
	<g>
	</g>
	<g>
	</g>
</g>
<g>
	<path class="st6" d="M108.3,248.6c4.1,0,7.4-3.3,7.4-7.4c0-4.1-3.3-7.4-7.4-7.4s-7.4,3.3-7.4,7.4
		C100.8,245.2,104.2,248.6,108.3,248.6z M108.3,237.4c2.1,0,3.7,1.7,3.7,3.7c0,2.1-1.7,3.7-3.7,3.7c-2.1,0-3.7-1.7-3.7-3.7
		S106.2,237.4,108.3,237.4z"/>
	<path class="st6" d="M152.4,264l-18.6-18.6c-0.7-0.7-1.9-0.7-2.6,0l-10,10l2.6,2.6l8.7-8.7l16.8,16.7v8.5h-14.1l-21.8-21.8
		c-0.7-0.7-1.9-0.7-2.6,0l-16.7,16.7c-0.3,0.3-0.5,0.8-0.5,1.3v5.6c0,1,0.8,1.9,1.9,1.9h55.8c1,0,1.9-0.8,1.9-1.9v-11.2
		C152.9,264.8,152.7,264.3,152.4,264L152.4,264z M97.1,274.6v-3l14.9-14.9l17.8,17.8H97.1z"/>
</g>
<g>
	<path class="st7" d="M247.2,248.6c4.1,0,7.4-3.3,7.4-7.4c0-4.1-3.3-7.4-7.4-7.4c-4.1,0-7.4,3.3-7.4,7.4
		C239.7,245.2,243.1,248.6,247.2,248.6z M247.2,237.4c2.1,0,3.7,1.7,3.7,3.7c0,2.1-1.7,3.7-3.7,3.7c-2.1,0-3.7-1.7-3.7-3.7
		S245.1,237.4,247.2,237.4z"/>
	<path class="st7" d="M291.3,264l-18.6-18.6c-0.7-0.7-1.9-0.7-2.6,0l-10,10l2.6,2.6l8.7-8.7l16.8,16.7v8.5H274l-21.8-21.8
		c-0.7-0.7-1.9-0.7-2.6,0l-16.7,16.7c-0.3,0.3-0.5,0.8-0.5,1.3v5.6c0,1,0.8,1.9,1.9,1.9H290c1,0,1.9-0.8,1.9-1.9v-11.2
		C291.8,264.8,291.6,264.3,291.3,264L291.3,264z M236,274.6v-3l14.9-14.9l17.8,17.8H236z"/>
</g>
<path class="st5" d="M448.8,306.4H348.5c-4.9,0-8.9-4-8.9-8.9v-83.1c0-4.9,4-8.9,8.9-8.9h100.4c4.9,0,8.9,4,8.9,8.9v83.1
	C457.7,302.4,453.7,306.4,448.8,306.4z"/>
<g>
	<path class="st6" d="M384.8,248.6c4.1,0,7.4-3.3,7.4-7.4c0-4.1-3.3-7.4-7.4-7.4s-7.4,3.3-7.4,7.4
		C377.4,245.2,380.7,248.6,384.8,248.6z M384.8,237.4c2.1,0,3.7,1.7,3.7,3.7c0,2.1-1.7,3.7-3.7,3.7s-3.7-1.7-3.7-3.7
		S382.7,237.4,384.8,237.4z"/>
	<path class="st6" d="M428.9,264l-18.6-18.6c-0.7-0.7-1.9-0.7-2.6,0l-10,10l2.6,2.6l8.7-8.7l16.8,16.7v8.5h-14.1l-21.8-21.8
		c-0.7-0.7-1.9-0.7-2.6,0l-16.7,16.7c-0.3,0.3-0.5,0.8-0.5,1.3v5.6c0,1,0.8,1.9,1.9,1.9h55.8c1,0,1.9-0.8,1.9-1.9v-11.2
		C429.5,264.8,429.3,264.3,428.9,264L428.9,264z M373.6,274.6v-3l14.9-14.9l17.8,17.8H373.6z"/>
</g>
<circle class="st1" cx="108.3" cy="127.2" r="38.8"/>
<path class="st1" d="M325.8,116.1H174c-1.8,0-3.3-1.5-3.3-3.3v0c0-1.8,1.5-3.3,3.3-3.3h151.8c1.8,0,3.3,1.5,3.3,3.3v0
	C329.1,114.6,327.6,116.1,325.8,116.1z"/>
<path class="st1" d="M415.8,139.6H174c-1.8,0-3.3-1.5-3.3-3.3l0,0c0-1.8,1.5-3.3,3.3-3.3h241.8c1.8,0,3.3,1.5,3.3,3.3l0,0
	C419.1,138.1,417.6,139.6,415.8,139.6z"/>
<path class="st1" d="M454.4,139.6h-19.5c-1.8,0-3.3-1.5-3.3-3.3l0,0c0-1.8,1.5-3.3,3.3-3.3h19.5c1.8,0,3.3,1.5,3.3,3.3l0,0
	C457.7,138.1,456.2,139.6,454.4,139.6z"/>
</svg>
