<?xml version="1.0" encoding="utf-8"?>
<!-- Generator: Adobe Illustrator 21.0.0, SVG Export Plug-In . SVG Version: 6.00 Build 0)  -->
<svg version="1.1" xmlns="http://www.w3.org/2000/svg" xmlns:xlink="http://www.w3.org/1999/xlink" x="0px" y="0px"
	 viewBox="0 0 520 496" style="enable-background:new 0 0 520 496;" xml:space="preserve">
<style type="text/css">
	.st0{display:none;}
	.st1{display:inline;fill:#E2E2E2;}
	.st2{display:inline;fill:#CECECE;}
	.st3{display:inline;fill:#3068E8;}
	.st4{display:inline;fill:#D3D3D3;}
	.st5{display:inline;fill:#3F80EA;}
	.st6{display:inline;fill:#D8D8D8;}
	.st7{display:inline;}
	.st8{fill:#AAAAAA;}
	.st9{fill:#FFFFFF;}
	.st10{fill:#E2E2E2;}
	.st11{fill:#CECECE;}
	.st12{fill:#C1C1C1;}
	.st13{fill:#DBDBDB;}
	.st14{fill:#D8D8D8;}
	.st15{fill:#D6D6D6;}
	.st16{opacity:0.2;clip-path:url(#SVGID_2_);fill:#EAEAEA;}
	.st17{fill:#B2B2B2;}
	.st18{fill:#2C74DD;}
	.st19{fill:#A8A8A8;}
	.st20{fill:#DDDDDD;}
	.st21{fill:#EDEDED;}
	.st22{fill:#C9C9C9;}
	.st23{fill:#D1D1D1;}
</style>
<g id="Слой_1" class="st0">
	<title>pie-chart111</title>
	<path class="st1" d="M50.8,27h416.1c7.1,0,12.8,5.7,12.8,12.8v416.1c0,7.1-5.7,12.8-12.8,12.8H50.8c-7.1,0-12.8-5.7-12.8-12.8V39.8
		C38,32.7,43.7,27,50.8,27z"/>
	<path class="st2" d="M50.8,27h416c7.1,0,12.9,5.8,12.9,12.9l0,0l0,0v22.7H38V39.7C38,32.7,43.7,27,50.8,27L50.8,27z"/>
	<path class="st3" d="M326.5,431H195c-3.9,0-7-3.2-7-7V199.8c0-3.9,3.2-7,7-7h131.4c3.9,0,7,3.2,7,7V424
		C333.5,427.8,330.3,431,326.5,431z"/>
	<path class="st4" d="M68.2,333.2h107.9c1.6,0,3,1.3,3,3l0,0c0,1.6-1.4,3-3,3H68.2c-1.7,0-3-1.4-3-3l0,0
		C65.2,334.5,66.5,333.2,68.2,333.2z"/>
	<path class="st4" d="M67.2,355.3h107.9c1.6,0,3,1.3,3,3l0,0c0,1.6-1.4,3-3,3H67.2c-1.7,0-3-1.4-3-3l0,0
		C64.2,356.6,65.5,355.3,67.2,355.3z"/>
	<path class="st4" d="M68.2,387.4H117c1.7,0,3,1.3,3,3l0,0c0,1.6-1.3,3-3,3H68.2c-1.7,0-3-1.4-3-3l0,0
		C65.2,388.7,66.5,387.4,68.2,387.4z"/>
	<path class="st5" d="M207.6,333.2h107.9c1.6,0,3,1.3,3,3l0,0c0,1.6-1.4,3-3,3H207.6c-1.6,0-3-1.4-3-3l0,0
		C204.6,334.5,205.9,333.2,207.6,333.2z"/>
	<path class="st5" d="M206.6,355.3h107.9c1.6,0,3,1.3,3,3l0,0c0,1.6-1.4,3-3,3H206.6c-1.6,0-3-1.4-3-3l0,0
		C203.6,356.6,204.9,355.3,206.6,355.3z"/>
	<path class="st5" d="M207.6,387.4h48.9c1.6,0,3,1.3,3,3l0,0c0,1.6-1.4,3-3,3h-48.9c-1.6,0-3-1.4-3-3l0,0
		C204.6,388.7,205.9,387.4,207.6,387.4z"/>
	<path class="st4" d="M346.2,333.2h107.9c1.6,0,3,1.3,3,3l0,0c0,1.6-1.4,3-3,3H346.2c-1.6,0-3-1.4-3-3l0,0
		C343.2,334.5,344.6,333.2,346.2,333.2z"/>
	<path class="st4" d="M345.2,355.3h107.9c1.6,0,3,1.3,3,3l0,0c0,1.6-1.4,3-3,3H345.2c-1.6,0-3-1.4-3-3l0,0
		C342.2,356.6,343.6,355.3,345.2,355.3z"/>
	<path class="st4" d="M346.2,387.4h48.9c1.6,0,3,1.3,3,3l0,0c0,1.6-1.4,3-3,3h-48.9c-1.6,0-3-1.4-3-3l0,0
		C343.2,388.7,344.6,387.4,346.2,387.4z"/>
	<path class="st6" d="M172.3,306.4H71.9c-4.9,0-8.9-4-8.9-8.9v-83.1c0-4.9,4-8.9,8.9-8.9h100.4c4.9,0,8.9,4,8.9,8.9v83.1
		C181.2,302.4,177.2,306.4,172.3,306.4z"/>
	<g class="st7">
		<g>
		</g>
		<g>
		</g>
		<g>
		</g>
		<g>
		</g>
		<g>
		</g>
		<g>
		</g>
		<g>
		</g>
		<g>
		</g>
		<g>
		</g>
		<g>
		</g>
		<g>
		</g>
		<g>
		</g>
		<g>
		</g>
		<g>
		</g>
		<g>
		</g>
	</g>
	<g class="st7">
		<path class="st8" d="M108.3,248.6c4.1,0,7.4-3.3,7.4-7.4c0-4.1-3.3-7.4-7.4-7.4s-7.4,3.3-7.4,7.4
			C100.8,245.2,104.2,248.6,108.3,248.6z M108.3,237.4c2.1,0,3.7,1.7,3.7,3.7c0,2.1-1.7,3.7-3.7,3.7c-2.1,0-3.7-1.7-3.7-3.7
			S106.2,237.4,108.3,237.4z"/>
		<path class="st8" d="M152.4,264l-18.6-18.6c-0.7-0.7-1.9-0.7-2.6,0l-10,10l2.6,2.6l8.7-8.7l16.8,16.7v8.5h-14.1l-21.8-21.8
			c-0.7-0.7-1.9-0.7-2.6,0l-16.7,16.7c-0.3,0.3-0.5,0.8-0.5,1.3v5.6c0,1,0.8,1.9,1.9,1.9h55.8c1,0,1.9-0.8,1.9-1.9v-11.2
			C152.9,264.8,152.7,264.3,152.4,264L152.4,264z M97.1,274.6v-3l14.9-14.9l17.8,17.8H97.1z"/>
	</g>
	<g class="st7">
		<path class="st9" d="M247.2,248.6c4.1,0,7.4-3.3,7.4-7.4c0-4.1-3.3-7.4-7.4-7.4c-4.1,0-7.4,3.3-7.4,7.4
			C239.7,245.2,243.1,248.6,247.2,248.6z M247.2,237.4c2.1,0,3.7,1.7,3.7,3.7c0,2.1-1.7,3.7-3.7,3.7c-2.1,0-3.7-1.7-3.7-3.7
			S245.1,237.4,247.2,237.4z"/>
		<path class="st9" d="M291.3,264l-18.6-18.6c-0.7-0.7-1.9-0.7-2.6,0l-10,10l2.6,2.6l8.7-8.7l16.8,16.7v8.5H274l-21.8-21.8
			c-0.7-0.7-1.9-0.7-2.6,0l-16.7,16.7c-0.3,0.3-0.5,0.8-0.5,1.3v5.6c0,1,0.8,1.9,1.9,1.9H290c1,0,1.9-0.8,1.9-1.9v-11.2
			C291.8,264.8,291.6,264.3,291.3,264L291.3,264z M236,274.6v-3l14.9-14.9l17.8,17.8H236z"/>
	</g>
	<path class="st6" d="M448.8,306.4H348.5c-4.9,0-8.9-4-8.9-8.9v-83.1c0-4.9,4-8.9,8.9-8.9h100.4c4.9,0,8.9,4,8.9,8.9v83.1
		C457.7,302.4,453.7,306.4,448.8,306.4z"/>
	<g class="st7">
		<path class="st8" d="M384.8,248.6c4.1,0,7.4-3.3,7.4-7.4c0-4.1-3.3-7.4-7.4-7.4s-7.4,3.3-7.4,7.4
			C377.4,245.2,380.7,248.6,384.8,248.6z M384.8,237.4c2.1,0,3.7,1.7,3.7,3.7c0,2.1-1.7,3.7-3.7,3.7s-3.7-1.7-3.7-3.7
			S382.7,237.4,384.8,237.4z"/>
		<path class="st8" d="M428.9,264l-18.6-18.6c-0.7-0.7-1.9-0.7-2.6,0l-10,10l2.6,2.6l8.7-8.7l16.8,16.7v8.5h-14.1l-21.8-21.8
			c-0.7-0.7-1.9-0.7-2.6,0l-16.7,16.7c-0.3,0.3-0.5,0.8-0.5,1.3v5.6c0,1,0.8,1.9,1.9,1.9h55.8c1,0,1.9-0.8,1.9-1.9v-11.2
			C429.5,264.8,429.3,264.3,428.9,264L428.9,264z M373.6,274.6v-3l14.9-14.9l17.8,17.8H373.6z"/>
	</g>
	<circle class="st2" cx="108.3" cy="127.2" r="38.8"/>
	<path class="st2" d="M325.8,116.1H174c-1.8,0-3.3-1.5-3.3-3.3v0c0-1.8,1.5-3.3,3.3-3.3h151.8c1.8,0,3.3,1.5,3.3,3.3v0
		C329.1,114.6,327.6,116.1,325.8,116.1z"/>
	<path class="st2" d="M415.8,139.6H174c-1.8,0-3.3-1.5-3.3-3.3l0,0c0-1.8,1.5-3.3,3.3-3.3h241.8c1.8,0,3.3,1.5,3.3,3.3l0,0
		C419.1,138.1,417.6,139.6,415.8,139.6z"/>
	<path class="st2" d="M454.4,139.6h-19.5c-1.8,0-3.3-1.5-3.3-3.3l0,0c0-1.8,1.5-3.3,3.3-3.3h19.5c1.8,0,3.3,1.5,3.3,3.3l0,0
		C457.7,138.1,456.2,139.6,454.4,139.6z"/>
</g>
<g id="Слой_2">
	<title>pie-chart111</title>
	<path class="st10" d="M57.8,21h416.1c7.1,0,12.8,5.7,12.8,12.8v416.1c0,7.1-5.7,12.8-12.8,12.8H57.8c-7.1,0-12.8-5.7-12.8-12.8
		V33.8C45,26.7,50.7,21,57.8,21z"/>
	<path class="st11" d="M57.8,21h416c7.1,0,12.9,5.8,12.9,12.9l0,0l0,0v22.7H45V33.7C45,26.7,50.7,21,57.8,21L57.8,21z"/>
	<path class="st11" d="M341.2,261.8H77.5c-3.3,0-6-2.7-6-6V104.2c0-3.3,2.7-6,6-6h263.7c3.3,0,6,2.7,6,6v151.6
		C347.2,259.1,344.5,261.8,341.2,261.8z"/>
	<path class="st12" d="M73,283.4h176c1.7,0,3,1.4,3,3l0,0c0,1.7-1.3,3-3,3H73c-1.6,0-3-1.3-3-3l0,0C70,284.7,71.3,283.4,73,283.4z"
		/>
	<path class="st13" d="M73,301.9h85c1.7,0,3,1.4,3,3l0,0c0,1.7-1.3,3-3,3H73c-1.6,0-3-1.3-3-3l0,0C70,303.2,71.3,301.9,73,301.9z"/>
	<g>
		<g>
		</g>
		<g>
		</g>
		<g>
		</g>
		<g>
		</g>
		<g>
		</g>
		<g>
		</g>
		<g>
		</g>
		<g>
		</g>
		<g>
		</g>
		<g>
		</g>
		<g>
		</g>
		<g>
		</g>
		<g>
		</g>
		<g>
		</g>
		<g>
		</g>
	</g>
	<rect x="71.5" y="224.5" class="st14" width="275.8" height="4"/>
	<path class="st15" d="M110.4,251H83.7c-1,0-1.7-0.8-1.7-1.7l0,0c0-1,0.8-1.7,1.7-1.7h26.7c1,0,1.7,0.8,1.7,1.7l0,0
		C112.1,250.2,111.3,251,110.4,251z"/>
	<path class="st15" d="M123,243.2H83.7c-1,0-1.7-0.8-1.7-1.7l0,0c0-1,0.8-1.7,1.7-1.7H123c1,0,1.7,0.8,1.7,1.7l0,0
		C124.8,242.4,124,243.2,123,243.2z"/>
	<g>
		<defs>
			<rect id="SVGID_1_" x="135" y="105.7" width="163.7" height="118.8"/>
		</defs>
		<clipPath id="SVGID_2_">
			<use xlink:href="#SVGID_1_"  style="overflow:visible;"/>
		</clipPath>
		<circle class="st16" cx="207.2" cy="193" r="58.2"/>
	</g>
	<g>
		<defs>
			<rect id="SVGID_3_" x="124.7" y="92.2" width="184.3" height="133.8"/>
		</defs>
		<clipPath id="SVGID_4_">
			<use xlink:href="#SVGID_3_"  style="overflow:visible;"/>
		</clipPath>
	</g>
	<g>
		<g>
			<g>
				<path class="st17" d="M226.9,193.5l-9.9-1.1v-5.3c3.9-2.8,6.6-7.2,7.1-12.2l4.8-7.3v-13.3l0,0c-0.2-11.8-10-21.4-21.7-21.4
					c-5.7,0-11.1,2.2-15.1,6.3c-4,4.1-6.1,9.4-6,15.2v13.2l4.2,7.3c0.5,5,3.1,9.5,7.1,12.3v5.3l-9.9,1.1c-8.6,1-15.1,8.2-15.1,16.9
					v14h5.4v-14c0-5.9,4.4-10.9,10.3-11.5l9.8-1.1c1.3,4,5,6.9,9.4,6.9c4.4,0,8.1-2.9,9.4-6.9l9.8,1.1c5.9,0.7,10.3,5.6,10.3,11.5
					v14h5.4v-14C242,201.7,235.5,194.5,226.9,193.5z M192.9,160h-1.5v-5.5l0,0c-0.1-4.3,1.5-8.3,4.5-11.3c3-3,7-4.7,11.2-4.7
					c8.9,0,16.2,7.2,16.4,16.1v5.5h-9.2c-4.4,0-8-3.6-8-8H201C201,156.3,197.4,160,192.9,160z M211.7,194.8c0,2.5-2,4.5-4.5,4.5
					s-4.5-2-4.5-4.5v-5.1c1.4,0.4,2.9,0.6,4.5,0.6c1.5,0,3-0.2,4.5-0.6V194.8z M207.2,184.9c-6.4,0-11.6-5.2-11.6-11.6V165
					c3.3-0.7,6.1-2.5,8-5.1c2.4,3.3,6.3,5.4,10.7,5.4h4.5v8C218.8,179.7,213.6,184.9,207.2,184.9z"/>
			</g>
		</g>
		<g>
			<g>
				<rect x="186.7" y="215.5" class="st17" width="5.4" height="8.9"/>
			</g>
		</g>
		<g>
			<g>
				<rect x="222.4" y="215.5" class="st17" width="5.4" height="8.9"/>
			</g>
		</g>
		<g>
		</g>
		<g>
		</g>
		<g>
		</g>
		<g>
		</g>
		<g>
		</g>
		<g>
		</g>
		<g>
		</g>
		<g>
		</g>
		<g>
		</g>
		<g>
		</g>
		<g>
		</g>
		<g>
		</g>
		<g>
		</g>
		<g>
		</g>
		<g>
		</g>
	</g>
	<path class="st18" d="M175.7,228.5h-104v-4h104c1.1,0,2,0.9,2,2l0,0C177.7,227.6,176.8,228.5,175.7,228.5z"/>
	<circle class="st9" cx="178" cy="226.5" r="3.4"/>
	<circle class="st15" cx="305" cy="244" r="6.5"/>
	<circle class="st19" cx="283" cy="244" r="6.5"/>
	<g>
		<path class="st20" d="M327.2,241.9h-1.6v-3.3h3.3v1.6h-1.6V241.9z"/>
		<path class="st20" d="M328.8,250.1h-3.3v-3.3h1.6v1.6h1.6L328.8,250.1L328.8,250.1z"/>
		<path class="st20" d="M337,241.9h-1.6v-1.6h-1.6v-1.6h3.3L337,241.9L337,241.9z"/>
		<path class="st20" d="M337,250.1h-3.3v-1.6h1.6v-1.6h1.6L337,250.1L337,250.1z"/>
	</g>
	<path class="st21" d="M459.5,159.1h-86.9c-3.1,0-5.7-2.6-5.7-5.7v-49.6c0-3.1,2.6-5.7,5.7-5.7h86.9c3.1,0,5.7,2.6,5.7,5.7v49.6
		C465.2,156.5,462.7,159.1,459.5,159.1z"/>
	<path class="st15" d="M459.5,233.5h-86.9c-3.1,0-5.7-2.6-5.7-5.7v-49.6c0-3.1,2.6-5.7,5.7-5.7h86.9c3.1,0,5.7,2.6,5.7,5.7v49.6
		C465.2,231,462.7,233.5,459.5,233.5z"/>
	<path class="st21" d="M459.5,307.9h-86.9c-3.1,0-5.7-2.6-5.7-5.7v-49.6c0-3.1,2.6-5.7,5.7-5.7h86.9c3.1,0,5.7,2.6,5.7,5.7v49.6
		C465.2,305.4,462.7,307.9,459.5,307.9z"/>
	<path class="st15" d="M459.5,382.4h-86.9c-3.1,0-5.7-2.6-5.7-5.7v-49.6c0-3.1,2.6-5.7,5.7-5.7h86.9c3.1,0,5.7,2.6,5.7,5.7v49.6
		C465.2,379.8,462.7,382.4,459.5,382.4z"/>
	<path class="st15" d="M84.6,354.6L84.6,354.6c-5,0-9.1-4.1-9.1-9.1v0c0-5,4.1-9.1,9.1-9.1h0c5,0,9.1,4.1,9.1,9.1v0
		C93.7,350.5,89.6,354.6,84.6,354.6z"/>
	<path class="st15" d="M339,349H112.8c-1.7,0-3-1.4-3-3l0,0c0-1.6,1.3-3,3-3H339c1.6,0,3,1.4,3,3l0,0C342,347.6,340.6,349,339,349z"
		/>
	<path class="st15" d="M84.6,401.2L84.6,401.2c-5,0-9.1-4.1-9.1-9.1l0,0c0-5,4.1-9.1,9.1-9.1h0c5,0,9.1,4.1,9.1,9.1l0,0
		C93.7,397.1,89.6,401.2,84.6,401.2z"/>
	<path class="st15" d="M306,395.7H112.8c-1.7,0-3-1.3-3-3l0,0c0-1.6,1.3-3,3-3H306c1.6,0,3,1.4,3,3l0,0
		C309,394.3,307.6,395.7,306,395.7z"/>
	<path class="st15" d="M450.7,445.8H84.3c-6.9,0-12.6-5.7-12.6-12.6v0c0-6.9,5.7-12.6,12.6-12.6h366.4c6.9,0,12.6,5.7,12.6,12.6v0
		C463.2,440.1,457.6,445.8,450.7,445.8z"/>
	<path class="st18" d="M333.1,307.9L333.1,307.9c-6.7,0-12.2-5.5-12.2-12.2v0c0-6.7,5.5-12.2,12.2-12.2h0c6.7,0,12.2,5.5,12.2,12.2
		v0C345.4,302.4,339.8,307.9,333.1,307.9z"/>
	<circle class="st22" cx="85.2" cy="433.2" r="9.6"/>
	<circle class="st23" cx="296.8" cy="296.6" r="9.2"/>
	<path class="st15" d="M261.5,81.3H75.8c-2.4,0-4.3-1.9-4.3-4.3v0c0-2.4,1.9-4.3,4.3-4.3h185.7c2.4,0,4.3,1.9,4.3,4.3v0
		C265.8,79.4,263.9,81.3,261.5,81.3z"/>
	<circle class="st15" cx="458.9" cy="77" r="4.3"/>
</g>
</svg>
