<?xml version="1.0" encoding="iso-8859-1"?>
<!-- Generator: Adobe Illustrator 19.0.0, SVG Export Plug-In . SVG Version: 6.00 Build 0)  -->
<svg version="1.1" id="Capa_1" xmlns="http://www.w3.org/2000/svg" xmlns:xlink="http://www.w3.org/1999/xlink" x="0px" y="0px"
	 viewBox="0 0 512 512" style="enable-background:new 0 0 512 512;" xml:space="preserve">
<g>
	<g>
		<g>
			<path d="M462,31h-44V10.25c0-5.51-4.49-10-10-10s-10,4.49-10,10V31h-81.5V10c0-5.51-4.49-10-10-10s-10,4.49-10,10v21h-81V10
				c0-5.51-4.49-10-10-10s-10,4.49-10,10v21h-81.41V10.25c0-5.51-4.49-10-10-10c-5.52,0-10,4.49-10,10V31H50C22.43,31,0,53.43,0,81
				v381c0,27.57,22.43,50,50,50h412c27.57,0,50-22.43,50-50V81C512,53.43,489.57,31,462,31z M492,462c0,16.542-13.458,30-30,30H50
				c-16.542,0-30-13.458-30-30V202h472V462z M492,182H20v-20h472V182z M492,142H20V81c0-16.542,13.458-30,30-30h44.09v19.25
				c0,5.51,4.48,10,10,10c5.51,0,10-4.49,10-10V51h81.41v19c0,5.51,4.49,10,10,10s10-4.49,10-10V51h81v19c0,5.51,4.49,10,10,10
				s10-4.49,10-10V51H398v19.25c0,5.51,4.49,10,10,10s10-4.49,10-10V51h44c16.542,0,30,13.458,30,30V142z"/>
			<path d="M408,100.25c-5.51,0-10,4.49-10,10s4.49,10,10,10s10-4.49,10-10S413.51,100.25,408,100.25z"/>
			<path d="M306.5,100c-5.51,0-10,4.49-10,10s4.49,10,10,10s10-4.49,10-10S312.01,100,306.5,100z"/>
			<path d="M205.5,100c-5.51,0-10,4.49-10,10s4.49,10,10,10s10-4.49,10-10S211.01,100,205.5,100z"/>
			<path d="M104.09,100.25c-5.52,0-10,4.49-10,10s4.48,10,10,10c5.51,0,10-4.49,10-10S109.6,100.25,104.09,100.25z"/>
			<path d="M56.5,273h30c5.523,0,10-4.477,10-10s-4.477-10-10-10h-30c-5.523,0-10,4.477-10,10S50.977,273,56.5,273z"/>
			<path d="M86.5,421h-30c-5.523,0-10,4.477-10,10s4.477,10,10,10h30c5.523,0,10-4.477,10-10S92.023,421,86.5,421z"/>
			<path d="M148.5,273h30c5.523,0,10-4.477,10-10s-4.477-10-10-10h-30c-5.523,0-10,4.477-10,10S142.977,273,148.5,273z"/>
			<path d="M178.5,421h-30c-5.523,0-10,4.477-10,10s4.477,10,10,10h30c5.523,0,10-4.477,10-10S184.023,421,178.5,421z"/>
			<path d="M270.5,421h-30c-5.523,0-10,4.477-10,10s4.477,10,10,10h30c5.522,0,10-4.477,10-10S276.022,421,270.5,421z"/>
			<path d="M363.5,421h-30c-5.522,0-10,4.477-10,10s4.478,10,10,10h30c5.522,0,10-4.477,10-10S369.022,421,363.5,421z"/>
			<path d="M455.5,337h-30c-5.522,0-10,4.477-10,10s4.478,10,10,10h30c5.522,0,10-4.477,10-10S461.022,337,455.5,337z"/>
			<path d="M455.5,421h-30c-5.522,0-10,4.477-10,10s4.478,10,10,10h30c5.522,0,10-4.477,10-10S461.022,421,455.5,421z"/>
			<path d="M426.357,263l-12.929,12.929c-3.904,3.905-3.905,10.237,0.001,14.143c3.748,3.748,10.296,3.846,14.143,0l12.929-12.929
				c0,0,12.915,12.915,12.929,12.929c3.769,3.769,10.264,3.877,14.143,0c3.905-3.905,3.905-10.237,0-14.143L454.643,263
				l12.929-12.929c3.905-3.905,3.905-10.237,0-14.143c-3.906-3.905-10.236-3.905-14.143,0l-12.929,12.93l-12.929-12.929
				c-3.906-3.905-10.236-3.905-14.143,0c-3.905,3.905-3.905,10.237,0,14.143L426.357,263z"/>
			<path d="M334.357,263l-12.929,12.929c-3.904,3.905-3.905,10.237,0.001,14.143c3.744,3.744,10.3,3.842,14.143,0l12.929-12.929
				c0,0,12.911,12.911,12.929,12.929c3.757,3.757,10.283,3.859,14.143,0c3.905-3.905,3.905-10.237,0-14.143L362.643,263
				l12.929-12.929c3.905-3.905,3.905-10.237,0-14.143c-3.906-3.905-10.236-3.905-14.143,0l-12.929,12.93l-12.929-12.929
				c-3.906-3.905-10.236-3.905-14.143,0c-3.905,3.905-3.905,10.237,0,14.143L334.357,263z"/>
			<path d="M241.357,263l-12.929,12.929c-3.905,3.905-3.905,10.238,0.001,14.143c3.857,3.857,10.293,3.849,14.143,0l12.929-12.929
				c0,0,12.927,12.927,12.929,12.929c3.78,3.78,10.257,3.884,14.143,0c3.905-3.905,3.905-10.237,0-14.143L269.643,263l12.929-12.929
				c3.905-3.905,3.905-10.237,0-14.143c-3.906-3.905-10.236-3.905-14.143,0l-12.929,12.93l-12.929-12.929
				c-3.905-3.905-10.237-3.905-14.143,0c-3.906,3.905-3.905,10.237,0,14.143L241.357,263z"/>
			<path d="M283.571,319.929c-3.906-3.905-10.236-3.905-14.143,0L256.5,332.858l-12.929-12.929c-3.905-3.905-10.237-3.905-14.143,0
				c-3.906,3.905-3.905,10.237,0,14.143L242.357,347l-12.929,12.929c-3.905,3.905-3.905,10.237,0,14.142
				c3.77,3.77,10.268,3.875,14.143,0l12.929-12.929c0,0,12.923,12.923,12.929,12.929c3.782,3.782,10.246,3.896,14.143,0
				c3.905-3.905,3.905-10.237,0-14.143L270.643,347l12.929-12.929C287.477,330.167,287.477,323.834,283.571,319.929z"/>
			<path d="M334.357,347l-12.929,12.929c-3.905,3.905-3.905,10.237,0.001,14.143c3.77,3.77,10.263,3.879,14.143,0l12.929-12.929
				c0,0,12.911,12.911,12.929,12.929c3.755,3.755,10.285,3.857,14.143,0c3.905-3.905,3.905-10.237,0-14.143L362.643,347
				l12.929-12.929c3.905-3.905,3.905-10.237,0-14.143c-3.906-3.905-10.236-3.905-14.143,0l-12.929,12.93l-12.929-12.929
				c-3.906-3.905-10.236-3.905-14.143,0c-3.905,3.905-3.905,10.237,0,14.143L334.357,347z"/>
			<path d="M150.357,347l-12.929,12.929c-3.904,3.905-3.905,10.237,0.001,14.143c3.756,3.756,10.285,3.857,14.143,0l12.929-12.929
				c0,0,12.914,12.914,12.929,12.929c3.754,3.754,10.285,3.858,14.143,0c3.905-3.905,3.905-10.237,0-14.143L178.643,347
				l12.929-12.929c3.905-3.905,3.905-10.237,0-14.143c-3.905-3.906-10.237-3.905-14.143,0l-12.929,12.93l-12.929-12.929
				c-3.905-3.905-10.237-3.905-14.143,0c-3.906,3.905-3.905,10.237,0,14.143L150.357,347z"/>
			<path d="M57.357,347l-12.929,12.929c-3.904,3.905-3.905,10.237,0.001,14.143c3.754,3.754,10.288,3.855,14.143,0L71.5,361.143
				c0,0,12.907,12.907,12.929,12.929c3.753,3.753,10.29,3.853,14.143,0c3.905-3.905,3.905-10.237,0-14.143L85.643,347l12.929-12.929
				c3.905-3.905,3.905-10.237,0-14.143c-3.905-3.906-10.237-3.905-14.143,0L71.5,332.858l-12.929-12.929
				c-3.905-3.905-10.237-3.905-14.143,0c-3.906,3.905-3.905,10.237,0,14.143L57.357,347z"/>
		</g>
	</g>
</g>
<g>
</g>
<g>
</g>
<g>
</g>
<g>
</g>
<g>
</g>
<g>
</g>
<g>
</g>
<g>
</g>
<g>
</g>
<g>
</g>
<g>
</g>
<g>
</g>
<g>
</g>
<g>
</g>
<g>
</g>
</svg>
