<?xml version="1.0" encoding="iso-8859-1"?>
<!-- Generator: Adobe Illustrator 19.1.0, SVG Export Plug-In . SVG Version: 6.00 Build 0)  -->
<svg version="1.1" id="Capa_1" xmlns="http://www.w3.org/2000/svg" xmlns:xlink="http://www.w3.org/1999/xlink" x="0px" y="0px"
	 viewBox="0 0 513.32 513.32" style="enable-background:new 0 0 513.32 513.32;" xml:space="preserve">
<g>
	<g>
		<g>
			<path d="M256.66,74.859C111.22,74.859,0,130.469,0,203.189v106.942c0,72.72,111.22,128.33,256.66,128.33
				s256.66-55.61,256.66-128.33V203.189C513.32,130.469,402.1,74.859,256.66,74.859L256.66,74.859z M470.543,310.131
				c0,21.388-23.527,42.777-64.165,59.887v-38.499h-42.777v51.332c-25.666,6.416-53.471,10.694-85.553,12.833v-42.777h-42.777
				v42.777c-32.082-2.139-59.887-6.416-85.553-12.833v-51.332h-42.777v38.499c-40.638-17.11-64.165-38.499-64.165-59.887V275.91
				c44.916,34.221,121.914,55.61,213.883,55.61s168.968-21.388,213.883-55.61v34.221H470.543z M256.661,288.742
				c-121.914,0-213.883-44.916-213.883-85.553s91.97-85.553,213.883-85.553s213.883,44.916,213.883,85.553
				S378.575,288.742,256.661,288.742z"/>
			<path d="M121.914,181.801l29.944,29.944c19.249-12.833,53.471-29.944,104.803-29.944c49.193,0,85.553,17.11,104.803,29.944
				l29.944-29.944c-21.388-14.972-68.443-42.777-134.746-42.777C188.217,139.024,143.302,164.69,121.914,181.801L121.914,181.801z"
				/>
		</g>
	</g>
</g>
<g>
</g>
<g>
</g>
<g>
</g>
<g>
</g>
<g>
</g>
<g>
</g>
<g>
</g>
<g>
</g>
<g>
</g>
<g>
</g>
<g>
</g>
<g>
</g>
<g>
</g>
<g>
</g>
<g>
</g>
</svg>
