<?xml version="1.0"?>
<svg xmlns="http://www.w3.org/2000/svg" xmlns:xlink="http://www.w3.org/1999/xlink" version="1.1" id="Capa_1" x="0px" y="0px" width="512px" height="512px" viewBox="0 0 607.764 607.764" style="enable-background:new 0 0 607.764 607.764;" xml:space="preserve" class=""><g><g>
	<g>
		<path d="M333.927,366.825c-49.027,15.711-102.5-5.691-127.133-50.879l-2.223-4.072l-41.401,21.807l2.257,4.184    c35.219,65.264,112.092,96.189,182.788,73.535c81.018-25.961,125.813-112.995,99.852-194.018l-1.435-4.48l-44.576,14.281    l1.435,4.48C421.572,288.106,390.365,348.737,333.927,366.825z" data-original="#000000" class="active-path" data-old_color="#ffffff" fill="#ffffff"/>
		<path d="M143.174,346.614l-43.385,19.234l2.243,4.424c12.178,24.02,28.262,45.445,47.798,63.662    c92.379,86.152,237.628,81.09,323.782-11.293c86.153-92.385,81.09-237.629-11.293-323.782l-3.443-3.208l-31.924,34.229    l3.442,3.208c73.507,68.554,77.537,184.122,8.984,257.624c-68.554,73.506-184.122,77.537-257.624,8.984    c-14.703-13.713-27.005-30.238-36.558-49.104L143.174,346.614z" data-original="#000000" class="active-path" data-old_color="#ffffff" fill="#ffffff"/>
		<path d="M560.955,270.64c0,141.75-115.323,257.074-257.073,257.074S46.808,412.39,46.808,270.64    c0-79.618,36.505-153.244,98.723-201.917l-30.877-35.482C42.29,90.664,0,177.057,0,270.64    c0,167.564,136.318,303.882,303.882,303.882c167.563,0,303.882-136.318,303.882-303.882v-4.705h-46.809V270.64z" data-original="#000000" class="active-path" data-old_color="#ffffff" fill="#ffffff"/>
	</g>
</g></g> </svg>
