<?xml version="1.0" encoding="UTF-8" standalone="no"?>
<svg
   xmlns:dc="http://purl.org/dc/elements/1.1/"
   xmlns:cc="http://creativecommons.org/ns#"
   xmlns:rdf="http://www.w3.org/1999/02/22-rdf-syntax-ns#"
   xmlns:svg="http://www.w3.org/2000/svg"
   xmlns="http://www.w3.org/2000/svg"
   xmlns:sodipodi="http://sodipodi.sourceforge.net/DTD/sodipodi-0.dtd"
   xmlns:inkscape="http://www.inkscape.org/namespaces/inkscape"
   version="1.1"
   id="Слой_1"
   x="0px"
   y="0px"
   viewBox="0 0 368 287.79999"
   xml:space="preserve"
   sodipodi:docname="stats.svg"
   width="368"
   height="287.79999"
   inkscape:version="1.0.1 (3bc2e813f5, 2020-09-07)"><metadata
   id="metadata25"><rdf:RDF><cc:Work
       rdf:about=""><dc:format>image/svg+xml</dc:format><dc:type
         rdf:resource="http://purl.org/dc/dcmitype/StillImage" /></cc:Work></rdf:RDF></metadata><defs
   id="defs23" /><sodipodi:namedview
   pagecolor="#ffffff"
   bordercolor="#666666"
   borderopacity="1"
   objecttolerance="10"
   gridtolerance="10"
   guidetolerance="10"
   inkscape:pageopacity="0"
   inkscape:pageshadow="2"
   inkscape:window-width="1920"
   inkscape:window-height="1026"
   id="namedview21"
   showgrid="false"
   inkscape:zoom="1.6855469"
   inkscape:cx="162.2"
   inkscape:cy="125.6"
   inkscape:window-x="0"
   inkscape:window-y="26"
   inkscape:window-maximized="1"
   inkscape:current-layer="Слой_1" />
<style
   type="text/css"
   id="style2">
	.st0{stroke:#000000;stroke-width:21;stroke-miterlimit:10;}
</style>
<g
   id="g18"
   transform="translate(-93.8,-130.4)">
	<g
   id="g16">
		<g
   id="g14">
			<path
   class="st0"
   d="M 215.5,391.3 V 157.2 c 0,-9.1 -7.1,-16.3 -16.3,-16.3 -9.2,0 -16.2,7.1 -16.2,16.3 v 234.2 c 0,9.1 7.1,16.3 16.3,16.3 9.2,0 16.2,-7.2 16.2,-16.4 z"
   id="path4" />
			<path
   class="st0"
   d="M 136.9,391.3 V 157.2 c 0,-9.1 -7.1,-16.3 -16.3,-16.3 -9.2,0 -16.3,7.1 -16.3,16.3 v 234.2 c 0,9.1 7.1,16.3 16.3,16.3 9.2,0 16.3,-7.2 16.3,-16.4 z"
   id="path6" />
			<path
   class="st0"
   d="M 372.7,391.3 V 157.2 c 0,-9.1 -7.1,-16.3 -16.3,-16.3 -9.2,0 -16.3,7.1 -16.3,16.3 v 234.2 c 0,9.1 7.1,16.3 16.3,16.3 9.2,0 16.3,-7.2 16.3,-16.4 z"
   id="path8" />
			<path
   class="st0"
   d="m 451.3,391.3 v -117 c 0,-9.1 -7.1,-16.3 -16.3,-16.3 -9.1,0 -16.3,7.1 -16.3,16.3 v 117.1 c 0,9.1 7.1,16.3 16.3,16.3 9.2,0 16.3,-7.2 16.3,-16.4 z"
   id="path10" />
			<path
   class="st0"
   d="m 294.1,391.3 v -117 c 0,-9.1 -7.1,-16.3 -16.3,-16.3 -9.2,0 -16.3,7.1 -16.3,16.3 v 117.1 c 0,9.1 7.1,16.3 16.3,16.3 9.2,0 16.3,-7.2 16.3,-16.4 z"
   id="path12" />
		</g>
	</g>
</g>
</svg>
