<?xml version="1.0"?>
<svg xmlns="http://www.w3.org/2000/svg" xmlns:xlink="http://www.w3.org/1999/xlink" version="1.1" id="Capa_1" x="0px" y="0px" viewBox="0 0 495.045 495.045" style="enable-background:new 0 0 495.045 495.045;" xml:space="preserve" width="512px" height="512px"><g><g>
	<g id="Icons_23_">
		<g>
			<path d="M483.01,119.27c5.736-9.281,9.287-19.974,9.287-32.665C492.297,8.436,367.816,0,314.3,0     c-53.526,0-177.992,8.437-177.992,86.605c0,12.691,3.55,23.384,9.27,32.665c-5.816,9.27-9.27,20.058-9.27,32.806     c0,8.958,1.822,16.876,4.893,24.047c1.597-0.039,3.147-0.241,4.762-0.241c53.32,0,101.08,23.929,133.367,61.506     c13.139,0.935,25.284,1.303,34.97,1.303c31.617,0,87.911-3.077,128.767-21.633c0,20.724-57.59,37.999-128.767,37.999     c-7.479,0-14.769-0.224-21.914-0.581c10.055,15.081,17.727,31.823,22.778,49.678c31.751-0.058,87.315-3.218,127.811-21.579     c-0.189,20.222-55.141,37.17-124.037,37.889c1.853,10.199,2.972,20.645,2.972,31.367c0,5.985-0.32,11.893-0.895,17.726     c56.439-0.71,171.282-11.395,171.282-86.543c0-12.746-3.453-23.536-9.287-32.806c5.736-9.278,9.287-19.97,9.287-32.662     c0-12.754-3.453-23.56-9.256-32.846c5.705-9.273,9.256-19.948,9.256-32.623C492.296,139.328,488.844,128.54,483.01,119.27z      M314.3,189.587c-96.249,0-129.951-30.943-128.777-37.993c21.065,11.156,97.13,21.627,128.777,21.627     c31.617,0,90.867-5.077,128.767-21.627C443.264,165.11,396.063,189.587,314.3,189.587z M314.3,124.12     c-71.19,0-128.891-16.791-128.891-37.515c0-20.715,57.701-37.504,128.891-37.504c71.177,0,128.894,16.789,128.894,37.504     C443.194,107.329,385.477,124.12,314.3,124.12z" data-original="#000000" class="active-path" data-old_color="#ffffff" fill="#ffffff"/>
			<path d="M145.962,208.618c-78.976,0-143.215,64.247-143.215,143.212c0,78.967,64.239,143.215,143.215,143.215     c78.958,0,143.212-64.248,143.212-143.215C289.174,272.865,224.921,208.618,145.962,208.618z M145.962,445.942     c-51.901,0-94.113-42.22-94.113-94.112c0-51.89,42.212-94.11,94.113-94.11c51.881,0,94.11,42.221,94.11,94.11     C240.072,403.722,197.843,445.942,145.962,445.942z" data-original="#000000" class="active-path" data-old_color="#ffffff" fill="#ffffff"/>
			<path d="M156.798,335.296c-13.635-5.132-15.664-7.417-15.664-8.33c0-2.875,6.601-3.02,7.927-3.02     c4.573,0,8.856,0.632,13.109,1.935c3.85,1.177,8.15,0.712,11.667-1.255c3.549-1.983,6.17-5.38,7.337-9.91     c2.125-8.312-2.878-16.854-11.173-19.043c-3.165-0.833-6.584-1.457-10.23-1.864v-0.703c0-7.807-6.329-14.153-14.145-14.153     c-7.816,0-14.146,6.347-14.146,14.153v2.718c-17.196,5.051-27.65,17.703-27.65,33.925c0,21.905,19.179,30.897,33.613,35.756     c13.171,4.444,13.171,7.225,13.171,8.417c0,3.155-6.012,4.002-9.575,4.002c-5.402,0-10.933-0.999-16.463-2.972     c-3.836-1.385-8.216-1.064-11.796,0.848c-3.643,1.924-6.33,5.321-7.672,10.588c-2.077,8.153,2.558,16.544,10.582,19.125     c4.651,1.479,9.813,2.572,14.96,3.173v1.878c0,7.808,6.346,14.154,14.163,14.154c7.799,0,14.146-6.347,14.146-14.154v-3.757     c17.853-4.906,29.12-18.284,29.12-35.18C188.078,354.133,178.391,342.919,156.798,335.296z" data-original="#000000" class="active-path" data-old_color="#ffffff" fill="#ffffff"/>
		</g>
	</g>
</g></g> </svg>
