<?xml version="1.0" encoding="utf-8"?>
<!-- Generator: Adobe Illustrator 21.0.0, SVG Export Plug-In . SVG Version: 6.00 Build 0)  -->
<svg version="1.1" id="Capa_1" xmlns="http://www.w3.org/2000/svg" xmlns:xlink="http://www.w3.org/1999/xlink" x="0px" y="0px"
	 viewBox="0 0 512 512" style="enable-background:new 0 0 512 512;" xml:space="preserve">
<style type="text/css">
	.st0{fill:#2450D0;}
</style>
<path class="st0" d="M0,347h512v45H0V347z"/>
<path class="st0" d="M0,15h512v302H0V15z"/>
<path class="st0" d="M177.7,422l-4.2,20.9c-2.8,14-15.2,24.1-29.4,24.1H60v30h392v-30h-84.1c-14.3,0-26.6-10.1-29.4-24.1l-4.2-20.9
	H177.7z"/>
</svg>
